{"text_format":"1","workbook":"xlsx","n_sheets":4,"sheets":["Data Input","YNR","Moonraker","Classes"],"not_rendered":{"charts":0,"images":0,"macros":1,"external_links":0,"defined_names":6,"comments":0,"pivot_tables":0},"unopened":[],"bounds":{"document_bytes":16777216,"sheet_cells":100000,"rows_first":2000,"rows_last":500,"rows_between":2000,"halvings":0,"cell_chars":16384,"cell_head_chars":4096},"cells_cut":0,"cells_raw":0,"read":"whole","date_system":"1900"}

{"sheet":"Data Input","index":0,"n_rows":34,"n_cols":50,"rows_kept":34,"cut":false,"hidden":false,"merged":[]}
["No","Yacht","Skipper","Length","H/C","P","Class",null,"Start",null,null,"Out 1",null,null,"In 1",null,null,"Out 2",null,null,"In 2",null,null,"Finish",null,null,null,"Elapsed",null,null,"Pos",null,null,"Corrected",null,null,"Pos",null,"Bridge1","Bridge 2","Bridge T","T","T-B elapsed","Corr"]
[null,null,null,null,null,null,null,"H","M","S","H","M","S","H","M","S","H","M","S","H","M","S","H","M","S",null,"H","M","S",null,null," ","H","M","S",null,null," ","Seconds","Seconds","Seconds","Seconds","Seconds","Seconds"]
[7,"Forester","S  Bentall",32.5,-8,"",{"$f":"IF(D3=\"\",\"\",IF(D3<25,\"C\",IF(D3<28.01,\"B\",\"A\")))","v":"A"},8,30,0,10,26,1,10,36,45,12,49,28,12,54,40,14,38,43,null,{"$f":"INT(AQ3/3600)","v":5},{"$f":"INT((AQ3-AA3*3600)/60)","v":52},{"$f":"AQ3-(AA3*3600+AB3*60)","v":47},null,{"$f":"+AT3","v":10},null,{"$f":"INT(AR3/3600)","v":5},{"$f":"INT((AR3-AG3*3600)/60)","v":24},{"$f":"AR3-(AG3*3600+AH3*60)","v":33.639999999999418},null,{"$f":"+AW3","v":2},null,{"$f":"(P3+O3*60+N3*3600)-(M3+L3*60+K3*3600)","v":644},{"$f":"(V3+U3*60+T3*3600)-(S3+R3*60+Q3*3600)","v":312},{"$f":"AM3+AN3","v":956},{"$f":"(Y3+X3*60+W3*3600)-(J3+I3*60+H3*3600)","v":22123},{"$f":"ABS(AP3-AO3)","v":21167},{"$f":"AQ3*(0.01*(100+E3))","v":19473.64},{"$f":"+IF(F3=\"\",AQ3,500000)","v":21167},{"$f":"IF(F3=\"\",+RANK(AS3,$AS$3:$AS$32,1),+F3)","v":10},{"$f":"+IF(AT3<4,\"Trophy\",\"\")","v":""},{"$f":"+IF(F3=\"\",AR3,500000)","v":19473.64},{"$f":"IF(F3=\"\",+RANK(AV3,$AV$3:$AV$32,1),+F3)","v":2},{"$f":"+IF(AW3<4,\"Trophy\",\"\")","v":"Trophy"}]
[15,"Pirate","T Moore",30,-7,"","A",7,30,0,9,44,11,9,52,22,12,7,2,12,34,15,14,27,5,null,6,21,41,null,19,null,5,54,57.930000000000291,null,18,null,491,1633,2124,25025,22901,21297.93,{"$f":"+IF(F4=\"\",AQ4,500000)","v":22901},{"$f":"IF(F4=\"\",+RANK(AS4,$AS$3:$AS$32,1),+F4)","v":19},"",{"$f":"+IF(F4=\"\",AR4,500000)","v":21297.93},18,""]
[22,"Moonraker","P Jeckells",29.5,2,"","A",9,30,0,11,29,52,11,35,8,13,41,41,13,46,15,15,27,35,null,5,47,45,null,9,null,5,54,42.299999999999272,null,17,null,316,274,590,21455,20865,21282.3,20865,9,"",21282.3,17,""]
[24,"Pippa","G Angell",27.5,-7,"","B",8,0,0,10,7,1,10,40,53,12,58,7,13,26,53,15,17,12,null,6,14,34,null,15,null,5,48,20.819999999999709,null,13,null,2032,1726,3758,26232,22474,20900.82,22474,15,"",20900.82,13,""]
[52,"Maidie","M Barnes",43.2,12,"","A",7,30,0,9,8,19,9,23,50,11,9,34,11,25,36,13,2,59,null,5,1,26,null,{"$f":"+AT7","v":1},null,5,37,36.320000000003347,null,4,null,931,962,1893,19979,18086,20256.320000000003,18086,1,"Trophy",20256.320000000003,4,""]
[78,"Halcyon","R Wilson",29.5,-7,"DNS","A"," "," "," ",null,null,null,null,null,null,null,null,null,null,null,null,null,null,null,null,{"$error":"#VALUE!"},{"$error":"#VALUE!"},{"$error":"#VALUE!"},null,"DNS",null,{"$error":"#VALUE!"},{"$error":"#VALUE!"},{"$error":"#VALUE!"},null,"DNS",null,0,0,0,{"$error":"#VALUE!"},{"$error":"#VALUE!"},{"$error":"#VALUE!"},500000,"DNS","",500000,"DNS",""]
[87,"Modwena","M Cassidy",24.8,-18,"","C",7,15,0,9,45,27,9,53,10,12,25,47,12,36,54,14,47,4,null,7,13,14,null,22,null,5,55,15.080000000001746,null,19,null,463,667,1130,27124,25994,21315.08,25994,22,"",21315.08,19,""]
[117,"Anne","D Church",34.5,-3,"","A",8,0,0,10,10,59,10,44,32,13,2,8,13,31,15,15,17,30,null,6,14,50,null,16,null,6,3,35.299999999999272,null,21,null,2013,1747,3760,26250,22490,21815.3,22490,16,"",21815.3,21,""]
{"$rows_left_out":25}
{"sheet":"YNR","index":1,"n_rows":49,"n_cols":12,"rows_kept":49,"cut":false,"hidden":false,"merged":[]}
[null,null,null,null,null,null,null,null,"Corrected"]
["No","Yacht","Skipper","Length","H/C","P","Class","H","M","S",null,"Pos"]
[177,{"$f":"+VLOOKUP(+$A3,'Data Input'!$A$3:$AX$32,2,FALSE)","v":"Breeze"},{"$f":"+VLOOKUP(+$A3,'Data Input'!$A$3:$AX$32,3,FALSE)","v":"M Ellis"},{"$f":"+VLOOKUP(+$A3,'Data Input'!$A$3:$AX$32,4,FALSE)","v":32},{"$f":"+VLOOKUP(+$A3,'Data Input'!$A$3:$AX$32,5,FALSE)","v":2},{"$f":"+VLOOKUP(+$A3,'Data Input'!$A$3:$AX$32,6,FALSE)","v":""},{"$f":"+VLOOKUP(+$A3,'Data Input'!$A$3:$AX$32,7,FALSE)","v":"A"},{"$f":"+VLOOKUP($A3,'Data Input'!$A$3:$AX$32,33,FALSE)","v":5},{"$f":"+VLOOKUP($A3,'Data Input'!$A$3:$AX$32,34,FALSE)","v":23},{"$f":"+VLOOKUP($A3,'Data Input'!$A$3:$AX$32,35,FALSE)","v":49.979999999999563},null,{"$f":"+VLOOKUP($A3,'Data Input'!$A$3:$AX$32,37,FALSE)","v":1}]
[7,{"$f":"+VLOOKUP(+$A4,'Data Input'!$A$3:$AX$32,2,FALSE)","v":"Forester"},{"$f":"+VLOOKUP(+$A4,'Data Input'!$A$3:$AX$32,3,FALSE)","v":"S  Bentall"},{"$f":"+VLOOKUP(+$A4,'Data Input'!$A$3:$AX$32,4,FALSE)","v":32.5},{"$f":"+VLOOKUP(+$A4,'Data Input'!$A$3:$AX$32,5,FALSE)","v":-8},{"$f":"+VLOOKUP(+$A4,'Data Input'!$A$3:$AX$32,6,FALSE)","v":""},{"$f":"+VLOOKUP(+$A4,'Data Input'!$A$3:$AX$32,7,FALSE)","v":"A"},{"$f":"+VLOOKUP($A4,'Data Input'!$A$3:$AX$32,33,FALSE)","v":5},{"$f":"+VLOOKUP($A4,'Data Input'!$A$3:$AX$32,34,FALSE)","v":24},{"$f":"+VLOOKUP($A4,'Data Input'!$A$3:$AX$32,35,FALSE)","v":33.639999999999418},null,{"$f":"+VLOOKUP($A4,'Data Input'!$A$3:$AX$32,37,FALSE)","v":2}]
[199,{"$f":"+VLOOKUP(+$A5,'Data Input'!$A$3:$AX$32,2,FALSE)","v":"Morning Calm"},{"$f":"+VLOOKUP(+$A5,'Data Input'!$A$3:$AX$32,3,FALSE)","v":"W Clark"},{"$f":"+VLOOKUP(+$A5,'Data Input'!$A$3:$AX$32,4,FALSE)","v":26},{"$f":"+VLOOKUP(+$A5,'Data Input'!$A$3:$AX$32,5,FALSE)","v":-9},{"$f":"+VLOOKUP(+$A5,'Data Input'!$A$3:$AX$32,6,FALSE)","v":""},{"$f":"+VLOOKUP(+$A5,'Data Input'!$A$3:$AX$32,7,FALSE)","v":"B"},{"$f":"+VLOOKUP($A5,'Data Input'!$A$3:$AX$32,33,FALSE)","v":5},{"$f":"+VLOOKUP($A5,'Data Input'!$A$3:$AX$32,34,FALSE)","v":37},{"$f":"+VLOOKUP($A5,'Data Input'!$A$3:$AX$32,35,FALSE)","v":29.319999999999709},null,{"$f":"+VLOOKUP($A5,'Data Input'!$A$3:$AX$32,37,FALSE)","v":3}]
[52,{"$f":"+VLOOKUP(+$A6,'Data Input'!$A$3:$AX$32,2,FALSE)","v":"Maidie"},{"$f":"+VLOOKUP(+$A6,'Data Input'!$A$3:$AX$32,3,FALSE)","v":"M Barnes"},{"$f":"+VLOOKUP(+$A6,'Data Input'!$A$3:$AX$32,4,FALSE)","v":43.2},{"$f":"+VLOOKUP(+$A6,'Data Input'!$A$3:$AX$32,5,FALSE)","v":12},{"$f":"+VLOOKUP(+$A6,'Data Input'!$A$3:$AX$32,6,FALSE)","v":""},{"$f":"+VLOOKUP(+$A6,'Data Input'!$A$3:$AX$32,7,FALSE)","v":"A"},{"$f":"+VLOOKUP($A6,'Data Input'!$A$3:$AX$32,33,FALSE)","v":5},{"$f":"+VLOOKUP($A6,'Data Input'!$A$3:$AX$32,34,FALSE)","v":37},{"$f":"+VLOOKUP($A6,'Data Input'!$A$3:$AX$32,35,FALSE)","v":36.320000000003347},null,{"$f":"+VLOOKUP($A6,'Data Input'!$A$3:$AX$32,37,FALSE)","v":4}]
[244,{"$f":"+VLOOKUP(+$A7,'Data Input'!$A$3:$AX$32,2,FALSE)","v":"Catspaw"},{"$f":"+VLOOKUP(+$A7,'Data Input'!$A$3:$AX$32,3,FALSE)","v":"B Wilkins"},{"$f":"+VLOOKUP(+$A7,'Data Input'!$A$3:$AX$32,4,FALSE)","v":28},{"$f":"+VLOOKUP(+$A7,'Data Input'!$A$3:$AX$32,5,FALSE)","v":-5},{"$f":"+VLOOKUP(+$A7,'Data Input'!$A$3:$AX$32,6,FALSE)","v":""},{"$f":"+VLOOKUP(+$A7,'Data Input'!$A$3:$AX$32,7,FALSE)","v":"B"},{"$f":"+VLOOKUP($A7,'Data Input'!$A$3:$AX$32,33,FALSE)","v":5},{"$f":"+VLOOKUP($A7,'Data Input'!$A$3:$AX$32,34,FALSE)","v":39},{"$f":"+VLOOKUP($A7,'Data Input'!$A$3:$AX$32,35,FALSE)","v":33.700000000000728},null,{"$f":"+VLOOKUP($A7,'Data Input'!$A$3:$AX$32,37,FALSE)","v":5}]
[335,{"$f":"+VLOOKUP(+$A8,'Data Input'!$A$3:$AX$32,2,FALSE)","v":"Firebird"},{"$f":"+VLOOKUP(+$A8,'Data Input'!$A$3:$AX$32,3,FALSE)","v":"R Richardson"},{"$f":"+VLOOKUP(+$A8,'Data Input'!$A$3:$AX$32,4,FALSE)","v":30},{"$f":"+VLOOKUP(+$A8,'Data Input'!$A$3:$AX$32,5,FALSE)","v":1},{"$f":"+VLOOKUP(+$A8,'Data Input'!$A$3:$AX$32,6,FALSE)","v":""},{"$f":"+VLOOKUP(+$A8,'Data Input'!$A$3:$AX$32,7,FALSE)","v":"A"},{"$f":"+VLOOKUP($A8,'Data Input'!$A$3:$AX$32,33,FALSE)","v":5},{"$f":"+VLOOKUP($A8,'Data Input'!$A$3:$AX$32,34,FALSE)","v":39},{"$f":"+VLOOKUP($A8,'Data Input'!$A$3:$AX$32,35,FALSE)","v":38.770000000000437},null,{"$f":"+VLOOKUP($A8,'Data Input'!$A$3:$AX$32,37,FALSE)","v":6}]
[368,{"$f":"+VLOOKUP(+$A9,'Data Input'!$A$3:$AX$32,2,FALSE)","v":"Wandering Rose"},{"$f":"+VLOOKUP(+$A9,'Data Input'!$A$3:$AX$32,3,FALSE)","v":"  Radley"},{"$f":"+VLOOKUP(+$A9,'Data Input'!$A$3:$AX$32,4,FALSE)","v":31},{"$f":"+VLOOKUP(+$A9,'Data Input'!$A$3:$AX$32,5,FALSE)","v":-2},{"$f":"+VLOOKUP(+$A9,'Data Input'!$A$3:$AX$32,6,FALSE)","v":""},{"$f":"+VLOOKUP(+$A9,'Data Input'!$A$3:$AX$32,7,FALSE)","v":"A"},{"$f":"+VLOOKUP($A9,'Data Input'!$A$3:$AX$32,33,FALSE)","v":5},{"$f":"+VLOOKUP($A9,'Data Input'!$A$3:$AX$32,34,FALSE)","v":39},{"$f":"+VLOOKUP($A9,'Data Input'!$A$3:$AX$32,35,FALSE)","v":46.93999999999869},null,{"$f":"+VLOOKUP($A9,'Data Input'!$A$3:$AX$32,37,FALSE)","v":7}]
[369,{"$f":"+VLOOKUP(+$A10,'Data Input'!$A$3:$AX$32,2,FALSE)","v":"Moonshadow"},{"$f":"+VLOOKUP(+$A10,'Data Input'!$A$3:$AX$32,3,FALSE)","v":"N Hovey"},{"$f":"+VLOOKUP(+$A10,'Data Input'!$A$3:$AX$32,4,FALSE)","v":31.5},{"$f":"+VLOOKUP(+$A10,'Data Input'!$A$3:$AX$32,5,FALSE)","v":4},{"$f":"+VLOOKUP(+$A10,'Data Input'!$A$3:$AX$32,6,FALSE)","v":""},{"$f":"+VLOOKUP(+$A10,'Data Input'!$A$3:$AX$32,7,FALSE)","v":"A"},{"$f":"+VLOOKUP($A10,'Data Input'!$A$3:$AX$32,33,FALSE)","v":5},{"$f":"+VLOOKUP($A10,'Data Input'!$A$3:$AX$32,34,FALSE)","v":42},{"$f":"+VLOOKUP($A10,'Data Input'!$A$3:$AX$32,35,FALSE)","v":21.040000000000873},null,{"$f":"+VLOOKUP($A10,'Data Input'!$A$3:$AX$32,37,FALSE)","v":8}]
{"$rows_left_out":40}
{"sheet":"Moonraker","index":2,"n_rows":49,"n_cols":13,"rows_kept":49,"cut":false,"hidden":false,"merged":[]}
["No","Yacht","Skipper","Length","H/C","P","Class",null,"Elapsed",null,null,"Pos"]
[null,null,null,null,null,null,null,"H","M","S",null,null," "]
[52,{"$f":"+VLOOKUP(+$A3,'Data Input'!$A$3:$AX$32,2,FALSE)","v":"Maidie"},{"$f":"+VLOOKUP(+$A3,'Data Input'!$A$3:$AX$32,3,FALSE)","v":"M Barnes"},{"$f":"+VLOOKUP(+$A3,'Data Input'!$A$3:$AX$32,4,FALSE)","v":43.2},{"$f":"+VLOOKUP(+$A3,'Data Input'!$A$3:$AX$32,5,FALSE)","v":12},{"$f":"+VLOOKUP(+$A3,'Data Input'!$A$3:$AX$32,6,FALSE)","v":""},{"$f":"+VLOOKUP(+$A3,'Data Input'!$A$3:$AX$32,7,FALSE)","v":"A"},{"$f":"+VLOOKUP($A3,'Data Input'!$A$3:$AX$32,27,FALSE)","v":5},{"$f":"+VLOOKUP($A3,'Data Input'!$A$3:$AX$32,28,FALSE)","v":1},{"$f":"+VLOOKUP($A3,'Data Input'!$A$3:$AX$32,29,FALSE)","v":26},null,{"$f":"+VLOOKUP($A3,'Data Input'!$A$3:$AX$32,31,FALSE)","v":1}]
[417,{"$f":"+VLOOKUP(+$A4,'Data Input'!$A$3:$AX$32,2,FALSE)","v":"Stellar"},{"$f":"+VLOOKUP(+$A4,'Data Input'!$A$3:$AX$32,3,FALSE)","v":"T Frary"},{"$f":"+VLOOKUP(+$A4,'Data Input'!$A$3:$AX$32,4,FALSE)","v":31.3},{"$f":"+VLOOKUP(+$A4,'Data Input'!$A$3:$AX$32,5,FALSE)","v":16},{"$f":"+VLOOKUP(+$A4,'Data Input'!$A$3:$AX$32,6,FALSE)","v":""},{"$f":"+VLOOKUP(+$A4,'Data Input'!$A$3:$AX$32,7,FALSE)","v":"A"},{"$f":"+VLOOKUP($A4,'Data Input'!$A$3:$AX$32,27,FALSE)","v":5},{"$f":"+VLOOKUP($A4,'Data Input'!$A$3:$AX$32,28,FALSE)","v":4},{"$f":"+VLOOKUP($A4,'Data Input'!$A$3:$AX$32,29,FALSE)","v":55},null,{"$f":"+VLOOKUP($A4,'Data Input'!$A$3:$AX$32,31,FALSE)","v":2}]
[177,{"$f":"+VLOOKUP(+$A5,'Data Input'!$A$3:$AX$32,2,FALSE)","v":"Breeze"},{"$f":"+VLOOKUP(+$A5,'Data Input'!$A$3:$AX$32,3,FALSE)","v":"M Ellis"},{"$f":"+VLOOKUP(+$A5,'Data Input'!$A$3:$AX$32,4,FALSE)","v":32},{"$f":"+VLOOKUP(+$A5,'Data Input'!$A$3:$AX$32,5,FALSE)","v":2},{"$f":"+VLOOKUP(+$A5,'Data Input'!$A$3:$AX$32,6,FALSE)","v":""},{"$f":"+VLOOKUP(+$A5,'Data Input'!$A$3:$AX$32,7,FALSE)","v":"A"},{"$f":"+VLOOKUP($A5,'Data Input'!$A$3:$AX$32,27,FALSE)","v":5},{"$f":"+VLOOKUP($A5,'Data Input'!$A$3:$AX$32,28,FALSE)","v":17},{"$f":"+VLOOKUP($A5,'Data Input'!$A$3:$AX$32,29,FALSE)","v":29},null,{"$f":"+VLOOKUP($A5,'Data Input'!$A$3:$AX$32,31,FALSE)","v":3}]
[373,{"$f":"+VLOOKUP(+$A6,'Data Input'!$A$3:$AX$32,2,FALSE)","v":"Meggie"},{"$f":"+VLOOKUP(+$A6,'Data Input'!$A$3:$AX$32,3,FALSE)","v":"J Tansley"},{"$f":"+VLOOKUP(+$A6,'Data Input'!$A$3:$AX$32,4,FALSE)","v":34.9},{"$f":"+VLOOKUP(+$A6,'Data Input'!$A$3:$AX$32,5,FALSE)","v":16},{"$f":"+VLOOKUP(+$A6,'Data Input'!$A$3:$AX$32,6,FALSE)","v":""},{"$f":"+VLOOKUP(+$A6,'Data Input'!$A$3:$AX$32,7,FALSE)","v":"A"},{"$f":"+VLOOKUP($A6,'Data Input'!$A$3:$AX$32,27,FALSE)","v":5},{"$f":"+VLOOKUP($A6,'Data Input'!$A$3:$AX$32,28,FALSE)","v":28},{"$f":"+VLOOKUP($A6,'Data Input'!$A$3:$AX$32,29,FALSE)","v":45},null,{"$f":"+VLOOKUP($A6,'Data Input'!$A$3:$AX$32,31,FALSE)","v":4}]
[369,{"$f":"+VLOOKUP(+$A7,'Data Input'!$A$3:$AX$32,2,FALSE)","v":"Moonshadow"},{"$f":"+VLOOKUP(+$A7,'Data Input'!$A$3:$AX$32,3,FALSE)","v":"N Hovey"},{"$f":"+VLOOKUP(+$A7,'Data Input'!$A$3:$AX$32,4,FALSE)","v":31.5},{"$f":"+VLOOKUP(+$A7,'Data Input'!$A$3:$AX$32,5,FALSE)","v":4},{"$f":"+VLOOKUP(+$A7,'Data Input'!$A$3:$AX$32,6,FALSE)","v":""},{"$f":"+VLOOKUP(+$A7,'Data Input'!$A$3:$AX$32,7,FALSE)","v":"A"},{"$f":"+VLOOKUP($A7,'Data Input'!$A$3:$AX$32,27,FALSE)","v":5},{"$f":"+VLOOKUP($A7,'Data Input'!$A$3:$AX$32,28,FALSE)","v":29},{"$f":"+VLOOKUP($A7,'Data Input'!$A$3:$AX$32,29,FALSE)","v":11},null,{"$f":"+VLOOKUP($A7,'Data Input'!$A$3:$AX$32,31,FALSE)","v":5}]
[335,{"$f":"+VLOOKUP(+$A8,'Data Input'!$A$3:$AX$32,2,FALSE)","v":"Firebird"},{"$f":"+VLOOKUP(+$A8,'Data Input'!$A$3:$AX$32,3,FALSE)","v":"R Richardson"},{"$f":"+VLOOKUP(+$A8,'Data Input'!$A$3:$AX$32,4,FALSE)","v":30},{"$f":"+VLOOKUP(+$A8,'Data Input'!$A$3:$AX$32,5,FALSE)","v":1},{"$f":"+VLOOKUP(+$A8,'Data Input'!$A$3:$AX$32,6,FALSE)","v":""},{"$f":"+VLOOKUP(+$A8,'Data Input'!$A$3:$AX$32,7,FALSE)","v":"A"},{"$f":"+VLOOKUP($A8,'Data Input'!$A$3:$AX$32,27,FALSE)","v":5},{"$f":"+VLOOKUP($A8,'Data Input'!$A$3:$AX$32,28,FALSE)","v":36},{"$f":"+VLOOKUP($A8,'Data Input'!$A$3:$AX$32,29,FALSE)","v":17},null,{"$f":"+VLOOKUP($A8,'Data Input'!$A$3:$AX$32,31,FALSE)","v":6}]
[217,{"$f":"+VLOOKUP(+$A9,'Data Input'!$A$3:$AX$32,2,FALSE)","v":"Melinda"},{"$f":"+VLOOKUP(+$A9,'Data Input'!$A$3:$AX$32,3,FALSE)","v":"P Howes"},{"$f":"+VLOOKUP(+$A9,'Data Input'!$A$3:$AX$32,4,FALSE)","v":27.9},{"$f":"+VLOOKUP(+$A9,'Data Input'!$A$3:$AX$32,5,FALSE)","v":1},{"$f":"+VLOOKUP(+$A9,'Data Input'!$A$3:$AX$32,6,FALSE)","v":""},{"$f":"+VLOOKUP(+$A9,'Data Input'!$A$3:$AX$32,7,FALSE)","v":"B"},{"$f":"+VLOOKUP($A9,'Data Input'!$A$3:$AX$32,27,FALSE)","v":5},{"$f":"+VLOOKUP($A9,'Data Input'!$A$3:$AX$32,28,FALSE)","v":39},{"$f":"+VLOOKUP($A9,'Data Input'!$A$3:$AX$32,29,FALSE)","v":37},null,{"$f":"+VLOOKUP($A9,'Data Input'!$A$3:$AX$32,31,FALSE)","v":7}]
[368,{"$f":"+VLOOKUP(+$A10,'Data Input'!$A$3:$AX$32,2,FALSE)","v":"Wandering Rose"},{"$f":"+VLOOKUP(+$A10,'Data Input'!$A$3:$AX$32,3,FALSE)","v":"  Radley"},{"$f":"+VLOOKUP(+$A10,'Data Input'!$A$3:$AX$32,4,FALSE)","v":31},{"$f":"+VLOOKUP(+$A10,'Data Input'!$A$3:$AX$32,5,FALSE)","v":-2},{"$f":"+VLOOKUP(+$A10,'Data Input'!$A$3:$AX$32,6,FALSE)","v":""},{"$f":"+VLOOKUP(+$A10,'Data Input'!$A$3:$AX$32,7,FALSE)","v":"A"},{"$f":"+VLOOKUP($A10,'Data Input'!$A$3:$AX$32,27,FALSE)","v":5},{"$f":"+VLOOKUP($A10,'Data Input'!$A$3:$AX$32,28,FALSE)","v":46},{"$f":"+VLOOKUP($A10,'Data Input'!$A$3:$AX$32,29,FALSE)","v":43},null,{"$f":"+VLOOKUP($A10,'Data Input'!$A$3:$AX$32,31,FALSE)","v":8}]
{"$rows_left_out":40}
{"sheet":"Classes","index":3,"n_rows":57,"n_cols":13,"rows_kept":57,"cut":false,"hidden":false,"merged":[]}
["No","Yacht","Skipper","Length","H/C","P","Class",null,"Corrected",null,null,"Pos"]
[null,null,null,null,null,null,null,"H","M","S",null,null," "]
[null,"Starlight Lady"]
[]
[177,{"$f":"+VLOOKUP(+$A5,'Data Input'!$A$3:$AX$32,2,FALSE)","v":"Breeze"},{"$f":"+VLOOKUP(+$A5,'Data Input'!$A$3:$AX$32,3,FALSE)","v":"M Ellis"},{"$f":"+VLOOKUP(+$A5,'Data Input'!$A$3:$AX$32,4,FALSE)","v":32},{"$f":"+VLOOKUP(+$A5,'Data Input'!$A$3:$AX$32,5,FALSE)","v":2},{"$f":"+VLOOKUP(+$A5,'Data Input'!$A$3:$AX$32,6,FALSE)","v":""},{"$f":"+VLOOKUP(+$A5,'Data Input'!$A$3:$AX$32,7,FALSE)","v":"A"},{"$f":"+VLOOKUP($A5,'Data Input'!$A$3:$AX$32,33,FALSE)","v":5},{"$f":"+VLOOKUP($A5,'Data Input'!$A$3:$AX$32,34,FALSE)","v":23},{"$f":"+VLOOKUP($A5,'Data Input'!$A$3:$AX$32,35,FALSE)","v":49.979999999999563},null,{"$f":"+VLOOKUP($A5,'Data Input'!$A$3:$AX$32,37,FALSE)","v":1}]
[7,{"$f":"+VLOOKUP(+$A6,'Data Input'!$A$3:$AX$32,2,FALSE)","v":"Forester"},{"$f":"+VLOOKUP(+$A6,'Data Input'!$A$3:$AX$32,3,FALSE)","v":"S  Bentall"},{"$f":"+VLOOKUP(+$A6,'Data Input'!$A$3:$AX$32,4,FALSE)","v":32.5},{"$f":"+VLOOKUP(+$A6,'Data Input'!$A$3:$AX$32,5,FALSE)","v":-8},{"$f":"+VLOOKUP(+$A6,'Data Input'!$A$3:$AX$32,6,FALSE)","v":""},{"$f":"+VLOOKUP(+$A6,'Data Input'!$A$3:$AX$32,7,FALSE)","v":"A"},{"$f":"+VLOOKUP($A6,'Data Input'!$A$3:$AX$32,33,FALSE)","v":5},{"$f":"+VLOOKUP($A6,'Data Input'!$A$3:$AX$32,34,FALSE)","v":24},{"$f":"+VLOOKUP($A6,'Data Input'!$A$3:$AX$32,35,FALSE)","v":33.639999999999418},null,2]
[52,{"$f":"+VLOOKUP(+$A7,'Data Input'!$A$3:$AX$32,2,FALSE)","v":"Maidie"},{"$f":"+VLOOKUP(+$A7,'Data Input'!$A$3:$AX$32,3,FALSE)","v":"M Barnes"},{"$f":"+VLOOKUP(+$A7,'Data Input'!$A$3:$AX$32,4,FALSE)","v":43.2},{"$f":"+VLOOKUP(+$A7,'Data Input'!$A$3:$AX$32,5,FALSE)","v":12},{"$f":"+VLOOKUP(+$A7,'Data Input'!$A$3:$AX$32,6,FALSE)","v":""},{"$f":"+VLOOKUP(+$A7,'Data Input'!$A$3:$AX$32,7,FALSE)","v":"A"},{"$f":"+VLOOKUP($A7,'Data Input'!$A$3:$AX$32,33,FALSE)","v":5},{"$f":"+VLOOKUP($A7,'Data Input'!$A$3:$AX$32,34,FALSE)","v":37},{"$f":"+VLOOKUP($A7,'Data Input'!$A$3:$AX$32,35,FALSE)","v":36.320000000003347},null,3]
[335,{"$f":"+VLOOKUP(+$A8,'Data Input'!$A$3:$AX$32,2,FALSE)","v":"Firebird"},{"$f":"+VLOOKUP(+$A8,'Data Input'!$A$3:$AX$32,3,FALSE)","v":"R Richardson"},{"$f":"+VLOOKUP(+$A8,'Data Input'!$A$3:$AX$32,4,FALSE)","v":30},{"$f":"+VLOOKUP(+$A8,'Data Input'!$A$3:$AX$32,5,FALSE)","v":1},{"$f":"+VLOOKUP(+$A8,'Data Input'!$A$3:$AX$32,6,FALSE)","v":""},{"$f":"+VLOOKUP(+$A8,'Data Input'!$A$3:$AX$32,7,FALSE)","v":"A"},{"$f":"+VLOOKUP($A8,'Data Input'!$A$3:$AX$32,33,FALSE)","v":5},{"$f":"+VLOOKUP($A8,'Data Input'!$A$3:$AX$32,34,FALSE)","v":39},{"$f":"+VLOOKUP($A8,'Data Input'!$A$3:$AX$32,35,FALSE)","v":38.770000000000437},null,4]
[368,{"$f":"+VLOOKUP(+$A9,'Data Input'!$A$3:$AX$32,2,FALSE)","v":"Wandering Rose"},{"$f":"+VLOOKUP(+$A9,'Data Input'!$A$3:$AX$32,3,FALSE)","v":"  Radley"},{"$f":"+VLOOKUP(+$A9,'Data Input'!$A$3:$AX$32,4,FALSE)","v":31},{"$f":"+VLOOKUP(+$A9,'Data Input'!$A$3:$AX$32,5,FALSE)","v":-2},{"$f":"+VLOOKUP(+$A9,'Data Input'!$A$3:$AX$32,6,FALSE)","v":""},{"$f":"+VLOOKUP(+$A9,'Data Input'!$A$3:$AX$32,7,FALSE)","v":"A"},{"$f":"+VLOOKUP($A9,'Data Input'!$A$3:$AX$32,33,FALSE)","v":5},{"$f":"+VLOOKUP($A9,'Data Input'!$A$3:$AX$32,34,FALSE)","v":39},{"$f":"+VLOOKUP($A9,'Data Input'!$A$3:$AX$32,35,FALSE)","v":46.93999999999869},null,5]
[369,{"$f":"+VLOOKUP(+$A10,'Data Input'!$A$3:$AX$32,2,FALSE)","v":"Moonshadow"},{"$f":"+VLOOKUP(+$A10,'Data Input'!$A$3:$AX$32,3,FALSE)","v":"N Hovey"},{"$f":"+VLOOKUP(+$A10,'Data Input'!$A$3:$AX$32,4,FALSE)","v":31.5},{"$f":"+VLOOKUP(+$A10,'Data Input'!$A$3:$AX$32,5,FALSE)","v":4},{"$f":"+VLOOKUP(+$A10,'Data Input'!$A$3:$AX$32,6,FALSE)","v":""},{"$f":"+VLOOKUP(+$A10,'Data Input'!$A$3:$AX$32,7,FALSE)","v":"A"},{"$f":"+VLOOKUP($A10,'Data Input'!$A$3:$AX$32,33,FALSE)","v":5},{"$f":"+VLOOKUP($A10,'Data Input'!$A$3:$AX$32,34,FALSE)","v":42},{"$f":"+VLOOKUP($A10,'Data Input'!$A$3:$AX$32,35,FALSE)","v":21.040000000000873},null,6]
{"$rows_left_out":47}