{"text_format":"1","workbook":"xlsx","n_sheets":4,"sheets":["Data Input","YNR","Moonraker","Classes"],"not_rendered":{"charts":0,"images":0,"macros":1,"external_links":0,"defined_names":6,"comments":0,"pivot_tables":0},"unopened":[],"bounds":{"document_bytes":16777216,"sheet_cells":100000,"rows_first":2000,"rows_last":500,"rows_between":2000,"halvings":0,"cell_chars":16384,"cell_head_chars":4096},"cells_cut":0,"cells_raw":0,"read":"whole","date_system":"1900"}

{"sheet":"Data Input","index":0,"n_rows":34,"n_cols":50,"rows_kept":34,"cut":false,"hidden":false,"merged":[]}
["No","Yacht","Skipper","Length","H/C","P","Class",null,"Start",null,null,"Out 1",null,null,"In 1",null,null,"Out 2",null,null,"In 2",null,null,"Finish",null,null,null,"Elapsed",null,null,"Pos",null,null,"Corrected",null,null,"Pos",null,"Bridge1","Bridge 2","Bridge T","T","T-B elapsed","Corr"]
[null,null,null,null,null,null,null,"H","M","S","H","M","S","H","M","S","H","M","S","H","M","S","H","M","S",null,"H","M","S",null,null," ","H","M","S",null,null," ","Seconds","Seconds","Seconds","Seconds","Seconds","Seconds"]
[7,"Forester","S  Bentall",32.5,-8,"",{"$f":"IF(D3=\"\",\"\",IF(D3<25,\"C\",IF(D3<28.01,\"B\",\"A\")))","v":"A"},8,30,0,10,26,1,10,36,45,12,49,28,12,54,40,14,38,43,null,{"$f":"INT(AQ3/3600)","v":5},{"$f":"INT((AQ3-AA3*3600)/60)","v":52},{"$f":"AQ3-(AA3*3600+AB3*60)","v":47},null,{"$f":"+AT3","v":10},null,{"$f":"INT(AR3/3600)","v":5},{"$f":"INT((AR3-AG3*3600)/60)","v":24},{"$f":"AR3-(AG3*3600+AH3*60)","v":33.639999999999418},null,{"$f":"+AW3","v":2},null,{"$f":"(P3+O3*60+N3*3600)-(M3+L3*60+K3*3600)","v":644},{"$f":"(V3+U3*60+T3*3600)-(S3+R3*60+Q3*3600)","v":312},{"$f":"AM3+AN3","v":956},{"$f":"(Y3+X3*60+W3*3600)-(J3+I3*60+H3*3600)","v":22123},{"$f":"ABS(AP3-AO3)","v":21167},{"$f":"AQ3*(0.01*(100+E3))","v":19473.64},{"$f":"+IF(F3=\"\",AQ3,500000)","v":21167},{"$f":"IF(F3=\"\",+RANK(AS3,$AS$3:$AS$32,1),+F3)","v":10},{"$f":"+IF(AT3<4,\"Trophy\",\"\")","v":""},{"$f":"+IF(F3=\"\",AR3,500000)","v":19473.64},{"$f":"IF(F3=\"\",+RANK(AV3,$AV$3:$AV$32,1),+F3)","v":2},{"$f":"+IF(AW3<4,\"Trophy\",\"\")","v":"Trophy"}]
[15,"Pirate","T Moore",30,-7,"","A",7,30,0,9,44,11,9,52,22,12,7,2,12,34,15,14,27,5,null,6,21,41,null,19,null,5,54,57.930000000000291,null,18,null,491,1633,2124,25025,22901,21297.93,{"$f":"+IF(F4=\"\",AQ4,500000)","v":22901},{"$f":"IF(F4=\"\",+RANK(AS4,$AS$3:$AS$32,1),+F4)","v":19},"",{"$f":"+IF(F4=\"\",AR4,500000)","v":21297.93},18,""]
[22,"Moonraker","P Jeckells",29.5,2,"","A",9,30,0,11,29,52,11,35,8,13,41,41,13,46,15,15,27,35,null,5,47,45,null,9,null,5,54,42.299999999999272,null,17,null,316,274,590,21455,20865,21282.3,20865,9,"",21282.3,17,""]
[24,"Pippa","G Angell",27.5,-7,"","B",8,0,0,10,7,1,10,40,53,12,58,7,13,26,53,15,17,12,null,6,14,34,null,15,null,5,48,20.819999999999709,null,13,null,2032,1726,3758,26232,22474,20900.82,22474,15,"",20900.82,13,""]
[52,"Maidie","M Barnes",43.2,12,"","A",7,30,0,9,8,19,9,23,50,11,9,34,11,25,36,13,2,59,null,5,1,26,null,{"$f":"+AT7","v":1},null,5,37,36.320000000003347,null,4,null,931,962,1893,19979,18086,20256.320000000003,18086,1,"Trophy",20256.320000000003,4,""]
[78,"Halcyon","R Wilson",29.5,-7,"DNS","A"," "," "," ",null,null,null,null,null,null,null,null,null,null,null,null,null,null,null,null,{"$error":"#VALUE!"},{"$error":"#VALUE!"},{"$error":"#VALUE!"},null,"DNS",null,{"$error":"#VALUE!"},{"$error":"#VALUE!"},{"$error":"#VALUE!"},null,"DNS",null,0,0,0,{"$error":"#VALUE!"},{"$error":"#VALUE!"},{"$error":"#VALUE!"},500000,"DNS","",500000,"DNS",""]
[87,"Modwena","M Cassidy",24.8,-18,"","C",7,15,0,9,45,27,9,53,10,12,25,47,12,36,54,14,47,4,null,7,13,14,null,22,null,5,55,15.080000000001746,null,19,null,463,667,1130,27124,25994,21315.08,25994,22,"",21315.08,19,""]
[117,"Anne","D Church",34.5,-3,"","A",8,0,0,10,10,59,10,44,32,13,2,8,13,31,15,15,17,30,null,6,14,50,null,16,null,6,3,35.299999999999272,null,21,null,2013,1747,3760,26250,22490,21815.3,22490,16,"",21815.3,21,""]
[141,"Nirvana"," M Claridge",20,-23,"P","C",7,30,0,10,1,4,10,40,41,13,29,4,13,34,39,15,47,13,null,7,32,1,null,"P",null,5,48,3.1700000000018917,null,"P",null,2377,335,2712,29833,27121,20883.170000000002,500000,"P","",500000,"P",""]
[155,"Stratos","J Townley",22.6,-17,"","C",7,30,0,9,58,35,10,38,53,13,18,23,13,29,18,15,25,47,null,7,4,34,null,21,null,5,52,23.420000000001892,null,14,null,2418,655,3073,28547,25474,21143.420000000002,25474,21,"",21143.420000000002,14,""]
[177,"Breeze","M Ellis",32,2,"","A",8,30,0,10,12,42,10,40,18,12,39,50,12,45,7,14,20,22,null,5,17,29,null,3,null,5,23,49.979999999999563,null,1,null,1656,317,1973,21022,19049,19429.98,19049,3,"Trophy",19429.98,1,"Trophy"]
[179,"Waxwing","S Clayton",28,-8,"","B",8,15,0,10,28,29,10,41,55,12,59,55,13,30,3,15,16,37,null,6,18,3,null,18,null,5,47,48.360000000000582,null,12,null,806,1808,2614,25297,22683,20868.36,22683,18,"",20868.36,12,""]
[199,"Morning Calm","W Clark",26,-9,"","B",7,15,0,9,23,48,9,28,54,11,36,22,11,42,54,13,37,30,null,6,10,52,null,13,null,5,37,29.319999999999709,null,3,null,306,392,698,22950,22252,20249.32,22252,13,"",20249.32,3,"Trophy"]
[217,"Melinda","P Howes",27.9,1,"","B",9,15,0,11,13,46,11,22,30,13,26,37,13,30,25,15,7,9,null,5,39,37,null,7,null,5,43,0.77000000000043656,null,9,null,524,228,752,21129,20377,20580.77,20377,7,"",20580.77,9,""]
[222,"Swallowtail","J Wells",28,-5,"RET","B",7,30,0,9,44,4,9,52,5,12,6,32,12,35,19,null,null,null,null,8,6,48,null,"RET",null,7,42,27.600000000002183,null,"RET",null,481,1727,2208,-27000,29208,27747.600000000002,500000,"RET","",500000,"RET",""]
[224,"Anna","R Branscombe",25,-9,"","B",7,15,0,9,36,14,9,41,49,11,56,21,12,34,36,14,30,54,null,6,32,4,null,20,null,5,56,46.840000000000146,null,20,null,335,2295,2630,26154,23524,21406.84,23524,20,"",21406.84,20,""]
[226,"Medina","S Brown",26,-9,"P","B",8,30,0,10,49,14,10,57,43,13,34,40,13,40,13,15,50,30,null,7,6,28,null,"P",null,6,28,5.0800000000017462,null,"P",null,509,333,842,26430,25588,23285.08,500000,"P","",500000,"P",""]
[240,"Avocet","R  Branford",28,-16,"RET","B",8,15,0,10,31,10,10,38,45,null,null,null,null,null,null,null,null,null,null,8,22,35,null,"RET",null,7,2,10.200000000000728,null,"RET",null,455,0,455,-29700,30155,25330.2,500000,"RET","",500000,"RET",""]
[244,"Catspaw","B Wilkins",28,-5,"","B",8,0,0,10,5,57,10,40,47,12,52,46,12,56,4,14,35,34,null,5,57,26,null,11,null,5,39,33.700000000000728,null,5,null,2090,198,2288,23734,21446,20373.7,21446,11,"",20373.7,5,""]
[323,"Starlight Lady","N.Matthews",30,13,"DNS","A"," "," "," ",null,null,null,null,null,null,null,null,null,null,null,null,null,null,null,null,{"$error":"#VALUE!"},{"$error":"#VALUE!"},{"$error":"#VALUE!"},null,"DNS",null,{"$error":"#VALUE!"},{"$error":"#VALUE!"},{"$error":"#VALUE!"},null,"DNS",null,0,0,0,{"$error":"#VALUE!"},{"$error":"#VALUE!"},{"$error":"#VALUE!"},500000,"DNS","",500000,"DNS",""]
[335,"Firebird","R Richardson",30,1,"","A",8,30,0,10,27,31,10,40,21,12,42,18,12,46,54,14,23,43,null,5,36,17,null,6,null,5,39,38.770000000000437,null,6,null,770,276,1046,21223,20177,20378.77,20177,6,"",20378.77,6,""]
[356,"Amsel","D McCarter",28,-18,"RET","B",7,45,0,11,32,23,11,41,9,null,null,null,null,null,null,null,null,null,null,7,53,46,null,"RET",null,6,28,29.320000000003347,null,"RET",null,526,0,526,-27900,28426,23309.320000000003,500000,"RET","",500000,"RET",""]
[368,"Wandering Rose","  Radley",31,-2,"","A",8,0,0,9,57,45,10,36,28,12,45,13,12,49,0,14,29,13,null,5,46,43,null,8,null,5,39,46.93999999999869,null,7,null,2323,227,2550,23353,20803,20386.939999999999,20803,8,"",20386.939999999999,7,""]
[369,"Moonshadow","N Hovey",31.5,4,"","A",8,15,0,10,8,12,10,35,36,12,37,53,12,42,20,14,16,2,null,5,29,11,null,5,null,5,42,21.040000000000873,null,8,null,1644,267,1911,21662,19751,20541.04,19751,5,"",20541.04,8,""]
[370,"Glory","C Brown",35,-6,"","A",8,30,0,10,30,50,10,45,14,12,58,8,13,27,25,15,20,29,null,6,6,48,null,12,null,5,44,47.520000000000437,null,10,null,864,1757,2621,24629,22008,20687.52,22008,12,"",20687.52,10,""]
[373,"Meggie","J Tansley",34.9,16,"",{"$f":"IF(D28=\"\",\"\",IF(D28<25,\"C\",IF(D28<28.01,\"B\",\"A\")))","v":"A"},9,30,0,11,28,24,11,32,14,13,33,26,13,36,38,15,5,47,null,{"$f":"INT(AQ28/3600)","v":5},{"$f":"INT((AQ28-AA28*3600)/60)","v":28},{"$f":"AQ28-(AA28*3600+AB28*60)","v":45},null,{"$f":"+AT28","v":4},null,{"$f":"INT(AR28/3600)","v":6},{"$f":"INT((AR28-AG28*3600)/60)","v":21},{"$f":"AR28-(AG28*3600+AH28*60)","v":21},null,{"$f":"+AW28","v":22},null,{"$f":"(P28+O28*60+N28*3600)-(M28+L28*60+K28*3600)","v":230},{"$f":"(V28+U28*60+T28*3600)-(S28+R28*60+Q28*3600)","v":192},{"$f":"AM28+AN28","v":422},{"$f":"(Y28+X28*60+W28*3600)-(J28+I28*60+H28*3600)","v":20147},{"$f":"ABS(AP28-AO28)","v":19725},{"$f":"AQ28*(0.01*(100+E28))","v":22881},19725,4,{"$f":"+IF(AT28<4,\"Trophy\",\"\")","v":""},22881,22,{"$f":"+IF(AW28<4,\"Trophy\",\"\")","v":""}]
[400,"Swallowtail","K Halifax",26.5,-7,"","B",8,15,0,10,22,47,10,43,13,13,1,12,13,29,1,15,16,22,null,6,13,7,null,14,null,5,46,59.909999999999854,null,11,null,1226,1669,2895,25282,22387,20819.91,22387,14,"",20819.91,11,""]
[417,"Stellar","T Frary",31.3,16,"","A",9,15,0,11,1,51,11,19,47,13,13,30,13,26,33,14,50,54,null,5,4,55,null,2,null,5,53,42.19999999999709,null,15,null,1076,783,1859,20154,18295,21222.199999999997,18295,2,"Trophy",21222.199999999997,15,""]
[418,"Tinkerbell","A Lincoln",25.2,-6,"","B",7,30,0,9,44,6,9,52,22,12,4,45,12,34,56,14,24,48,null,6,16,21,null,17,null,5,53,46.140000000003056,null,16,null,496,1811,2307,24888,22581,21226.140000000003,22581,17,"",21226.140000000003,16,""]
[]
[]
[{"$f":"+COUNT(A3:A33)","v":29}]

{"sheet":"YNR","index":1,"n_rows":49,"n_cols":12,"rows_kept":49,"cut":false,"hidden":false,"merged":[]}
[null,null,null,null,null,null,null,null,"Corrected"]
["No","Yacht","Skipper","Length","H/C","P","Class","H","M","S",null,"Pos"]
[177,{"$f":"+VLOOKUP(+$A3,'Data Input'!$A$3:$AX$32,2,FALSE)","v":"Breeze"},{"$f":"+VLOOKUP(+$A3,'Data Input'!$A$3:$AX$32,3,FALSE)","v":"M Ellis"},{"$f":"+VLOOKUP(+$A3,'Data Input'!$A$3:$AX$32,4,FALSE)","v":32},{"$f":"+VLOOKUP(+$A3,'Data Input'!$A$3:$AX$32,5,FALSE)","v":2},{"$f":"+VLOOKUP(+$A3,'Data Input'!$A$3:$AX$32,6,FALSE)","v":""},{"$f":"+VLOOKUP(+$A3,'Data Input'!$A$3:$AX$32,7,FALSE)","v":"A"},{"$f":"+VLOOKUP($A3,'Data Input'!$A$3:$AX$32,33,FALSE)","v":5},{"$f":"+VLOOKUP($A3,'Data Input'!$A$3:$AX$32,34,FALSE)","v":23},{"$f":"+VLOOKUP($A3,'Data Input'!$A$3:$AX$32,35,FALSE)","v":49.979999999999563},null,{"$f":"+VLOOKUP($A3,'Data Input'!$A$3:$AX$32,37,FALSE)","v":1}]
[7,{"$f":"+VLOOKUP(+$A4,'Data Input'!$A$3:$AX$32,2,FALSE)","v":"Forester"},{"$f":"+VLOOKUP(+$A4,'Data Input'!$A$3:$AX$32,3,FALSE)","v":"S  Bentall"},{"$f":"+VLOOKUP(+$A4,'Data Input'!$A$3:$AX$32,4,FALSE)","v":32.5},{"$f":"+VLOOKUP(+$A4,'Data Input'!$A$3:$AX$32,5,FALSE)","v":-8},{"$f":"+VLOOKUP(+$A4,'Data Input'!$A$3:$AX$32,6,FALSE)","v":""},{"$f":"+VLOOKUP(+$A4,'Data Input'!$A$3:$AX$32,7,FALSE)","v":"A"},{"$f":"+VLOOKUP($A4,'Data Input'!$A$3:$AX$32,33,FALSE)","v":5},{"$f":"+VLOOKUP($A4,'Data Input'!$A$3:$AX$32,34,FALSE)","v":24},{"$f":"+VLOOKUP($A4,'Data Input'!$A$3:$AX$32,35,FALSE)","v":33.639999999999418},null,{"$f":"+VLOOKUP($A4,'Data Input'!$A$3:$AX$32,37,FALSE)","v":2}]
[199,{"$f":"+VLOOKUP(+$A5,'Data Input'!$A$3:$AX$32,2,FALSE)","v":"Morning Calm"},{"$f":"+VLOOKUP(+$A5,'Data Input'!$A$3:$AX$32,3,FALSE)","v":"W Clark"},{"$f":"+VLOOKUP(+$A5,'Data Input'!$A$3:$AX$32,4,FALSE)","v":26},{"$f":"+VLOOKUP(+$A5,'Data Input'!$A$3:$AX$32,5,FALSE)","v":-9},{"$f":"+VLOOKUP(+$A5,'Data Input'!$A$3:$AX$32,6,FALSE)","v":""},{"$f":"+VLOOKUP(+$A5,'Data Input'!$A$3:$AX$32,7,FALSE)","v":"B"},{"$f":"+VLOOKUP($A5,'Data Input'!$A$3:$AX$32,33,FALSE)","v":5},{"$f":"+VLOOKUP($A5,'Data Input'!$A$3:$AX$32,34,FALSE)","v":37},{"$f":"+VLOOKUP($A5,'Data Input'!$A$3:$AX$32,35,FALSE)","v":29.319999999999709},null,{"$f":"+VLOOKUP($A5,'Data Input'!$A$3:$AX$32,37,FALSE)","v":3}]
[52,{"$f":"+VLOOKUP(+$A6,'Data Input'!$A$3:$AX$32,2,FALSE)","v":"Maidie"},{"$f":"+VLOOKUP(+$A6,'Data Input'!$A$3:$AX$32,3,FALSE)","v":"M Barnes"},{"$f":"+VLOOKUP(+$A6,'Data Input'!$A$3:$AX$32,4,FALSE)","v":43.2},{"$f":"+VLOOKUP(+$A6,'Data Input'!$A$3:$AX$32,5,FALSE)","v":12},{"$f":"+VLOOKUP(+$A6,'Data Input'!$A$3:$AX$32,6,FALSE)","v":""},{"$f":"+VLOOKUP(+$A6,'Data Input'!$A$3:$AX$32,7,FALSE)","v":"A"},{"$f":"+VLOOKUP($A6,'Data Input'!$A$3:$AX$32,33,FALSE)","v":5},{"$f":"+VLOOKUP($A6,'Data Input'!$A$3:$AX$32,34,FALSE)","v":37},{"$f":"+VLOOKUP($A6,'Data Input'!$A$3:$AX$32,35,FALSE)","v":36.320000000003347},null,{"$f":"+VLOOKUP($A6,'Data Input'!$A$3:$AX$32,37,FALSE)","v":4}]
[244,{"$f":"+VLOOKUP(+$A7,'Data Input'!$A$3:$AX$32,2,FALSE)","v":"Catspaw"},{"$f":"+VLOOKUP(+$A7,'Data Input'!$A$3:$AX$32,3,FALSE)","v":"B Wilkins"},{"$f":"+VLOOKUP(+$A7,'Data Input'!$A$3:$AX$32,4,FALSE)","v":28},{"$f":"+VLOOKUP(+$A7,'Data Input'!$A$3:$AX$32,5,FALSE)","v":-5},{"$f":"+VLOOKUP(+$A7,'Data Input'!$A$3:$AX$32,6,FALSE)","v":""},{"$f":"+VLOOKUP(+$A7,'Data Input'!$A$3:$AX$32,7,FALSE)","v":"B"},{"$f":"+VLOOKUP($A7,'Data Input'!$A$3:$AX$32,33,FALSE)","v":5},{"$f":"+VLOOKUP($A7,'Data Input'!$A$3:$AX$32,34,FALSE)","v":39},{"$f":"+VLOOKUP($A7,'Data Input'!$A$3:$AX$32,35,FALSE)","v":33.700000000000728},null,{"$f":"+VLOOKUP($A7,'Data Input'!$A$3:$AX$32,37,FALSE)","v":5}]
[335,{"$f":"+VLOOKUP(+$A8,'Data Input'!$A$3:$AX$32,2,FALSE)","v":"Firebird"},{"$f":"+VLOOKUP(+$A8,'Data Input'!$A$3:$AX$32,3,FALSE)","v":"R Richardson"},{"$f":"+VLOOKUP(+$A8,'Data Input'!$A$3:$AX$32,4,FALSE)","v":30},{"$f":"+VLOOKUP(+$A8,'Data Input'!$A$3:$AX$32,5,FALSE)","v":1},{"$f":"+VLOOKUP(+$A8,'Data Input'!$A$3:$AX$32,6,FALSE)","v":""},{"$f":"+VLOOKUP(+$A8,'Data Input'!$A$3:$AX$32,7,FALSE)","v":"A"},{"$f":"+VLOOKUP($A8,'Data Input'!$A$3:$AX$32,33,FALSE)","v":5},{"$f":"+VLOOKUP($A8,'Data Input'!$A$3:$AX$32,34,FALSE)","v":39},{"$f":"+VLOOKUP($A8,'Data Input'!$A$3:$AX$32,35,FALSE)","v":38.770000000000437},null,{"$f":"+VLOOKUP($A8,'Data Input'!$A$3:$AX$32,37,FALSE)","v":6}]
[368,{"$f":"+VLOOKUP(+$A9,'Data Input'!$A$3:$AX$32,2,FALSE)","v":"Wandering Rose"},{"$f":"+VLOOKUP(+$A9,'Data Input'!$A$3:$AX$32,3,FALSE)","v":"  Radley"},{"$f":"+VLOOKUP(+$A9,'Data Input'!$A$3:$AX$32,4,FALSE)","v":31},{"$f":"+VLOOKUP(+$A9,'Data Input'!$A$3:$AX$32,5,FALSE)","v":-2},{"$f":"+VLOOKUP(+$A9,'Data Input'!$A$3:$AX$32,6,FALSE)","v":""},{"$f":"+VLOOKUP(+$A9,'Data Input'!$A$3:$AX$32,7,FALSE)","v":"A"},{"$f":"+VLOOKUP($A9,'Data Input'!$A$3:$AX$32,33,FALSE)","v":5},{"$f":"+VLOOKUP($A9,'Data Input'!$A$3:$AX$32,34,FALSE)","v":39},{"$f":"+VLOOKUP($A9,'Data Input'!$A$3:$AX$32,35,FALSE)","v":46.93999999999869},null,{"$f":"+VLOOKUP($A9,'Data Input'!$A$3:$AX$32,37,FALSE)","v":7}]
[369,{"$f":"+VLOOKUP(+$A10,'Data Input'!$A$3:$AX$32,2,FALSE)","v":"Moonshadow"},{"$f":"+VLOOKUP(+$A10,'Data Input'!$A$3:$AX$32,3,FALSE)","v":"N Hovey"},{"$f":"+VLOOKUP(+$A10,'Data Input'!$A$3:$AX$32,4,FALSE)","v":31.5},{"$f":"+VLOOKUP(+$A10,'Data Input'!$A$3:$AX$32,5,FALSE)","v":4},{"$f":"+VLOOKUP(+$A10,'Data Input'!$A$3:$AX$32,6,FALSE)","v":""},{"$f":"+VLOOKUP(+$A10,'Data Input'!$A$3:$AX$32,7,FALSE)","v":"A"},{"$f":"+VLOOKUP($A10,'Data Input'!$A$3:$AX$32,33,FALSE)","v":5},{"$f":"+VLOOKUP($A10,'Data Input'!$A$3:$AX$32,34,FALSE)","v":42},{"$f":"+VLOOKUP($A10,'Data Input'!$A$3:$AX$32,35,FALSE)","v":21.040000000000873},null,{"$f":"+VLOOKUP($A10,'Data Input'!$A$3:$AX$32,37,FALSE)","v":8}]
[217,{"$f":"+VLOOKUP(+$A11,'Data Input'!$A$3:$AX$32,2,FALSE)","v":"Melinda"},{"$f":"+VLOOKUP(+$A11,'Data Input'!$A$3:$AX$32,3,FALSE)","v":"P Howes"},{"$f":"+VLOOKUP(+$A11,'Data Input'!$A$3:$AX$32,4,FALSE)","v":27.9},{"$f":"+VLOOKUP(+$A11,'Data Input'!$A$3:$AX$32,5,FALSE)","v":1},{"$f":"+VLOOKUP(+$A11,'Data Input'!$A$3:$AX$32,6,FALSE)","v":""},{"$f":"+VLOOKUP(+$A11,'Data Input'!$A$3:$AX$32,7,FALSE)","v":"B"},{"$f":"+VLOOKUP($A11,'Data Input'!$A$3:$AX$32,33,FALSE)","v":5},{"$f":"+VLOOKUP($A11,'Data Input'!$A$3:$AX$32,34,FALSE)","v":43},{"$f":"+VLOOKUP($A11,'Data Input'!$A$3:$AX$32,35,FALSE)","v":0.77000000000043656},null,{"$f":"+VLOOKUP($A11,'Data Input'!$A$3:$AX$32,37,FALSE)","v":9}]
[370,{"$f":"+VLOOKUP(+$A12,'Data Input'!$A$3:$AX$32,2,FALSE)","v":"Glory"},{"$f":"+VLOOKUP(+$A12,'Data Input'!$A$3:$AX$32,3,FALSE)","v":"C Brown"},{"$f":"+VLOOKUP(+$A12,'Data Input'!$A$3:$AX$32,4,FALSE)","v":35},{"$f":"+VLOOKUP(+$A12,'Data Input'!$A$3:$AX$32,5,FALSE)","v":-6},{"$f":"+VLOOKUP(+$A12,'Data Input'!$A$3:$AX$32,6,FALSE)","v":""},{"$f":"+VLOOKUP(+$A12,'Data Input'!$A$3:$AX$32,7,FALSE)","v":"A"},{"$f":"+VLOOKUP($A12,'Data Input'!$A$3:$AX$32,33,FALSE)","v":5},{"$f":"+VLOOKUP($A12,'Data Input'!$A$3:$AX$32,34,FALSE)","v":44},{"$f":"+VLOOKUP($A12,'Data Input'!$A$3:$AX$32,35,FALSE)","v":47.520000000000437},null,{"$f":"+VLOOKUP($A12,'Data Input'!$A$3:$AX$32,37,FALSE)","v":10}]
[400,{"$f":"+VLOOKUP(+$A13,'Data Input'!$A$3:$AX$32,2,FALSE)","v":"Swallowtail"},{"$f":"+VLOOKUP(+$A13,'Data Input'!$A$3:$AX$32,3,FALSE)","v":"K Halifax"},{"$f":"+VLOOKUP(+$A13,'Data Input'!$A$3:$AX$32,4,FALSE)","v":26.5},{"$f":"+VLOOKUP(+$A13,'Data Input'!$A$3:$AX$32,5,FALSE)","v":-7},{"$f":"+VLOOKUP(+$A13,'Data Input'!$A$3:$AX$32,6,FALSE)","v":""},{"$f":"+VLOOKUP(+$A13,'Data Input'!$A$3:$AX$32,7,FALSE)","v":"B"},{"$f":"+VLOOKUP($A13,'Data Input'!$A$3:$AX$32,33,FALSE)","v":5},{"$f":"+VLOOKUP($A13,'Data Input'!$A$3:$AX$32,34,FALSE)","v":46},{"$f":"+VLOOKUP($A13,'Data Input'!$A$3:$AX$32,35,FALSE)","v":59.909999999999854},null,{"$f":"+VLOOKUP($A13,'Data Input'!$A$3:$AX$32,37,FALSE)","v":11}]
[179,{"$f":"+VLOOKUP(+$A14,'Data Input'!$A$3:$AX$32,2,FALSE)","v":"Waxwing"},{"$f":"+VLOOKUP(+$A14,'Data Input'!$A$3:$AX$32,3,FALSE)","v":"S Clayton"},{"$f":"+VLOOKUP(+$A14,'Data Input'!$A$3:$AX$32,4,FALSE)","v":28},{"$f":"+VLOOKUP(+$A14,'Data Input'!$A$3:$AX$32,5,FALSE)","v":-8},{"$f":"+VLOOKUP(+$A14,'Data Input'!$A$3:$AX$32,6,FALSE)","v":""},{"$f":"+VLOOKUP(+$A14,'Data Input'!$A$3:$AX$32,7,FALSE)","v":"B"},{"$f":"+VLOOKUP($A14,'Data Input'!$A$3:$AX$32,33,FALSE)","v":5},{"$f":"+VLOOKUP($A14,'Data Input'!$A$3:$AX$32,34,FALSE)","v":47},{"$f":"+VLOOKUP($A14,'Data Input'!$A$3:$AX$32,35,FALSE)","v":48.360000000000582},null,{"$f":"+VLOOKUP($A14,'Data Input'!$A$3:$AX$32,37,FALSE)","v":12}]
[24,{"$f":"+VLOOKUP(+$A15,'Data Input'!$A$3:$AX$32,2,FALSE)","v":"Pippa"},{"$f":"+VLOOKUP(+$A15,'Data Input'!$A$3:$AX$32,3,FALSE)","v":"G Angell"},{"$f":"+VLOOKUP(+$A15,'Data Input'!$A$3:$AX$32,4,FALSE)","v":27.5},{"$f":"+VLOOKUP(+$A15,'Data Input'!$A$3:$AX$32,5,FALSE)","v":-7},{"$f":"+VLOOKUP(+$A15,'Data Input'!$A$3:$AX$32,6,FALSE)","v":""},{"$f":"+VLOOKUP(+$A15,'Data Input'!$A$3:$AX$32,7,FALSE)","v":"B"},{"$f":"+VLOOKUP($A15,'Data Input'!$A$3:$AX$32,33,FALSE)","v":5},{"$f":"+VLOOKUP($A15,'Data Input'!$A$3:$AX$32,34,FALSE)","v":48},{"$f":"+VLOOKUP($A15,'Data Input'!$A$3:$AX$32,35,FALSE)","v":20.819999999999709},null,{"$f":"+VLOOKUP($A15,'Data Input'!$A$3:$AX$32,37,FALSE)","v":13}]
[155,{"$f":"+VLOOKUP(+$A16,'Data Input'!$A$3:$AX$32,2,FALSE)","v":"Stratos"},{"$f":"+VLOOKUP(+$A16,'Data Input'!$A$3:$AX$32,3,FALSE)","v":"J Townley"},{"$f":"+VLOOKUP(+$A16,'Data Input'!$A$3:$AX$32,4,FALSE)","v":22.6},{"$f":"+VLOOKUP(+$A16,'Data Input'!$A$3:$AX$32,5,FALSE)","v":-17},{"$f":"+VLOOKUP(+$A16,'Data Input'!$A$3:$AX$32,6,FALSE)","v":""},{"$f":"+VLOOKUP(+$A16,'Data Input'!$A$3:$AX$32,7,FALSE)","v":"C"},{"$f":"+VLOOKUP($A16,'Data Input'!$A$3:$AX$32,33,FALSE)","v":5},{"$f":"+VLOOKUP($A16,'Data Input'!$A$3:$AX$32,34,FALSE)","v":52},{"$f":"+VLOOKUP($A16,'Data Input'!$A$3:$AX$32,35,FALSE)","v":23.420000000001892},null,{"$f":"+VLOOKUP($A16,'Data Input'!$A$3:$AX$32,37,FALSE)","v":14}]
[417,{"$f":"+VLOOKUP(+$A17,'Data Input'!$A$3:$AX$32,2,FALSE)","v":"Stellar"},{"$f":"+VLOOKUP(+$A17,'Data Input'!$A$3:$AX$32,3,FALSE)","v":"T Frary"},{"$f":"+VLOOKUP(+$A17,'Data Input'!$A$3:$AX$32,4,FALSE)","v":31.3},{"$f":"+VLOOKUP(+$A17,'Data Input'!$A$3:$AX$32,5,FALSE)","v":16},{"$f":"+VLOOKUP(+$A17,'Data Input'!$A$3:$AX$32,6,FALSE)","v":""},{"$f":"+VLOOKUP(+$A17,'Data Input'!$A$3:$AX$32,7,FALSE)","v":"A"},{"$f":"+VLOOKUP($A17,'Data Input'!$A$3:$AX$32,33,FALSE)","v":5},{"$f":"+VLOOKUP($A17,'Data Input'!$A$3:$AX$32,34,FALSE)","v":53},{"$f":"+VLOOKUP($A17,'Data Input'!$A$3:$AX$32,35,FALSE)","v":42.19999999999709},null,{"$f":"+VLOOKUP($A17,'Data Input'!$A$3:$AX$32,37,FALSE)","v":15}]
[418,{"$f":"+VLOOKUP(+$A18,'Data Input'!$A$3:$AX$32,2,FALSE)","v":"Tinkerbell"},{"$f":"+VLOOKUP(+$A18,'Data Input'!$A$3:$AX$32,3,FALSE)","v":"A Lincoln"},{"$f":"+VLOOKUP(+$A18,'Data Input'!$A$3:$AX$32,4,FALSE)","v":25.2},{"$f":"+VLOOKUP(+$A18,'Data Input'!$A$3:$AX$32,5,FALSE)","v":-6},{"$f":"+VLOOKUP(+$A18,'Data Input'!$A$3:$AX$32,6,FALSE)","v":""},{"$f":"+VLOOKUP(+$A18,'Data Input'!$A$3:$AX$32,7,FALSE)","v":"B"},{"$f":"+VLOOKUP($A18,'Data Input'!$A$3:$AX$32,33,FALSE)","v":5},{"$f":"+VLOOKUP($A18,'Data Input'!$A$3:$AX$32,34,FALSE)","v":53},{"$f":"+VLOOKUP($A18,'Data Input'!$A$3:$AX$32,35,FALSE)","v":46.140000000003056},null,{"$f":"+VLOOKUP($A18,'Data Input'!$A$3:$AX$32,37,FALSE)","v":16}]
[22,{"$f":"+VLOOKUP(+$A19,'Data Input'!$A$3:$AX$32,2,FALSE)","v":"Moonraker"},{"$f":"+VLOOKUP(+$A19,'Data Input'!$A$3:$AX$32,3,FALSE)","v":"P Jeckells"},{"$f":"+VLOOKUP(+$A19,'Data Input'!$A$3:$AX$32,4,FALSE)","v":29.5},{"$f":"+VLOOKUP(+$A19,'Data Input'!$A$3:$AX$32,5,FALSE)","v":2},{"$f":"+VLOOKUP(+$A19,'Data Input'!$A$3:$AX$32,6,FALSE)","v":""},{"$f":"+VLOOKUP(+$A19,'Data Input'!$A$3:$AX$32,7,FALSE)","v":"A"},{"$f":"+VLOOKUP($A19,'Data Input'!$A$3:$AX$32,33,FALSE)","v":5},{"$f":"+VLOOKUP($A19,'Data Input'!$A$3:$AX$32,34,FALSE)","v":54},{"$f":"+VLOOKUP($A19,'Data Input'!$A$3:$AX$32,35,FALSE)","v":42.299999999999272},null,{"$f":"+VLOOKUP($A19,'Data Input'!$A$3:$AX$32,37,FALSE)","v":17}]
[15,{"$f":"+VLOOKUP(+$A20,'Data Input'!$A$3:$AX$32,2,FALSE)","v":"Pirate"},{"$f":"+VLOOKUP(+$A20,'Data Input'!$A$3:$AX$32,3,FALSE)","v":"T Moore"},{"$f":"+VLOOKUP(+$A20,'Data Input'!$A$3:$AX$32,4,FALSE)","v":30},{"$f":"+VLOOKUP(+$A20,'Data Input'!$A$3:$AX$32,5,FALSE)","v":-7},{"$f":"+VLOOKUP(+$A20,'Data Input'!$A$3:$AX$32,6,FALSE)","v":""},{"$f":"+VLOOKUP(+$A20,'Data Input'!$A$3:$AX$32,7,FALSE)","v":"A"},{"$f":"+VLOOKUP($A20,'Data Input'!$A$3:$AX$32,33,FALSE)","v":5},{"$f":"+VLOOKUP($A20,'Data Input'!$A$3:$AX$32,34,FALSE)","v":54},{"$f":"+VLOOKUP($A20,'Data Input'!$A$3:$AX$32,35,FALSE)","v":57.930000000000291},null,{"$f":"+VLOOKUP($A20,'Data Input'!$A$3:$AX$32,37,FALSE)","v":18}]
[87,{"$f":"+VLOOKUP(+$A21,'Data Input'!$A$3:$AX$32,2,FALSE)","v":"Modwena"},{"$f":"+VLOOKUP(+$A21,'Data Input'!$A$3:$AX$32,3,FALSE)","v":"M Cassidy"},{"$f":"+VLOOKUP(+$A21,'Data Input'!$A$3:$AX$32,4,FALSE)","v":24.8},{"$f":"+VLOOKUP(+$A21,'Data Input'!$A$3:$AX$32,5,FALSE)","v":-18},{"$f":"+VLOOKUP(+$A21,'Data Input'!$A$3:$AX$32,6,FALSE)","v":""},{"$f":"+VLOOKUP(+$A21,'Data Input'!$A$3:$AX$32,7,FALSE)","v":"C"},{"$f":"+VLOOKUP($A21,'Data Input'!$A$3:$AX$32,33,FALSE)","v":5},{"$f":"+VLOOKUP($A21,'Data Input'!$A$3:$AX$32,34,FALSE)","v":55},{"$f":"+VLOOKUP($A21,'Data Input'!$A$3:$AX$32,35,FALSE)","v":15.080000000001746},null,{"$f":"+VLOOKUP($A21,'Data Input'!$A$3:$AX$32,37,FALSE)","v":19}]
[224,{"$f":"+VLOOKUP(+$A22,'Data Input'!$A$3:$AX$32,2,FALSE)","v":"Anna"},{"$f":"+VLOOKUP(+$A22,'Data Input'!$A$3:$AX$32,3,FALSE)","v":"R Branscombe"},{"$f":"+VLOOKUP(+$A22,'Data Input'!$A$3:$AX$32,4,FALSE)","v":25},{"$f":"+VLOOKUP(+$A22,'Data Input'!$A$3:$AX$32,5,FALSE)","v":-9},{"$f":"+VLOOKUP(+$A22,'Data Input'!$A$3:$AX$32,6,FALSE)","v":""},{"$f":"+VLOOKUP(+$A22,'Data Input'!$A$3:$AX$32,7,FALSE)","v":"B"},{"$f":"+VLOOKUP($A22,'Data Input'!$A$3:$AX$32,33,FALSE)","v":5},{"$f":"+VLOOKUP($A22,'Data Input'!$A$3:$AX$32,34,FALSE)","v":56},{"$f":"+VLOOKUP($A22,'Data Input'!$A$3:$AX$32,35,FALSE)","v":46.840000000000146},null,{"$f":"+VLOOKUP($A22,'Data Input'!$A$3:$AX$32,37,FALSE)","v":20}]
[117,{"$f":"+VLOOKUP(+$A23,'Data Input'!$A$3:$AX$32,2,FALSE)","v":"Anne"},{"$f":"+VLOOKUP(+$A23,'Data Input'!$A$3:$AX$32,3,FALSE)","v":"D Church"},{"$f":"+VLOOKUP(+$A23,'Data Input'!$A$3:$AX$32,4,FALSE)","v":34.5},{"$f":"+VLOOKUP(+$A23,'Data Input'!$A$3:$AX$32,5,FALSE)","v":-3},{"$f":"+VLOOKUP(+$A23,'Data Input'!$A$3:$AX$32,6,FALSE)","v":""},{"$f":"+VLOOKUP(+$A23,'Data Input'!$A$3:$AX$32,7,FALSE)","v":"A"},{"$f":"+VLOOKUP($A23,'Data Input'!$A$3:$AX$32,33,FALSE)","v":6},{"$f":"+VLOOKUP($A23,'Data Input'!$A$3:$AX$32,34,FALSE)","v":3},{"$f":"+VLOOKUP($A23,'Data Input'!$A$3:$AX$32,35,FALSE)","v":35.299999999999272},null,{"$f":"+VLOOKUP($A23,'Data Input'!$A$3:$AX$32,37,FALSE)","v":21}]
[373,{"$f":"+VLOOKUP(+$A24,'Data Input'!$A$3:$AX$32,2,FALSE)","v":"Meggie"},{"$f":"+VLOOKUP(+$A24,'Data Input'!$A$3:$AX$32,3,FALSE)","v":"J Tansley"},{"$f":"+VLOOKUP(+$A24,'Data Input'!$A$3:$AX$32,4,FALSE)","v":34.9},{"$f":"+VLOOKUP(+$A24,'Data Input'!$A$3:$AX$32,5,FALSE)","v":16},{"$f":"+VLOOKUP(+$A24,'Data Input'!$A$3:$AX$32,6,FALSE)","v":""},{"$f":"+VLOOKUP(+$A24,'Data Input'!$A$3:$AX$32,7,FALSE)","v":"A"},{"$f":"+VLOOKUP($A24,'Data Input'!$A$3:$AX$32,33,FALSE)","v":6},{"$f":"+VLOOKUP($A24,'Data Input'!$A$3:$AX$32,34,FALSE)","v":21},{"$f":"+VLOOKUP($A24,'Data Input'!$A$3:$AX$32,35,FALSE)","v":21},null,{"$f":"+VLOOKUP($A24,'Data Input'!$A$3:$AX$32,37,FALSE)","v":22}]
[78,{"$f":"+VLOOKUP(+$A25,'Data Input'!$A$3:$AX$32,2,FALSE)","v":"Halcyon"},{"$f":"+VLOOKUP(+$A25,'Data Input'!$A$3:$AX$32,3,FALSE)","v":"R Wilson"},{"$f":"+VLOOKUP(+$A25,'Data Input'!$A$3:$AX$32,4,FALSE)","v":29.5},{"$f":"+VLOOKUP(+$A25,'Data Input'!$A$3:$AX$32,5,FALSE)","v":-7},{"$f":"+VLOOKUP(+$A25,'Data Input'!$A$3:$AX$32,6,FALSE)","v":"DNS"},{"$f":"+VLOOKUP(+$A25,'Data Input'!$A$3:$AX$32,7,FALSE)","v":"A"},{"$f":"+VLOOKUP($A25,'Data Input'!$A$3:$AX$32,33,FALSE)","v":{"$error":"#VALUE!"}},{"$f":"+VLOOKUP($A25,'Data Input'!$A$3:$AX$32,34,FALSE)","v":{"$error":"#VALUE!"}},{"$f":"+VLOOKUP($A25,'Data Input'!$A$3:$AX$32,35,FALSE)","v":{"$error":"#VALUE!"}},null,{"$f":"+VLOOKUP($A25,'Data Input'!$A$3:$AX$32,37,FALSE)","v":"DNS"}]
[323,{"$f":"+VLOOKUP(+$A26,'Data Input'!$A$3:$AX$32,2,FALSE)","v":"Starlight Lady"},{"$f":"+VLOOKUP(+$A26,'Data Input'!$A$3:$AX$32,3,FALSE)","v":"N.Matthews"},{"$f":"+VLOOKUP(+$A26,'Data Input'!$A$3:$AX$32,4,FALSE)","v":30},{"$f":"+VLOOKUP(+$A26,'Data Input'!$A$3:$AX$32,5,FALSE)","v":13},{"$f":"+VLOOKUP(+$A26,'Data Input'!$A$3:$AX$32,6,FALSE)","v":"DNS"},{"$f":"+VLOOKUP(+$A26,'Data Input'!$A$3:$AX$32,7,FALSE)","v":"A"},{"$f":"+VLOOKUP($A26,'Data Input'!$A$3:$AX$32,33,FALSE)","v":{"$error":"#VALUE!"}},{"$f":"+VLOOKUP($A26,'Data Input'!$A$3:$AX$32,34,FALSE)","v":{"$error":"#VALUE!"}},{"$f":"+VLOOKUP($A26,'Data Input'!$A$3:$AX$32,35,FALSE)","v":{"$error":"#VALUE!"}},null,{"$f":"+VLOOKUP($A26,'Data Input'!$A$3:$AX$32,37,FALSE)","v":"DNS"}]
[141,{"$f":"+VLOOKUP(+$A27,'Data Input'!$A$3:$AX$32,2,FALSE)","v":"Nirvana"},{"$f":"+VLOOKUP(+$A27,'Data Input'!$A$3:$AX$32,3,FALSE)","v":" M Claridge"},{"$f":"+VLOOKUP(+$A27,'Data Input'!$A$3:$AX$32,4,FALSE)","v":20},{"$f":"+VLOOKUP(+$A27,'Data Input'!$A$3:$AX$32,5,FALSE)","v":-23},{"$f":"+VLOOKUP(+$A27,'Data Input'!$A$3:$AX$32,6,FALSE)","v":"P"},{"$f":"+VLOOKUP(+$A27,'Data Input'!$A$3:$AX$32,7,FALSE)","v":"C"},{"$f":"+VLOOKUP($A27,'Data Input'!$A$3:$AX$32,33,FALSE)","v":5},{"$f":"+VLOOKUP($A27,'Data Input'!$A$3:$AX$32,34,FALSE)","v":48},{"$f":"+VLOOKUP($A27,'Data Input'!$A$3:$AX$32,35,FALSE)","v":3.1700000000018917},null,{"$f":"+VLOOKUP($A27,'Data Input'!$A$3:$AX$32,37,FALSE)","v":"P"}]
[226,{"$f":"+VLOOKUP(+$A28,'Data Input'!$A$3:$AX$32,2,FALSE)","v":"Medina"},{"$f":"+VLOOKUP(+$A28,'Data Input'!$A$3:$AX$32,3,FALSE)","v":"S Brown"},{"$f":"+VLOOKUP(+$A28,'Data Input'!$A$3:$AX$32,4,FALSE)","v":26},{"$f":"+VLOOKUP(+$A28,'Data Input'!$A$3:$AX$32,5,FALSE)","v":-9},{"$f":"+VLOOKUP(+$A28,'Data Input'!$A$3:$AX$32,6,FALSE)","v":"P"},{"$f":"+VLOOKUP(+$A28,'Data Input'!$A$3:$AX$32,7,FALSE)","v":"B"},{"$f":"+VLOOKUP($A28,'Data Input'!$A$3:$AX$32,33,FALSE)","v":6},{"$f":"+VLOOKUP($A28,'Data Input'!$A$3:$AX$32,34,FALSE)","v":28},{"$f":"+VLOOKUP($A28,'Data Input'!$A$3:$AX$32,35,FALSE)","v":5.0800000000017462},null,{"$f":"+VLOOKUP($A28,'Data Input'!$A$3:$AX$32,37,FALSE)","v":"P"}]
[356,{"$f":"+VLOOKUP(+$A29,'Data Input'!$A$3:$AX$32,2,FALSE)","v":"Amsel"},{"$f":"+VLOOKUP(+$A29,'Data Input'!$A$3:$AX$32,3,FALSE)","v":"D McCarter"},{"$f":"+VLOOKUP(+$A29,'Data Input'!$A$3:$AX$32,4,FALSE)","v":28},{"$f":"+VLOOKUP(+$A29,'Data Input'!$A$3:$AX$32,5,FALSE)","v":-18},{"$f":"+VLOOKUP(+$A29,'Data Input'!$A$3:$AX$32,6,FALSE)","v":"RET"},{"$f":"+VLOOKUP(+$A29,'Data Input'!$A$3:$AX$32,7,FALSE)","v":"B"},{"$f":"+VLOOKUP($A29,'Data Input'!$A$3:$AX$32,33,FALSE)","v":6},{"$f":"+VLOOKUP($A29,'Data Input'!$A$3:$AX$32,34,FALSE)","v":28},{"$f":"+VLOOKUP($A29,'Data Input'!$A$3:$AX$32,35,FALSE)","v":29.320000000003347},null,{"$f":"+VLOOKUP($A29,'Data Input'!$A$3:$AX$32,37,FALSE)","v":"RET"}]
[222,{"$f":"+VLOOKUP(+$A30,'Data Input'!$A$3:$AX$32,2,FALSE)","v":"Swallowtail"},{"$f":"+VLOOKUP(+$A30,'Data Input'!$A$3:$AX$32,3,FALSE)","v":"J Wells"},{"$f":"+VLOOKUP(+$A30,'Data Input'!$A$3:$AX$32,4,FALSE)","v":28},{"$f":"+VLOOKUP(+$A30,'Data Input'!$A$3:$AX$32,5,FALSE)","v":-5},{"$f":"+VLOOKUP(+$A30,'Data Input'!$A$3:$AX$32,6,FALSE)","v":"RET"},{"$f":"+VLOOKUP(+$A30,'Data Input'!$A$3:$AX$32,7,FALSE)","v":"B"},{"$f":"+VLOOKUP($A30,'Data Input'!$A$3:$AX$32,33,FALSE)","v":7},{"$f":"+VLOOKUP($A30,'Data Input'!$A$3:$AX$32,34,FALSE)","v":42},{"$f":"+VLOOKUP($A30,'Data Input'!$A$3:$AX$32,35,FALSE)","v":27.600000000002183},null,{"$f":"+VLOOKUP($A30,'Data Input'!$A$3:$AX$32,37,FALSE)","v":"RET"}]
[240,{"$f":"+VLOOKUP(+$A31,'Data Input'!$A$3:$AX$32,2,FALSE)","v":"Avocet"},{"$f":"+VLOOKUP(+$A31,'Data Input'!$A$3:$AX$32,3,FALSE)","v":"R  Branford"},{"$f":"+VLOOKUP(+$A31,'Data Input'!$A$3:$AX$32,4,FALSE)","v":28},{"$f":"+VLOOKUP(+$A31,'Data Input'!$A$3:$AX$32,5,FALSE)","v":-16},{"$f":"+VLOOKUP(+$A31,'Data Input'!$A$3:$AX$32,6,FALSE)","v":"RET"},{"$f":"+VLOOKUP(+$A31,'Data Input'!$A$3:$AX$32,7,FALSE)","v":"B"},{"$f":"+VLOOKUP($A31,'Data Input'!$A$3:$AX$32,33,FALSE)","v":7},{"$f":"+VLOOKUP($A31,'Data Input'!$A$3:$AX$32,34,FALSE)","v":2},{"$f":"+VLOOKUP($A31,'Data Input'!$A$3:$AX$32,35,FALSE)","v":10.200000000000728},null,{"$f":"+VLOOKUP($A31,'Data Input'!$A$3:$AX$32,37,FALSE)","v":"RET"}]
[]
[{"$f":"COUNT(A3:A31)","v":29}]
[]
[]
[]
[]
[]
[]
[]
[]
[]
[]
[]
[]
[]
[]
[]
[{"$f":"+COUNT(A3:A48)","v":30}]

{"sheet":"Moonraker","index":2,"n_rows":49,"n_cols":13,"rows_kept":49,"cut":false,"hidden":false,"merged":[]}
["No","Yacht","Skipper","Length","H/C","P","Class",null,"Elapsed",null,null,"Pos"]
[null,null,null,null,null,null,null,"H","M","S",null,null," "]
[52,{"$f":"+VLOOKUP(+$A3,'Data Input'!$A$3:$AX$32,2,FALSE)","v":"Maidie"},{"$f":"+VLOOKUP(+$A3,'Data Input'!$A$3:$AX$32,3,FALSE)","v":"M Barnes"},{"$f":"+VLOOKUP(+$A3,'Data Input'!$A$3:$AX$32,4,FALSE)","v":43.2},{"$f":"+VLOOKUP(+$A3,'Data Input'!$A$3:$AX$32,5,FALSE)","v":12},{"$f":"+VLOOKUP(+$A3,'Data Input'!$A$3:$AX$32,6,FALSE)","v":""},{"$f":"+VLOOKUP(+$A3,'Data Input'!$A$3:$AX$32,7,FALSE)","v":"A"},{"$f":"+VLOOKUP($A3,'Data Input'!$A$3:$AX$32,27,FALSE)","v":5},{"$f":"+VLOOKUP($A3,'Data Input'!$A$3:$AX$32,28,FALSE)","v":1},{"$f":"+VLOOKUP($A3,'Data Input'!$A$3:$AX$32,29,FALSE)","v":26},null,{"$f":"+VLOOKUP($A3,'Data Input'!$A$3:$AX$32,31,FALSE)","v":1}]
[417,{"$f":"+VLOOKUP(+$A4,'Data Input'!$A$3:$AX$32,2,FALSE)","v":"Stellar"},{"$f":"+VLOOKUP(+$A4,'Data Input'!$A$3:$AX$32,3,FALSE)","v":"T Frary"},{"$f":"+VLOOKUP(+$A4,'Data Input'!$A$3:$AX$32,4,FALSE)","v":31.3},{"$f":"+VLOOKUP(+$A4,'Data Input'!$A$3:$AX$32,5,FALSE)","v":16},{"$f":"+VLOOKUP(+$A4,'Data Input'!$A$3:$AX$32,6,FALSE)","v":""},{"$f":"+VLOOKUP(+$A4,'Data Input'!$A$3:$AX$32,7,FALSE)","v":"A"},{"$f":"+VLOOKUP($A4,'Data Input'!$A$3:$AX$32,27,FALSE)","v":5},{"$f":"+VLOOKUP($A4,'Data Input'!$A$3:$AX$32,28,FALSE)","v":4},{"$f":"+VLOOKUP($A4,'Data Input'!$A$3:$AX$32,29,FALSE)","v":55},null,{"$f":"+VLOOKUP($A4,'Data Input'!$A$3:$AX$32,31,FALSE)","v":2}]
[177,{"$f":"+VLOOKUP(+$A5,'Data Input'!$A$3:$AX$32,2,FALSE)","v":"Breeze"},{"$f":"+VLOOKUP(+$A5,'Data Input'!$A$3:$AX$32,3,FALSE)","v":"M Ellis"},{"$f":"+VLOOKUP(+$A5,'Data Input'!$A$3:$AX$32,4,FALSE)","v":32},{"$f":"+VLOOKUP(+$A5,'Data Input'!$A$3:$AX$32,5,FALSE)","v":2},{"$f":"+VLOOKUP(+$A5,'Data Input'!$A$3:$AX$32,6,FALSE)","v":""},{"$f":"+VLOOKUP(+$A5,'Data Input'!$A$3:$AX$32,7,FALSE)","v":"A"},{"$f":"+VLOOKUP($A5,'Data Input'!$A$3:$AX$32,27,FALSE)","v":5},{"$f":"+VLOOKUP($A5,'Data Input'!$A$3:$AX$32,28,FALSE)","v":17},{"$f":"+VLOOKUP($A5,'Data Input'!$A$3:$AX$32,29,FALSE)","v":29},null,{"$f":"+VLOOKUP($A5,'Data Input'!$A$3:$AX$32,31,FALSE)","v":3}]
[373,{"$f":"+VLOOKUP(+$A6,'Data Input'!$A$3:$AX$32,2,FALSE)","v":"Meggie"},{"$f":"+VLOOKUP(+$A6,'Data Input'!$A$3:$AX$32,3,FALSE)","v":"J Tansley"},{"$f":"+VLOOKUP(+$A6,'Data Input'!$A$3:$AX$32,4,FALSE)","v":34.9},{"$f":"+VLOOKUP(+$A6,'Data Input'!$A$3:$AX$32,5,FALSE)","v":16},{"$f":"+VLOOKUP(+$A6,'Data Input'!$A$3:$AX$32,6,FALSE)","v":""},{"$f":"+VLOOKUP(+$A6,'Data Input'!$A$3:$AX$32,7,FALSE)","v":"A"},{"$f":"+VLOOKUP($A6,'Data Input'!$A$3:$AX$32,27,FALSE)","v":5},{"$f":"+VLOOKUP($A6,'Data Input'!$A$3:$AX$32,28,FALSE)","v":28},{"$f":"+VLOOKUP($A6,'Data Input'!$A$3:$AX$32,29,FALSE)","v":45},null,{"$f":"+VLOOKUP($A6,'Data Input'!$A$3:$AX$32,31,FALSE)","v":4}]
[369,{"$f":"+VLOOKUP(+$A7,'Data Input'!$A$3:$AX$32,2,FALSE)","v":"Moonshadow"},{"$f":"+VLOOKUP(+$A7,'Data Input'!$A$3:$AX$32,3,FALSE)","v":"N Hovey"},{"$f":"+VLOOKUP(+$A7,'Data Input'!$A$3:$AX$32,4,FALSE)","v":31.5},{"$f":"+VLOOKUP(+$A7,'Data Input'!$A$3:$AX$32,5,FALSE)","v":4},{"$f":"+VLOOKUP(+$A7,'Data Input'!$A$3:$AX$32,6,FALSE)","v":""},{"$f":"+VLOOKUP(+$A7,'Data Input'!$A$3:$AX$32,7,FALSE)","v":"A"},{"$f":"+VLOOKUP($A7,'Data Input'!$A$3:$AX$32,27,FALSE)","v":5},{"$f":"+VLOOKUP($A7,'Data Input'!$A$3:$AX$32,28,FALSE)","v":29},{"$f":"+VLOOKUP($A7,'Data Input'!$A$3:$AX$32,29,FALSE)","v":11},null,{"$f":"+VLOOKUP($A7,'Data Input'!$A$3:$AX$32,31,FALSE)","v":5}]
[335,{"$f":"+VLOOKUP(+$A8,'Data Input'!$A$3:$AX$32,2,FALSE)","v":"Firebird"},{"$f":"+VLOOKUP(+$A8,'Data Input'!$A$3:$AX$32,3,FALSE)","v":"R Richardson"},{"$f":"+VLOOKUP(+$A8,'Data Input'!$A$3:$AX$32,4,FALSE)","v":30},{"$f":"+VLOOKUP(+$A8,'Data Input'!$A$3:$AX$32,5,FALSE)","v":1},{"$f":"+VLOOKUP(+$A8,'Data Input'!$A$3:$AX$32,6,FALSE)","v":""},{"$f":"+VLOOKUP(+$A8,'Data Input'!$A$3:$AX$32,7,FALSE)","v":"A"},{"$f":"+VLOOKUP($A8,'Data Input'!$A$3:$AX$32,27,FALSE)","v":5},{"$f":"+VLOOKUP($A8,'Data Input'!$A$3:$AX$32,28,FALSE)","v":36},{"$f":"+VLOOKUP($A8,'Data Input'!$A$3:$AX$32,29,FALSE)","v":17},null,{"$f":"+VLOOKUP($A8,'Data Input'!$A$3:$AX$32,31,FALSE)","v":6}]
[217,{"$f":"+VLOOKUP(+$A9,'Data Input'!$A$3:$AX$32,2,FALSE)","v":"Melinda"},{"$f":"+VLOOKUP(+$A9,'Data Input'!$A$3:$AX$32,3,FALSE)","v":"P Howes"},{"$f":"+VLOOKUP(+$A9,'Data Input'!$A$3:$AX$32,4,FALSE)","v":27.9},{"$f":"+VLOOKUP(+$A9,'Data Input'!$A$3:$AX$32,5,FALSE)","v":1},{"$f":"+VLOOKUP(+$A9,'Data Input'!$A$3:$AX$32,6,FALSE)","v":""},{"$f":"+VLOOKUP(+$A9,'Data Input'!$A$3:$AX$32,7,FALSE)","v":"B"},{"$f":"+VLOOKUP($A9,'Data Input'!$A$3:$AX$32,27,FALSE)","v":5},{"$f":"+VLOOKUP($A9,'Data Input'!$A$3:$AX$32,28,FALSE)","v":39},{"$f":"+VLOOKUP($A9,'Data Input'!$A$3:$AX$32,29,FALSE)","v":37},null,{"$f":"+VLOOKUP($A9,'Data Input'!$A$3:$AX$32,31,FALSE)","v":7}]
[368,{"$f":"+VLOOKUP(+$A10,'Data Input'!$A$3:$AX$32,2,FALSE)","v":"Wandering Rose"},{"$f":"+VLOOKUP(+$A10,'Data Input'!$A$3:$AX$32,3,FALSE)","v":"  Radley"},{"$f":"+VLOOKUP(+$A10,'Data Input'!$A$3:$AX$32,4,FALSE)","v":31},{"$f":"+VLOOKUP(+$A10,'Data Input'!$A$3:$AX$32,5,FALSE)","v":-2},{"$f":"+VLOOKUP(+$A10,'Data Input'!$A$3:$AX$32,6,FALSE)","v":""},{"$f":"+VLOOKUP(+$A10,'Data Input'!$A$3:$AX$32,7,FALSE)","v":"A"},{"$f":"+VLOOKUP($A10,'Data Input'!$A$3:$AX$32,27,FALSE)","v":5},{"$f":"+VLOOKUP($A10,'Data Input'!$A$3:$AX$32,28,FALSE)","v":46},{"$f":"+VLOOKUP($A10,'Data Input'!$A$3:$AX$32,29,FALSE)","v":43},null,{"$f":"+VLOOKUP($A10,'Data Input'!$A$3:$AX$32,31,FALSE)","v":8}]
[22,{"$f":"+VLOOKUP(+$A11,'Data Input'!$A$3:$AX$32,2,FALSE)","v":"Moonraker"},{"$f":"+VLOOKUP(+$A11,'Data Input'!$A$3:$AX$32,3,FALSE)","v":"P Jeckells"},{"$f":"+VLOOKUP(+$A11,'Data Input'!$A$3:$AX$32,4,FALSE)","v":29.5},{"$f":"+VLOOKUP(+$A11,'Data Input'!$A$3:$AX$32,5,FALSE)","v":2},{"$f":"+VLOOKUP(+$A11,'Data Input'!$A$3:$AX$32,6,FALSE)","v":""},{"$f":"+VLOOKUP(+$A11,'Data Input'!$A$3:$AX$32,7,FALSE)","v":"A"},{"$f":"+VLOOKUP($A11,'Data Input'!$A$3:$AX$32,27,FALSE)","v":5},{"$f":"+VLOOKUP($A11,'Data Input'!$A$3:$AX$32,28,FALSE)","v":47},{"$f":"+VLOOKUP($A11,'Data Input'!$A$3:$AX$32,29,FALSE)","v":45},null,{"$f":"+VLOOKUP($A11,'Data Input'!$A$3:$AX$32,31,FALSE)","v":9}]
[7,{"$f":"+VLOOKUP(+$A12,'Data Input'!$A$3:$AX$32,2,FALSE)","v":"Forester"},{"$f":"+VLOOKUP(+$A12,'Data Input'!$A$3:$AX$32,3,FALSE)","v":"S  Bentall"},{"$f":"+VLOOKUP(+$A12,'Data Input'!$A$3:$AX$32,4,FALSE)","v":32.5},{"$f":"+VLOOKUP(+$A12,'Data Input'!$A$3:$AX$32,5,FALSE)","v":-8},{"$f":"+VLOOKUP(+$A12,'Data Input'!$A$3:$AX$32,6,FALSE)","v":""},{"$f":"+VLOOKUP(+$A12,'Data Input'!$A$3:$AX$32,7,FALSE)","v":"A"},{"$f":"+VLOOKUP($A12,'Data Input'!$A$3:$AX$32,27,FALSE)","v":5},{"$f":"+VLOOKUP($A12,'Data Input'!$A$3:$AX$32,28,FALSE)","v":52},{"$f":"+VLOOKUP($A12,'Data Input'!$A$3:$AX$32,29,FALSE)","v":47},null,{"$f":"+VLOOKUP($A12,'Data Input'!$A$3:$AX$32,31,FALSE)","v":10}]
[244,{"$f":"+VLOOKUP(+$A13,'Data Input'!$A$3:$AX$32,2,FALSE)","v":"Catspaw"},{"$f":"+VLOOKUP(+$A13,'Data Input'!$A$3:$AX$32,3,FALSE)","v":"B Wilkins"},{"$f":"+VLOOKUP(+$A13,'Data Input'!$A$3:$AX$32,4,FALSE)","v":28},{"$f":"+VLOOKUP(+$A13,'Data Input'!$A$3:$AX$32,5,FALSE)","v":-5},{"$f":"+VLOOKUP(+$A13,'Data Input'!$A$3:$AX$32,6,FALSE)","v":""},{"$f":"+VLOOKUP(+$A13,'Data Input'!$A$3:$AX$32,7,FALSE)","v":"B"},{"$f":"+VLOOKUP($A13,'Data Input'!$A$3:$AX$32,27,FALSE)","v":5},{"$f":"+VLOOKUP($A13,'Data Input'!$A$3:$AX$32,28,FALSE)","v":57},{"$f":"+VLOOKUP($A13,'Data Input'!$A$3:$AX$32,29,FALSE)","v":26},null,{"$f":"+VLOOKUP($A13,'Data Input'!$A$3:$AX$32,31,FALSE)","v":11}]
[370,{"$f":"+VLOOKUP(+$A14,'Data Input'!$A$3:$AX$32,2,FALSE)","v":"Glory"},{"$f":"+VLOOKUP(+$A14,'Data Input'!$A$3:$AX$32,3,FALSE)","v":"C Brown"},{"$f":"+VLOOKUP(+$A14,'Data Input'!$A$3:$AX$32,4,FALSE)","v":35},{"$f":"+VLOOKUP(+$A14,'Data Input'!$A$3:$AX$32,5,FALSE)","v":-6},{"$f":"+VLOOKUP(+$A14,'Data Input'!$A$3:$AX$32,6,FALSE)","v":""},{"$f":"+VLOOKUP(+$A14,'Data Input'!$A$3:$AX$32,7,FALSE)","v":"A"},{"$f":"+VLOOKUP($A14,'Data Input'!$A$3:$AX$32,27,FALSE)","v":6},{"$f":"+VLOOKUP($A14,'Data Input'!$A$3:$AX$32,28,FALSE)","v":6},{"$f":"+VLOOKUP($A14,'Data Input'!$A$3:$AX$32,29,FALSE)","v":48},null,{"$f":"+VLOOKUP($A14,'Data Input'!$A$3:$AX$32,31,FALSE)","v":12}]
[199,{"$f":"+VLOOKUP(+$A15,'Data Input'!$A$3:$AX$32,2,FALSE)","v":"Morning Calm"},{"$f":"+VLOOKUP(+$A15,'Data Input'!$A$3:$AX$32,3,FALSE)","v":"W Clark"},{"$f":"+VLOOKUP(+$A15,'Data Input'!$A$3:$AX$32,4,FALSE)","v":26},{"$f":"+VLOOKUP(+$A15,'Data Input'!$A$3:$AX$32,5,FALSE)","v":-9},{"$f":"+VLOOKUP(+$A15,'Data Input'!$A$3:$AX$32,6,FALSE)","v":""},{"$f":"+VLOOKUP(+$A15,'Data Input'!$A$3:$AX$32,7,FALSE)","v":"B"},{"$f":"+VLOOKUP($A15,'Data Input'!$A$3:$AX$32,27,FALSE)","v":6},{"$f":"+VLOOKUP($A15,'Data Input'!$A$3:$AX$32,28,FALSE)","v":10},{"$f":"+VLOOKUP($A15,'Data Input'!$A$3:$AX$32,29,FALSE)","v":52},null,{"$f":"+VLOOKUP($A15,'Data Input'!$A$3:$AX$32,31,FALSE)","v":13}]
[400,{"$f":"+VLOOKUP(+$A16,'Data Input'!$A$3:$AX$32,2,FALSE)","v":"Swallowtail"},{"$f":"+VLOOKUP(+$A16,'Data Input'!$A$3:$AX$32,3,FALSE)","v":"K Halifax"},{"$f":"+VLOOKUP(+$A16,'Data Input'!$A$3:$AX$32,4,FALSE)","v":26.5},{"$f":"+VLOOKUP(+$A16,'Data Input'!$A$3:$AX$32,5,FALSE)","v":-7},{"$f":"+VLOOKUP(+$A16,'Data Input'!$A$3:$AX$32,6,FALSE)","v":""},{"$f":"+VLOOKUP(+$A16,'Data Input'!$A$3:$AX$32,7,FALSE)","v":"B"},{"$f":"+VLOOKUP($A16,'Data Input'!$A$3:$AX$32,27,FALSE)","v":6},{"$f":"+VLOOKUP($A16,'Data Input'!$A$3:$AX$32,28,FALSE)","v":13},{"$f":"+VLOOKUP($A16,'Data Input'!$A$3:$AX$32,29,FALSE)","v":7},null,{"$f":"+VLOOKUP($A16,'Data Input'!$A$3:$AX$32,31,FALSE)","v":14}]
[24,{"$f":"+VLOOKUP(+$A17,'Data Input'!$A$3:$AX$32,2,FALSE)","v":"Pippa"},{"$f":"+VLOOKUP(+$A17,'Data Input'!$A$3:$AX$32,3,FALSE)","v":"G Angell"},{"$f":"+VLOOKUP(+$A17,'Data Input'!$A$3:$AX$32,4,FALSE)","v":27.5},{"$f":"+VLOOKUP(+$A17,'Data Input'!$A$3:$AX$32,5,FALSE)","v":-7},{"$f":"+VLOOKUP(+$A17,'Data Input'!$A$3:$AX$32,6,FALSE)","v":""},{"$f":"+VLOOKUP(+$A17,'Data Input'!$A$3:$AX$32,7,FALSE)","v":"B"},{"$f":"+VLOOKUP($A17,'Data Input'!$A$3:$AX$32,27,FALSE)","v":6},{"$f":"+VLOOKUP($A17,'Data Input'!$A$3:$AX$32,28,FALSE)","v":14},{"$f":"+VLOOKUP($A17,'Data Input'!$A$3:$AX$32,29,FALSE)","v":34},null,{"$f":"+VLOOKUP($A17,'Data Input'!$A$3:$AX$32,31,FALSE)","v":15}]
[117,{"$f":"+VLOOKUP(+$A18,'Data Input'!$A$3:$AX$32,2,FALSE)","v":"Anne"},{"$f":"+VLOOKUP(+$A18,'Data Input'!$A$3:$AX$32,3,FALSE)","v":"D Church"},{"$f":"+VLOOKUP(+$A18,'Data Input'!$A$3:$AX$32,4,FALSE)","v":34.5},{"$f":"+VLOOKUP(+$A18,'Data Input'!$A$3:$AX$32,5,FALSE)","v":-3},{"$f":"+VLOOKUP(+$A18,'Data Input'!$A$3:$AX$32,6,FALSE)","v":""},{"$f":"+VLOOKUP(+$A18,'Data Input'!$A$3:$AX$32,7,FALSE)","v":"A"},{"$f":"+VLOOKUP($A18,'Data Input'!$A$3:$AX$32,27,FALSE)","v":6},{"$f":"+VLOOKUP($A18,'Data Input'!$A$3:$AX$32,28,FALSE)","v":14},{"$f":"+VLOOKUP($A18,'Data Input'!$A$3:$AX$32,29,FALSE)","v":50},null,{"$f":"+VLOOKUP($A18,'Data Input'!$A$3:$AX$32,31,FALSE)","v":16}]
[418,{"$f":"+VLOOKUP(+$A19,'Data Input'!$A$3:$AX$32,2,FALSE)","v":"Tinkerbell"},{"$f":"+VLOOKUP(+$A19,'Data Input'!$A$3:$AX$32,3,FALSE)","v":"A Lincoln"},{"$f":"+VLOOKUP(+$A19,'Data Input'!$A$3:$AX$32,4,FALSE)","v":25.2},{"$f":"+VLOOKUP(+$A19,'Data Input'!$A$3:$AX$32,5,FALSE)","v":-6},{"$f":"+VLOOKUP(+$A19,'Data Input'!$A$3:$AX$32,6,FALSE)","v":""},{"$f":"+VLOOKUP(+$A19,'Data Input'!$A$3:$AX$32,7,FALSE)","v":"B"},{"$f":"+VLOOKUP($A19,'Data Input'!$A$3:$AX$32,27,FALSE)","v":6},{"$f":"+VLOOKUP($A19,'Data Input'!$A$3:$AX$32,28,FALSE)","v":16},{"$f":"+VLOOKUP($A19,'Data Input'!$A$3:$AX$32,29,FALSE)","v":21},null,{"$f":"+VLOOKUP($A19,'Data Input'!$A$3:$AX$32,31,FALSE)","v":17}]
[179,{"$f":"+VLOOKUP(+$A20,'Data Input'!$A$3:$AX$32,2,FALSE)","v":"Waxwing"},{"$f":"+VLOOKUP(+$A20,'Data Input'!$A$3:$AX$32,3,FALSE)","v":"S Clayton"},{"$f":"+VLOOKUP(+$A20,'Data Input'!$A$3:$AX$32,4,FALSE)","v":28},{"$f":"+VLOOKUP(+$A20,'Data Input'!$A$3:$AX$32,5,FALSE)","v":-8},{"$f":"+VLOOKUP(+$A20,'Data Input'!$A$3:$AX$32,6,FALSE)","v":""},{"$f":"+VLOOKUP(+$A20,'Data Input'!$A$3:$AX$32,7,FALSE)","v":"B"},{"$f":"+VLOOKUP($A20,'Data Input'!$A$3:$AX$32,27,FALSE)","v":6},{"$f":"+VLOOKUP($A20,'Data Input'!$A$3:$AX$32,28,FALSE)","v":18},{"$f":"+VLOOKUP($A20,'Data Input'!$A$3:$AX$32,29,FALSE)","v":3},null,{"$f":"+VLOOKUP($A20,'Data Input'!$A$3:$AX$32,31,FALSE)","v":18}]
[15,{"$f":"+VLOOKUP(+$A21,'Data Input'!$A$3:$AX$32,2,FALSE)","v":"Pirate"},{"$f":"+VLOOKUP(+$A21,'Data Input'!$A$3:$AX$32,3,FALSE)","v":"T Moore"},{"$f":"+VLOOKUP(+$A21,'Data Input'!$A$3:$AX$32,4,FALSE)","v":30},{"$f":"+VLOOKUP(+$A21,'Data Input'!$A$3:$AX$32,5,FALSE)","v":-7},{"$f":"+VLOOKUP(+$A21,'Data Input'!$A$3:$AX$32,6,FALSE)","v":""},{"$f":"+VLOOKUP(+$A21,'Data Input'!$A$3:$AX$32,7,FALSE)","v":"A"},{"$f":"+VLOOKUP($A21,'Data Input'!$A$3:$AX$32,27,FALSE)","v":6},{"$f":"+VLOOKUP($A21,'Data Input'!$A$3:$AX$32,28,FALSE)","v":21},{"$f":"+VLOOKUP($A21,'Data Input'!$A$3:$AX$32,29,FALSE)","v":41},null,{"$f":"+VLOOKUP($A21,'Data Input'!$A$3:$AX$32,31,FALSE)","v":19}]
[224,{"$f":"+VLOOKUP(+$A22,'Data Input'!$A$3:$AX$32,2,FALSE)","v":"Anna"},{"$f":"+VLOOKUP(+$A22,'Data Input'!$A$3:$AX$32,3,FALSE)","v":"R Branscombe"},{"$f":"+VLOOKUP(+$A22,'Data Input'!$A$3:$AX$32,4,FALSE)","v":25},{"$f":"+VLOOKUP(+$A22,'Data Input'!$A$3:$AX$32,5,FALSE)","v":-9},{"$f":"+VLOOKUP(+$A22,'Data Input'!$A$3:$AX$32,6,FALSE)","v":""},{"$f":"+VLOOKUP(+$A22,'Data Input'!$A$3:$AX$32,7,FALSE)","v":"B"},{"$f":"+VLOOKUP($A22,'Data Input'!$A$3:$AX$32,27,FALSE)","v":6},{"$f":"+VLOOKUP($A22,'Data Input'!$A$3:$AX$32,28,FALSE)","v":32},{"$f":"+VLOOKUP($A22,'Data Input'!$A$3:$AX$32,29,FALSE)","v":4},null,{"$f":"+VLOOKUP($A22,'Data Input'!$A$3:$AX$32,31,FALSE)","v":20}]
[155,{"$f":"+VLOOKUP(+$A23,'Data Input'!$A$3:$AX$32,2,FALSE)","v":"Stratos"},{"$f":"+VLOOKUP(+$A23,'Data Input'!$A$3:$AX$32,3,FALSE)","v":"J Townley"},{"$f":"+VLOOKUP(+$A23,'Data Input'!$A$3:$AX$32,4,FALSE)","v":22.6},{"$f":"+VLOOKUP(+$A23,'Data Input'!$A$3:$AX$32,5,FALSE)","v":-17},{"$f":"+VLOOKUP(+$A23,'Data Input'!$A$3:$AX$32,6,FALSE)","v":""},{"$f":"+VLOOKUP(+$A23,'Data Input'!$A$3:$AX$32,7,FALSE)","v":"C"},{"$f":"+VLOOKUP($A23,'Data Input'!$A$3:$AX$32,27,FALSE)","v":7},{"$f":"+VLOOKUP($A23,'Data Input'!$A$3:$AX$32,28,FALSE)","v":4},{"$f":"+VLOOKUP($A23,'Data Input'!$A$3:$AX$32,29,FALSE)","v":34},null,{"$f":"+VLOOKUP($A23,'Data Input'!$A$3:$AX$32,31,FALSE)","v":21}]
[87,{"$f":"+VLOOKUP(+$A24,'Data Input'!$A$3:$AX$32,2,FALSE)","v":"Modwena"},{"$f":"+VLOOKUP(+$A24,'Data Input'!$A$3:$AX$32,3,FALSE)","v":"M Cassidy"},{"$f":"+VLOOKUP(+$A24,'Data Input'!$A$3:$AX$32,4,FALSE)","v":24.8},{"$f":"+VLOOKUP(+$A24,'Data Input'!$A$3:$AX$32,5,FALSE)","v":-18},{"$f":"+VLOOKUP(+$A24,'Data Input'!$A$3:$AX$32,6,FALSE)","v":""},{"$f":"+VLOOKUP(+$A24,'Data Input'!$A$3:$AX$32,7,FALSE)","v":"C"},{"$f":"+VLOOKUP($A24,'Data Input'!$A$3:$AX$32,27,FALSE)","v":7},{"$f":"+VLOOKUP($A24,'Data Input'!$A$3:$AX$32,28,FALSE)","v":13},{"$f":"+VLOOKUP($A24,'Data Input'!$A$3:$AX$32,29,FALSE)","v":14},null,{"$f":"+VLOOKUP($A24,'Data Input'!$A$3:$AX$32,31,FALSE)","v":22}]
[78,{"$f":"+VLOOKUP(+$A25,'Data Input'!$A$3:$AX$32,2,FALSE)","v":"Halcyon"},{"$f":"+VLOOKUP(+$A25,'Data Input'!$A$3:$AX$32,3,FALSE)","v":"R Wilson"},{"$f":"+VLOOKUP(+$A25,'Data Input'!$A$3:$AX$32,4,FALSE)","v":29.5},{"$f":"+VLOOKUP(+$A25,'Data Input'!$A$3:$AX$32,5,FALSE)","v":-7},{"$f":"+VLOOKUP(+$A25,'Data Input'!$A$3:$AX$32,6,FALSE)","v":"DNS"},{"$f":"+VLOOKUP(+$A25,'Data Input'!$A$3:$AX$32,7,FALSE)","v":"A"},{"$f":"+VLOOKUP($A25,'Data Input'!$A$3:$AX$32,27,FALSE)","v":{"$error":"#VALUE!"}},{"$f":"+VLOOKUP($A25,'Data Input'!$A$3:$AX$32,28,FALSE)","v":{"$error":"#VALUE!"}},{"$f":"+VLOOKUP($A25,'Data Input'!$A$3:$AX$32,29,FALSE)","v":{"$error":"#VALUE!"}},null,{"$f":"+VLOOKUP($A25,'Data Input'!$A$3:$AX$32,31,FALSE)","v":"DNS"}]
[323,{"$f":"+VLOOKUP(+$A26,'Data Input'!$A$3:$AX$32,2,FALSE)","v":"Starlight Lady"},{"$f":"+VLOOKUP(+$A26,'Data Input'!$A$3:$AX$32,3,FALSE)","v":"N.Matthews"},{"$f":"+VLOOKUP(+$A26,'Data Input'!$A$3:$AX$32,4,FALSE)","v":30},{"$f":"+VLOOKUP(+$A26,'Data Input'!$A$3:$AX$32,5,FALSE)","v":13},{"$f":"+VLOOKUP(+$A26,'Data Input'!$A$3:$AX$32,6,FALSE)","v":"DNS"},{"$f":"+VLOOKUP(+$A26,'Data Input'!$A$3:$AX$32,7,FALSE)","v":"A"},{"$f":"+VLOOKUP($A26,'Data Input'!$A$3:$AX$32,27,FALSE)","v":{"$error":"#VALUE!"}},{"$f":"+VLOOKUP($A26,'Data Input'!$A$3:$AX$32,28,FALSE)","v":{"$error":"#VALUE!"}},{"$f":"+VLOOKUP($A26,'Data Input'!$A$3:$AX$32,29,FALSE)","v":{"$error":"#VALUE!"}},null,{"$f":"+VLOOKUP($A26,'Data Input'!$A$3:$AX$32,31,FALSE)","v":"DNS"}]
[141,{"$f":"+VLOOKUP(+$A27,'Data Input'!$A$3:$AX$32,2,FALSE)","v":"Nirvana"},{"$f":"+VLOOKUP(+$A27,'Data Input'!$A$3:$AX$32,3,FALSE)","v":" M Claridge"},{"$f":"+VLOOKUP(+$A27,'Data Input'!$A$3:$AX$32,4,FALSE)","v":20},{"$f":"+VLOOKUP(+$A27,'Data Input'!$A$3:$AX$32,5,FALSE)","v":-23},{"$f":"+VLOOKUP(+$A27,'Data Input'!$A$3:$AX$32,6,FALSE)","v":"P"},{"$f":"+VLOOKUP(+$A27,'Data Input'!$A$3:$AX$32,7,FALSE)","v":"C"},{"$f":"+VLOOKUP($A27,'Data Input'!$A$3:$AX$32,27,FALSE)","v":7},{"$f":"+VLOOKUP($A27,'Data Input'!$A$3:$AX$32,28,FALSE)","v":32},{"$f":"+VLOOKUP($A27,'Data Input'!$A$3:$AX$32,29,FALSE)","v":1},null,{"$f":"+VLOOKUP($A27,'Data Input'!$A$3:$AX$32,31,FALSE)","v":"P"}]
[226,{"$f":"+VLOOKUP(+$A28,'Data Input'!$A$3:$AX$32,2,FALSE)","v":"Medina"},{"$f":"+VLOOKUP(+$A28,'Data Input'!$A$3:$AX$32,3,FALSE)","v":"S Brown"},{"$f":"+VLOOKUP(+$A28,'Data Input'!$A$3:$AX$32,4,FALSE)","v":26},{"$f":"+VLOOKUP(+$A28,'Data Input'!$A$3:$AX$32,5,FALSE)","v":-9},{"$f":"+VLOOKUP(+$A28,'Data Input'!$A$3:$AX$32,6,FALSE)","v":"P"},{"$f":"+VLOOKUP(+$A28,'Data Input'!$A$3:$AX$32,7,FALSE)","v":"B"},{"$f":"+VLOOKUP($A28,'Data Input'!$A$3:$AX$32,27,FALSE)","v":7},{"$f":"+VLOOKUP($A28,'Data Input'!$A$3:$AX$32,28,FALSE)","v":6},{"$f":"+VLOOKUP($A28,'Data Input'!$A$3:$AX$32,29,FALSE)","v":28},null,{"$f":"+VLOOKUP($A28,'Data Input'!$A$3:$AX$32,31,FALSE)","v":"P"}]
[356,{"$f":"+VLOOKUP(+$A29,'Data Input'!$A$3:$AX$32,2,FALSE)","v":"Amsel"},{"$f":"+VLOOKUP(+$A29,'Data Input'!$A$3:$AX$32,3,FALSE)","v":"D McCarter"},{"$f":"+VLOOKUP(+$A29,'Data Input'!$A$3:$AX$32,4,FALSE)","v":28},{"$f":"+VLOOKUP(+$A29,'Data Input'!$A$3:$AX$32,5,FALSE)","v":-18},{"$f":"+VLOOKUP(+$A29,'Data Input'!$A$3:$AX$32,6,FALSE)","v":"RET"},{"$f":"+VLOOKUP(+$A29,'Data Input'!$A$3:$AX$32,7,FALSE)","v":"B"},{"$f":"+VLOOKUP($A29,'Data Input'!$A$3:$AX$32,27,FALSE)","v":7},{"$f":"+VLOOKUP($A29,'Data Input'!$A$3:$AX$32,28,FALSE)","v":53},{"$f":"+VLOOKUP($A29,'Data Input'!$A$3:$AX$32,29,FALSE)","v":46},null,{"$f":"+VLOOKUP($A29,'Data Input'!$A$3:$AX$32,31,FALSE)","v":"RET"}]
[222,{"$f":"+VLOOKUP(+$A30,'Data Input'!$A$3:$AX$32,2,FALSE)","v":"Swallowtail"},{"$f":"+VLOOKUP(+$A30,'Data Input'!$A$3:$AX$32,3,FALSE)","v":"J Wells"},{"$f":"+VLOOKUP(+$A30,'Data Input'!$A$3:$AX$32,4,FALSE)","v":28},{"$f":"+VLOOKUP(+$A30,'Data Input'!$A$3:$AX$32,5,FALSE)","v":-5},{"$f":"+VLOOKUP(+$A30,'Data Input'!$A$3:$AX$32,6,FALSE)","v":"RET"},{"$f":"+VLOOKUP(+$A30,'Data Input'!$A$3:$AX$32,7,FALSE)","v":"B"},{"$f":"+VLOOKUP($A30,'Data Input'!$A$3:$AX$32,27,FALSE)","v":8},{"$f":"+VLOOKUP($A30,'Data Input'!$A$3:$AX$32,28,FALSE)","v":6},{"$f":"+VLOOKUP($A30,'Data Input'!$A$3:$AX$32,29,FALSE)","v":48},null,{"$f":"+VLOOKUP($A30,'Data Input'!$A$3:$AX$32,31,FALSE)","v":"RET"}]
[240,{"$f":"+VLOOKUP(+$A31,'Data Input'!$A$3:$AX$32,2,FALSE)","v":"Avocet"},{"$f":"+VLOOKUP(+$A31,'Data Input'!$A$3:$AX$32,3,FALSE)","v":"R  Branford"},{"$f":"+VLOOKUP(+$A31,'Data Input'!$A$3:$AX$32,4,FALSE)","v":28},{"$f":"+VLOOKUP(+$A31,'Data Input'!$A$3:$AX$32,5,FALSE)","v":-16},{"$f":"+VLOOKUP(+$A31,'Data Input'!$A$3:$AX$32,6,FALSE)","v":"RET"},{"$f":"+VLOOKUP(+$A31,'Data Input'!$A$3:$AX$32,7,FALSE)","v":"B"},{"$f":"+VLOOKUP($A31,'Data Input'!$A$3:$AX$32,27,FALSE)","v":8},{"$f":"+VLOOKUP($A31,'Data Input'!$A$3:$AX$32,28,FALSE)","v":22},{"$f":"+VLOOKUP($A31,'Data Input'!$A$3:$AX$32,29,FALSE)","v":35},null,{"$f":"+VLOOKUP($A31,'Data Input'!$A$3:$AX$32,31,FALSE)","v":"RET"}]
[]
[]
[]
[]
[]
[]
[]
[]
[]
[]
[]
[]
[]
[]
[]
[]
[]
[{"$f":"+COUNT(A3:A48)","v":29}]

{"sheet":"Classes","index":3,"n_rows":57,"n_cols":13,"rows_kept":57,"cut":false,"hidden":false,"merged":[]}
["No","Yacht","Skipper","Length","H/C","P","Class",null,"Corrected",null,null,"Pos"]
[null,null,null,null,null,null,null,"H","M","S",null,null," "]
[null,"Starlight Lady"]
[]
[177,{"$f":"+VLOOKUP(+$A5,'Data Input'!$A$3:$AX$32,2,FALSE)","v":"Breeze"},{"$f":"+VLOOKUP(+$A5,'Data Input'!$A$3:$AX$32,3,FALSE)","v":"M Ellis"},{"$f":"+VLOOKUP(+$A5,'Data Input'!$A$3:$AX$32,4,FALSE)","v":32},{"$f":"+VLOOKUP(+$A5,'Data Input'!$A$3:$AX$32,5,FALSE)","v":2},{"$f":"+VLOOKUP(+$A5,'Data Input'!$A$3:$AX$32,6,FALSE)","v":""},{"$f":"+VLOOKUP(+$A5,'Data Input'!$A$3:$AX$32,7,FALSE)","v":"A"},{"$f":"+VLOOKUP($A5,'Data Input'!$A$3:$AX$32,33,FALSE)","v":5},{"$f":"+VLOOKUP($A5,'Data Input'!$A$3:$AX$32,34,FALSE)","v":23},{"$f":"+VLOOKUP($A5,'Data Input'!$A$3:$AX$32,35,FALSE)","v":49.979999999999563},null,{"$f":"+VLOOKUP($A5,'Data Input'!$A$3:$AX$32,37,FALSE)","v":1}]
[7,{"$f":"+VLOOKUP(+$A6,'Data Input'!$A$3:$AX$32,2,FALSE)","v":"Forester"},{"$f":"+VLOOKUP(+$A6,'Data Input'!$A$3:$AX$32,3,FALSE)","v":"S  Bentall"},{"$f":"+VLOOKUP(+$A6,'Data Input'!$A$3:$AX$32,4,FALSE)","v":32.5},{"$f":"+VLOOKUP(+$A6,'Data Input'!$A$3:$AX$32,5,FALSE)","v":-8},{"$f":"+VLOOKUP(+$A6,'Data Input'!$A$3:$AX$32,6,FALSE)","v":""},{"$f":"+VLOOKUP(+$A6,'Data Input'!$A$3:$AX$32,7,FALSE)","v":"A"},{"$f":"+VLOOKUP($A6,'Data Input'!$A$3:$AX$32,33,FALSE)","v":5},{"$f":"+VLOOKUP($A6,'Data Input'!$A$3:$AX$32,34,FALSE)","v":24},{"$f":"+VLOOKUP($A6,'Data Input'!$A$3:$AX$32,35,FALSE)","v":33.639999999999418},null,2]
[52,{"$f":"+VLOOKUP(+$A7,'Data Input'!$A$3:$AX$32,2,FALSE)","v":"Maidie"},{"$f":"+VLOOKUP(+$A7,'Data Input'!$A$3:$AX$32,3,FALSE)","v":"M Barnes"},{"$f":"+VLOOKUP(+$A7,'Data Input'!$A$3:$AX$32,4,FALSE)","v":43.2},{"$f":"+VLOOKUP(+$A7,'Data Input'!$A$3:$AX$32,5,FALSE)","v":12},{"$f":"+VLOOKUP(+$A7,'Data Input'!$A$3:$AX$32,6,FALSE)","v":""},{"$f":"+VLOOKUP(+$A7,'Data Input'!$A$3:$AX$32,7,FALSE)","v":"A"},{"$f":"+VLOOKUP($A7,'Data Input'!$A$3:$AX$32,33,FALSE)","v":5},{"$f":"+VLOOKUP($A7,'Data Input'!$A$3:$AX$32,34,FALSE)","v":37},{"$f":"+VLOOKUP($A7,'Data Input'!$A$3:$AX$32,35,FALSE)","v":36.320000000003347},null,3]
[335,{"$f":"+VLOOKUP(+$A8,'Data Input'!$A$3:$AX$32,2,FALSE)","v":"Firebird"},{"$f":"+VLOOKUP(+$A8,'Data Input'!$A$3:$AX$32,3,FALSE)","v":"R Richardson"},{"$f":"+VLOOKUP(+$A8,'Data Input'!$A$3:$AX$32,4,FALSE)","v":30},{"$f":"+VLOOKUP(+$A8,'Data Input'!$A$3:$AX$32,5,FALSE)","v":1},{"$f":"+VLOOKUP(+$A8,'Data Input'!$A$3:$AX$32,6,FALSE)","v":""},{"$f":"+VLOOKUP(+$A8,'Data Input'!$A$3:$AX$32,7,FALSE)","v":"A"},{"$f":"+VLOOKUP($A8,'Data Input'!$A$3:$AX$32,33,FALSE)","v":5},{"$f":"+VLOOKUP($A8,'Data Input'!$A$3:$AX$32,34,FALSE)","v":39},{"$f":"+VLOOKUP($A8,'Data Input'!$A$3:$AX$32,35,FALSE)","v":38.770000000000437},null,4]
[368,{"$f":"+VLOOKUP(+$A9,'Data Input'!$A$3:$AX$32,2,FALSE)","v":"Wandering Rose"},{"$f":"+VLOOKUP(+$A9,'Data Input'!$A$3:$AX$32,3,FALSE)","v":"  Radley"},{"$f":"+VLOOKUP(+$A9,'Data Input'!$A$3:$AX$32,4,FALSE)","v":31},{"$f":"+VLOOKUP(+$A9,'Data Input'!$A$3:$AX$32,5,FALSE)","v":-2},{"$f":"+VLOOKUP(+$A9,'Data Input'!$A$3:$AX$32,6,FALSE)","v":""},{"$f":"+VLOOKUP(+$A9,'Data Input'!$A$3:$AX$32,7,FALSE)","v":"A"},{"$f":"+VLOOKUP($A9,'Data Input'!$A$3:$AX$32,33,FALSE)","v":5},{"$f":"+VLOOKUP($A9,'Data Input'!$A$3:$AX$32,34,FALSE)","v":39},{"$f":"+VLOOKUP($A9,'Data Input'!$A$3:$AX$32,35,FALSE)","v":46.93999999999869},null,5]
[369,{"$f":"+VLOOKUP(+$A10,'Data Input'!$A$3:$AX$32,2,FALSE)","v":"Moonshadow"},{"$f":"+VLOOKUP(+$A10,'Data Input'!$A$3:$AX$32,3,FALSE)","v":"N Hovey"},{"$f":"+VLOOKUP(+$A10,'Data Input'!$A$3:$AX$32,4,FALSE)","v":31.5},{"$f":"+VLOOKUP(+$A10,'Data Input'!$A$3:$AX$32,5,FALSE)","v":4},{"$f":"+VLOOKUP(+$A10,'Data Input'!$A$3:$AX$32,6,FALSE)","v":""},{"$f":"+VLOOKUP(+$A10,'Data Input'!$A$3:$AX$32,7,FALSE)","v":"A"},{"$f":"+VLOOKUP($A10,'Data Input'!$A$3:$AX$32,33,FALSE)","v":5},{"$f":"+VLOOKUP($A10,'Data Input'!$A$3:$AX$32,34,FALSE)","v":42},{"$f":"+VLOOKUP($A10,'Data Input'!$A$3:$AX$32,35,FALSE)","v":21.040000000000873},null,6]
[370,{"$f":"+VLOOKUP(+$A11,'Data Input'!$A$3:$AX$32,2,FALSE)","v":"Glory"},{"$f":"+VLOOKUP(+$A11,'Data Input'!$A$3:$AX$32,3,FALSE)","v":"C Brown"},{"$f":"+VLOOKUP(+$A11,'Data Input'!$A$3:$AX$32,4,FALSE)","v":35},{"$f":"+VLOOKUP(+$A11,'Data Input'!$A$3:$AX$32,5,FALSE)","v":-6},{"$f":"+VLOOKUP(+$A11,'Data Input'!$A$3:$AX$32,6,FALSE)","v":""},{"$f":"+VLOOKUP(+$A11,'Data Input'!$A$3:$AX$32,7,FALSE)","v":"A"},{"$f":"+VLOOKUP($A11,'Data Input'!$A$3:$AX$32,33,FALSE)","v":5},{"$f":"+VLOOKUP($A11,'Data Input'!$A$3:$AX$32,34,FALSE)","v":44},{"$f":"+VLOOKUP($A11,'Data Input'!$A$3:$AX$32,35,FALSE)","v":47.520000000000437},null,7]
[417,{"$f":"+VLOOKUP(+$A12,'Data Input'!$A$3:$AX$32,2,FALSE)","v":"Stellar"},{"$f":"+VLOOKUP(+$A12,'Data Input'!$A$3:$AX$32,3,FALSE)","v":"T Frary"},{"$f":"+VLOOKUP(+$A12,'Data Input'!$A$3:$AX$32,4,FALSE)","v":31.3},{"$f":"+VLOOKUP(+$A12,'Data Input'!$A$3:$AX$32,5,FALSE)","v":16},{"$f":"+VLOOKUP(+$A12,'Data Input'!$A$3:$AX$32,6,FALSE)","v":""},{"$f":"+VLOOKUP(+$A12,'Data Input'!$A$3:$AX$32,7,FALSE)","v":"A"},{"$f":"+VLOOKUP($A12,'Data Input'!$A$3:$AX$32,33,FALSE)","v":5},{"$f":"+VLOOKUP($A12,'Data Input'!$A$3:$AX$32,34,FALSE)","v":53},{"$f":"+VLOOKUP($A12,'Data Input'!$A$3:$AX$32,35,FALSE)","v":42.19999999999709},null,8]
[22,{"$f":"+VLOOKUP(+$A13,'Data Input'!$A$3:$AX$32,2,FALSE)","v":"Moonraker"},{"$f":"+VLOOKUP(+$A13,'Data Input'!$A$3:$AX$32,3,FALSE)","v":"P Jeckells"},{"$f":"+VLOOKUP(+$A13,'Data Input'!$A$3:$AX$32,4,FALSE)","v":29.5},{"$f":"+VLOOKUP(+$A13,'Data Input'!$A$3:$AX$32,5,FALSE)","v":2},{"$f":"+VLOOKUP(+$A13,'Data Input'!$A$3:$AX$32,6,FALSE)","v":""},{"$f":"+VLOOKUP(+$A13,'Data Input'!$A$3:$AX$32,7,FALSE)","v":"A"},{"$f":"+VLOOKUP($A13,'Data Input'!$A$3:$AX$32,33,FALSE)","v":5},{"$f":"+VLOOKUP($A13,'Data Input'!$A$3:$AX$32,34,FALSE)","v":54},{"$f":"+VLOOKUP($A13,'Data Input'!$A$3:$AX$32,35,FALSE)","v":42.299999999999272},null,9]
[15,{"$f":"+VLOOKUP(+$A14,'Data Input'!$A$3:$AX$32,2,FALSE)","v":"Pirate"},{"$f":"+VLOOKUP(+$A14,'Data Input'!$A$3:$AX$32,3,FALSE)","v":"T Moore"},{"$f":"+VLOOKUP(+$A14,'Data Input'!$A$3:$AX$32,4,FALSE)","v":30},{"$f":"+VLOOKUP(+$A14,'Data Input'!$A$3:$AX$32,5,FALSE)","v":-7},{"$f":"+VLOOKUP(+$A14,'Data Input'!$A$3:$AX$32,6,FALSE)","v":""},{"$f":"+VLOOKUP(+$A14,'Data Input'!$A$3:$AX$32,7,FALSE)","v":"A"},{"$f":"+VLOOKUP($A14,'Data Input'!$A$3:$AX$32,33,FALSE)","v":5},{"$f":"+VLOOKUP($A14,'Data Input'!$A$3:$AX$32,34,FALSE)","v":54},{"$f":"+VLOOKUP($A14,'Data Input'!$A$3:$AX$32,35,FALSE)","v":57.930000000000291},null,10]
[117,{"$f":"+VLOOKUP(+$A15,'Data Input'!$A$3:$AX$32,2,FALSE)","v":"Anne"},{"$f":"+VLOOKUP(+$A15,'Data Input'!$A$3:$AX$32,3,FALSE)","v":"D Church"},{"$f":"+VLOOKUP(+$A15,'Data Input'!$A$3:$AX$32,4,FALSE)","v":34.5},{"$f":"+VLOOKUP(+$A15,'Data Input'!$A$3:$AX$32,5,FALSE)","v":-3},{"$f":"+VLOOKUP(+$A15,'Data Input'!$A$3:$AX$32,6,FALSE)","v":""},{"$f":"+VLOOKUP(+$A15,'Data Input'!$A$3:$AX$32,7,FALSE)","v":"A"},{"$f":"+VLOOKUP($A15,'Data Input'!$A$3:$AX$32,33,FALSE)","v":6},{"$f":"+VLOOKUP($A15,'Data Input'!$A$3:$AX$32,34,FALSE)","v":3},{"$f":"+VLOOKUP($A15,'Data Input'!$A$3:$AX$32,35,FALSE)","v":35.299999999999272},null,11]
[373,{"$f":"+VLOOKUP(+$A16,'Data Input'!$A$3:$AX$32,2,FALSE)","v":"Meggie"},{"$f":"+VLOOKUP(+$A16,'Data Input'!$A$3:$AX$32,3,FALSE)","v":"J Tansley"},{"$f":"+VLOOKUP(+$A16,'Data Input'!$A$3:$AX$32,4,FALSE)","v":34.9},{"$f":"+VLOOKUP(+$A16,'Data Input'!$A$3:$AX$32,5,FALSE)","v":16},{"$f":"+VLOOKUP(+$A16,'Data Input'!$A$3:$AX$32,6,FALSE)","v":""},{"$f":"+VLOOKUP(+$A16,'Data Input'!$A$3:$AX$32,7,FALSE)","v":"A"},{"$f":"+VLOOKUP($A16,'Data Input'!$A$3:$AX$32,33,FALSE)","v":6},{"$f":"+VLOOKUP($A16,'Data Input'!$A$3:$AX$32,34,FALSE)","v":21},{"$f":"+VLOOKUP($A16,'Data Input'!$A$3:$AX$32,35,FALSE)","v":21},null,12]
[78,{"$f":"+VLOOKUP(+$A17,'Data Input'!$A$3:$AX$32,2,FALSE)","v":"Halcyon"},{"$f":"+VLOOKUP(+$A17,'Data Input'!$A$3:$AX$32,3,FALSE)","v":"R Wilson"},{"$f":"+VLOOKUP(+$A17,'Data Input'!$A$3:$AX$32,4,FALSE)","v":29.5},{"$f":"+VLOOKUP(+$A17,'Data Input'!$A$3:$AX$32,5,FALSE)","v":-7},{"$f":"+VLOOKUP(+$A17,'Data Input'!$A$3:$AX$32,6,FALSE)","v":"DNS"},{"$f":"+VLOOKUP(+$A17,'Data Input'!$A$3:$AX$32,7,FALSE)","v":"A"},{"$f":"+VLOOKUP($A17,'Data Input'!$A$3:$AX$32,33,FALSE)","v":{"$error":"#VALUE!"}},{"$f":"+VLOOKUP($A17,'Data Input'!$A$3:$AX$32,34,FALSE)","v":{"$error":"#VALUE!"}},{"$f":"+VLOOKUP($A17,'Data Input'!$A$3:$AX$32,35,FALSE)","v":{"$error":"#VALUE!"}},null,{"$f":"+VLOOKUP($A17,'Data Input'!$A$3:$AX$32,37,FALSE)","v":"DNS"}]
[323,{"$f":"+VLOOKUP(+$A18,'Data Input'!$A$3:$AX$32,2,FALSE)","v":"Starlight Lady"},{"$f":"+VLOOKUP(+$A18,'Data Input'!$A$3:$AX$32,3,FALSE)","v":"N.Matthews"},{"$f":"+VLOOKUP(+$A18,'Data Input'!$A$3:$AX$32,4,FALSE)","v":30},{"$f":"+VLOOKUP(+$A18,'Data Input'!$A$3:$AX$32,5,FALSE)","v":13},{"$f":"+VLOOKUP(+$A18,'Data Input'!$A$3:$AX$32,6,FALSE)","v":"DNS"},{"$f":"+VLOOKUP(+$A18,'Data Input'!$A$3:$AX$32,7,FALSE)","v":"A"},{"$f":"+VLOOKUP($A18,'Data Input'!$A$3:$AX$32,33,FALSE)","v":{"$error":"#VALUE!"}},{"$f":"+VLOOKUP($A18,'Data Input'!$A$3:$AX$32,34,FALSE)","v":{"$error":"#VALUE!"}},{"$f":"+VLOOKUP($A18,'Data Input'!$A$3:$AX$32,35,FALSE)","v":{"$error":"#VALUE!"}},null,{"$f":"+VLOOKUP($A18,'Data Input'!$A$3:$AX$32,37,FALSE)","v":"DNS"}]
[]
[null,"Jeckells"]
[]
[199,{"$f":"+VLOOKUP(+$A22,'Data Input'!$A$3:$AX$32,2,FALSE)","v":"Morning Calm"},{"$f":"+VLOOKUP(+$A22,'Data Input'!$A$3:$AX$32,3,FALSE)","v":"W Clark"},{"$f":"+VLOOKUP(+$A22,'Data Input'!$A$3:$AX$32,4,FALSE)","v":26},{"$f":"+VLOOKUP(+$A22,'Data Input'!$A$3:$AX$32,5,FALSE)","v":-9},{"$f":"+VLOOKUP(+$A22,'Data Input'!$A$3:$AX$32,6,FALSE)","v":""},{"$f":"+VLOOKUP(+$A22,'Data Input'!$A$3:$AX$32,7,FALSE)","v":"B"},{"$f":"+VLOOKUP($A22,'Data Input'!$A$3:$AX$32,33,FALSE)","v":5},{"$f":"+VLOOKUP($A22,'Data Input'!$A$3:$AX$32,34,FALSE)","v":37},{"$f":"+VLOOKUP($A22,'Data Input'!$A$3:$AX$32,35,FALSE)","v":29.319999999999709},null,1]
[244,{"$f":"+VLOOKUP(+$A23,'Data Input'!$A$3:$AX$32,2,FALSE)","v":"Catspaw"},{"$f":"+VLOOKUP(+$A23,'Data Input'!$A$3:$AX$32,3,FALSE)","v":"B Wilkins"},{"$f":"+VLOOKUP(+$A23,'Data Input'!$A$3:$AX$32,4,FALSE)","v":28},{"$f":"+VLOOKUP(+$A23,'Data Input'!$A$3:$AX$32,5,FALSE)","v":-5},{"$f":"+VLOOKUP(+$A23,'Data Input'!$A$3:$AX$32,6,FALSE)","v":""},{"$f":"+VLOOKUP(+$A23,'Data Input'!$A$3:$AX$32,7,FALSE)","v":"B"},{"$f":"+VLOOKUP($A23,'Data Input'!$A$3:$AX$32,33,FALSE)","v":5},{"$f":"+VLOOKUP($A23,'Data Input'!$A$3:$AX$32,34,FALSE)","v":39},{"$f":"+VLOOKUP($A23,'Data Input'!$A$3:$AX$32,35,FALSE)","v":33.700000000000728},null,2]
[217,{"$f":"+VLOOKUP(+$A24,'Data Input'!$A$3:$AX$32,2,FALSE)","v":"Melinda"},{"$f":"+VLOOKUP(+$A24,'Data Input'!$A$3:$AX$32,3,FALSE)","v":"P Howes"},{"$f":"+VLOOKUP(+$A24,'Data Input'!$A$3:$AX$32,4,FALSE)","v":27.9},{"$f":"+VLOOKUP(+$A24,'Data Input'!$A$3:$AX$32,5,FALSE)","v":1},{"$f":"+VLOOKUP(+$A24,'Data Input'!$A$3:$AX$32,6,FALSE)","v":""},{"$f":"+VLOOKUP(+$A24,'Data Input'!$A$3:$AX$32,7,FALSE)","v":"B"},{"$f":"+VLOOKUP($A24,'Data Input'!$A$3:$AX$32,33,FALSE)","v":5},{"$f":"+VLOOKUP($A24,'Data Input'!$A$3:$AX$32,34,FALSE)","v":43},{"$f":"+VLOOKUP($A24,'Data Input'!$A$3:$AX$32,35,FALSE)","v":0.77000000000043656},null,3]
[400,{"$f":"+VLOOKUP(+$A25,'Data Input'!$A$3:$AX$32,2,FALSE)","v":"Swallowtail"},{"$f":"+VLOOKUP(+$A25,'Data Input'!$A$3:$AX$32,3,FALSE)","v":"K Halifax"},{"$f":"+VLOOKUP(+$A25,'Data Input'!$A$3:$AX$32,4,FALSE)","v":26.5},{"$f":"+VLOOKUP(+$A25,'Data Input'!$A$3:$AX$32,5,FALSE)","v":-7},{"$f":"+VLOOKUP(+$A25,'Data Input'!$A$3:$AX$32,6,FALSE)","v":""},{"$f":"+VLOOKUP(+$A25,'Data Input'!$A$3:$AX$32,7,FALSE)","v":"B"},{"$f":"+VLOOKUP($A25,'Data Input'!$A$3:$AX$32,33,FALSE)","v":5},{"$f":"+VLOOKUP($A25,'Data Input'!$A$3:$AX$32,34,FALSE)","v":46},{"$f":"+VLOOKUP($A25,'Data Input'!$A$3:$AX$32,35,FALSE)","v":59.909999999999854},null,4]
[179,{"$f":"+VLOOKUP(+$A26,'Data Input'!$A$3:$AX$32,2,FALSE)","v":"Waxwing"},{"$f":"+VLOOKUP(+$A26,'Data Input'!$A$3:$AX$32,3,FALSE)","v":"S Clayton"},{"$f":"+VLOOKUP(+$A26,'Data Input'!$A$3:$AX$32,4,FALSE)","v":28},{"$f":"+VLOOKUP(+$A26,'Data Input'!$A$3:$AX$32,5,FALSE)","v":-8},{"$f":"+VLOOKUP(+$A26,'Data Input'!$A$3:$AX$32,6,FALSE)","v":""},{"$f":"+VLOOKUP(+$A26,'Data Input'!$A$3:$AX$32,7,FALSE)","v":"B"},{"$f":"+VLOOKUP($A26,'Data Input'!$A$3:$AX$32,33,FALSE)","v":5},{"$f":"+VLOOKUP($A26,'Data Input'!$A$3:$AX$32,34,FALSE)","v":47},{"$f":"+VLOOKUP($A26,'Data Input'!$A$3:$AX$32,35,FALSE)","v":48.360000000000582},null,5]
[24,{"$f":"+VLOOKUP(+$A27,'Data Input'!$A$3:$AX$32,2,FALSE)","v":"Pippa"},{"$f":"+VLOOKUP(+$A27,'Data Input'!$A$3:$AX$32,3,FALSE)","v":"G Angell"},{"$f":"+VLOOKUP(+$A27,'Data Input'!$A$3:$AX$32,4,FALSE)","v":27.5},{"$f":"+VLOOKUP(+$A27,'Data Input'!$A$3:$AX$32,5,FALSE)","v":-7},{"$f":"+VLOOKUP(+$A27,'Data Input'!$A$3:$AX$32,6,FALSE)","v":""},{"$f":"+VLOOKUP(+$A27,'Data Input'!$A$3:$AX$32,7,FALSE)","v":"B"},{"$f":"+VLOOKUP($A27,'Data Input'!$A$3:$AX$32,33,FALSE)","v":5},{"$f":"+VLOOKUP($A27,'Data Input'!$A$3:$AX$32,34,FALSE)","v":48},{"$f":"+VLOOKUP($A27,'Data Input'!$A$3:$AX$32,35,FALSE)","v":20.819999999999709},null,6]
[418,{"$f":"+VLOOKUP(+$A28,'Data Input'!$A$3:$AX$32,2,FALSE)","v":"Tinkerbell"},{"$f":"+VLOOKUP(+$A28,'Data Input'!$A$3:$AX$32,3,FALSE)","v":"A Lincoln"},{"$f":"+VLOOKUP(+$A28,'Data Input'!$A$3:$AX$32,4,FALSE)","v":25.2},{"$f":"+VLOOKUP(+$A28,'Data Input'!$A$3:$AX$32,5,FALSE)","v":-6},{"$f":"+VLOOKUP(+$A28,'Data Input'!$A$3:$AX$32,6,FALSE)","v":""},{"$f":"+VLOOKUP(+$A28,'Data Input'!$A$3:$AX$32,7,FALSE)","v":"B"},{"$f":"+VLOOKUP($A28,'Data Input'!$A$3:$AX$32,33,FALSE)","v":5},{"$f":"+VLOOKUP($A28,'Data Input'!$A$3:$AX$32,34,FALSE)","v":53},{"$f":"+VLOOKUP($A28,'Data Input'!$A$3:$AX$32,35,FALSE)","v":46.140000000003056},null,7]
[224,{"$f":"+VLOOKUP(+$A29,'Data Input'!$A$3:$AX$32,2,FALSE)","v":"Anna"},{"$f":"+VLOOKUP(+$A29,'Data Input'!$A$3:$AX$32,3,FALSE)","v":"R Branscombe"},{"$f":"+VLOOKUP(+$A29,'Data Input'!$A$3:$AX$32,4,FALSE)","v":25},{"$f":"+VLOOKUP(+$A29,'Data Input'!$A$3:$AX$32,5,FALSE)","v":-9},{"$f":"+VLOOKUP(+$A29,'Data Input'!$A$3:$AX$32,6,FALSE)","v":""},{"$f":"+VLOOKUP(+$A29,'Data Input'!$A$3:$AX$32,7,FALSE)","v":"B"},{"$f":"+VLOOKUP($A29,'Data Input'!$A$3:$AX$32,33,FALSE)","v":5},{"$f":"+VLOOKUP($A29,'Data Input'!$A$3:$AX$32,34,FALSE)","v":56},{"$f":"+VLOOKUP($A29,'Data Input'!$A$3:$AX$32,35,FALSE)","v":46.840000000000146},null,8]
[226,{"$f":"+VLOOKUP(+$A30,'Data Input'!$A$3:$AX$32,2,FALSE)","v":"Medina"},{"$f":"+VLOOKUP(+$A30,'Data Input'!$A$3:$AX$32,3,FALSE)","v":"S Brown"},{"$f":"+VLOOKUP(+$A30,'Data Input'!$A$3:$AX$32,4,FALSE)","v":26},{"$f":"+VLOOKUP(+$A30,'Data Input'!$A$3:$AX$32,5,FALSE)","v":-9},{"$f":"+VLOOKUP(+$A30,'Data Input'!$A$3:$AX$32,6,FALSE)","v":"P"},{"$f":"+VLOOKUP(+$A30,'Data Input'!$A$3:$AX$32,7,FALSE)","v":"B"},{"$f":"+VLOOKUP($A30,'Data Input'!$A$3:$AX$32,33,FALSE)","v":6},{"$f":"+VLOOKUP($A30,'Data Input'!$A$3:$AX$32,34,FALSE)","v":28},{"$f":"+VLOOKUP($A30,'Data Input'!$A$3:$AX$32,35,FALSE)","v":5.0800000000017462},null,{"$f":"+VLOOKUP($A30,'Data Input'!$A$3:$AX$32,37,FALSE)","v":"P"}]
[222,{"$f":"+VLOOKUP(+$A31,'Data Input'!$A$3:$AX$32,2,FALSE)","v":"Swallowtail"},{"$f":"+VLOOKUP(+$A31,'Data Input'!$A$3:$AX$32,3,FALSE)","v":"J Wells"},{"$f":"+VLOOKUP(+$A31,'Data Input'!$A$3:$AX$32,4,FALSE)","v":28},{"$f":"+VLOOKUP(+$A31,'Data Input'!$A$3:$AX$32,5,FALSE)","v":-5},{"$f":"+VLOOKUP(+$A31,'Data Input'!$A$3:$AX$32,6,FALSE)","v":"RET"},{"$f":"+VLOOKUP(+$A31,'Data Input'!$A$3:$AX$32,7,FALSE)","v":"B"},{"$f":"+VLOOKUP($A31,'Data Input'!$A$3:$AX$32,33,FALSE)","v":7},{"$f":"+VLOOKUP($A31,'Data Input'!$A$3:$AX$32,34,FALSE)","v":42},{"$f":"+VLOOKUP($A31,'Data Input'!$A$3:$AX$32,35,FALSE)","v":27.600000000002183},null,{"$f":"+VLOOKUP($A31,'Data Input'!$A$3:$AX$32,37,FALSE)","v":"RET"}]
[240,{"$f":"+VLOOKUP(+$A32,'Data Input'!$A$3:$AX$32,2,FALSE)","v":"Avocet"},{"$f":"+VLOOKUP(+$A32,'Data Input'!$A$3:$AX$32,3,FALSE)","v":"R  Branford"},{"$f":"+VLOOKUP(+$A32,'Data Input'!$A$3:$AX$32,4,FALSE)","v":28},{"$f":"+VLOOKUP(+$A32,'Data Input'!$A$3:$AX$32,5,FALSE)","v":-16},{"$f":"+VLOOKUP(+$A32,'Data Input'!$A$3:$AX$32,6,FALSE)","v":"RET"},{"$f":"+VLOOKUP(+$A32,'Data Input'!$A$3:$AX$32,7,FALSE)","v":"B"},{"$f":"+VLOOKUP($A32,'Data Input'!$A$3:$AX$32,33,FALSE)","v":7},{"$f":"+VLOOKUP($A32,'Data Input'!$A$3:$AX$32,34,FALSE)","v":2},{"$f":"+VLOOKUP($A32,'Data Input'!$A$3:$AX$32,35,FALSE)","v":10.200000000000728},null,{"$f":"+VLOOKUP($A32,'Data Input'!$A$3:$AX$32,37,FALSE)","v":"RET"}]
[356,{"$f":"+VLOOKUP(+$A33,'Data Input'!$A$3:$AX$32,2,FALSE)","v":"Amsel"},{"$f":"+VLOOKUP(+$A33,'Data Input'!$A$3:$AX$32,3,FALSE)","v":"D McCarter"},{"$f":"+VLOOKUP(+$A33,'Data Input'!$A$3:$AX$32,4,FALSE)","v":28},{"$f":"+VLOOKUP(+$A33,'Data Input'!$A$3:$AX$32,5,FALSE)","v":-18},{"$f":"+VLOOKUP(+$A33,'Data Input'!$A$3:$AX$32,6,FALSE)","v":"RET"},{"$f":"+VLOOKUP(+$A33,'Data Input'!$A$3:$AX$32,7,FALSE)","v":"B"},{"$f":"+VLOOKUP($A33,'Data Input'!$A$3:$AX$32,33,FALSE)","v":6},{"$f":"+VLOOKUP($A33,'Data Input'!$A$3:$AX$32,34,FALSE)","v":28},{"$f":"+VLOOKUP($A33,'Data Input'!$A$3:$AX$32,35,FALSE)","v":29.320000000003347},null,{"$f":"+VLOOKUP($A33,'Data Input'!$A$3:$AX$32,37,FALSE)","v":"RET"}]
[]
[null,"Wilberforce Smith"]
[]
[155,{"$f":"+VLOOKUP(+$A37,'Data Input'!$A$3:$AX$32,2,FALSE)","v":"Stratos"},{"$f":"+VLOOKUP(+$A37,'Data Input'!$A$3:$AX$32,3,FALSE)","v":"J Townley"},{"$f":"+VLOOKUP(+$A37,'Data Input'!$A$3:$AX$32,4,FALSE)","v":22.6},{"$f":"+VLOOKUP(+$A37,'Data Input'!$A$3:$AX$32,5,FALSE)","v":-17},{"$f":"+VLOOKUP(+$A37,'Data Input'!$A$3:$AX$32,6,FALSE)","v":""},{"$f":"+VLOOKUP(+$A37,'Data Input'!$A$3:$AX$32,7,FALSE)","v":"C"},{"$f":"+VLOOKUP($A37,'Data Input'!$A$3:$AX$32,33,FALSE)","v":5},{"$f":"+VLOOKUP($A37,'Data Input'!$A$3:$AX$32,34,FALSE)","v":52},{"$f":"+VLOOKUP($A37,'Data Input'!$A$3:$AX$32,35,FALSE)","v":23.420000000001892},null,1]
[87,{"$f":"+VLOOKUP(+$A38,'Data Input'!$A$3:$AX$32,2,FALSE)","v":"Modwena"},{"$f":"+VLOOKUP(+$A38,'Data Input'!$A$3:$AX$32,3,FALSE)","v":"M Cassidy"},{"$f":"+VLOOKUP(+$A38,'Data Input'!$A$3:$AX$32,4,FALSE)","v":24.8},{"$f":"+VLOOKUP(+$A38,'Data Input'!$A$3:$AX$32,5,FALSE)","v":-18},{"$f":"+VLOOKUP(+$A38,'Data Input'!$A$3:$AX$32,6,FALSE)","v":""},{"$f":"+VLOOKUP(+$A38,'Data Input'!$A$3:$AX$32,7,FALSE)","v":"C"},{"$f":"+VLOOKUP($A38,'Data Input'!$A$3:$AX$32,33,FALSE)","v":5},{"$f":"+VLOOKUP($A38,'Data Input'!$A$3:$AX$32,34,FALSE)","v":55},{"$f":"+VLOOKUP($A38,'Data Input'!$A$3:$AX$32,35,FALSE)","v":15.080000000001746},null,2]
[141,{"$f":"+VLOOKUP(+$A39,'Data Input'!$A$3:$AX$32,2,FALSE)","v":"Nirvana"},{"$f":"+VLOOKUP(+$A39,'Data Input'!$A$3:$AX$32,3,FALSE)","v":" M Claridge"},{"$f":"+VLOOKUP(+$A39,'Data Input'!$A$3:$AX$32,4,FALSE)","v":20},{"$f":"+VLOOKUP(+$A39,'Data Input'!$A$3:$AX$32,5,FALSE)","v":-23},{"$f":"+VLOOKUP(+$A39,'Data Input'!$A$3:$AX$32,6,FALSE)","v":"P"},{"$f":"+VLOOKUP(+$A39,'Data Input'!$A$3:$AX$32,7,FALSE)","v":"C"},{"$f":"+VLOOKUP($A39,'Data Input'!$A$3:$AX$32,33,FALSE)","v":5},{"$f":"+VLOOKUP($A39,'Data Input'!$A$3:$AX$32,34,FALSE)","v":48},{"$f":"+VLOOKUP($A39,'Data Input'!$A$3:$AX$32,35,FALSE)","v":3.1700000000018917},null,{"$f":"+VLOOKUP($A39,'Data Input'!$A$3:$AX$32,37,FALSE)","v":"P"}]
[{"$f":"SUM(A5:A39)","v":6355}]
[]
[]
[]
[]
[]
[]
[]
[]
[]
[]
[]
[]
[]
[]
[]
[]
[{"$f":"+COUNT(A5:A56)","v":30}]