{"text_format":"1","workbook":"xlsx","n_sheets":7,"sheets":["Data Input","YNR","Moonraker","Classes","Classes A","Classes B","Classes C"],"not_rendered":{"charts":0,"images":0,"macros":1,"external_links":0,"defined_names":16,"comments":0,"pivot_tables":0},"unopened":[],"bounds":{"document_bytes":16777216,"sheet_cells":100000,"rows_first":2000,"rows_last":500,"rows_between":2000,"halvings":0,"cell_chars":16384,"cell_head_chars":4096},"cells_cut":0,"cells_raw":0,"read":"whole","date_system":"1900"}

{"sheet":"Data Input","index":0,"n_rows":44,"n_cols":50,"rows_kept":44,"cut":false,"hidden":false,"merged":[]}
["No","Yacht","Skipper","Length","H/C","P","Class",null,"Start",null,null,"Out 1",null,null,"In 1",null,null,"Out 2",null,null,"In 2",null,null,"Finish",null,null,null,"Elapsed",null,null,"Pos",null,null,"Corrected",null,null,"Pos",null,"Bridge1","Bridge 2","Bridge T","T","T-B elapsed","Corr"]
[null,null,null,null,null,null,null,"H","M","S","H","M","S","H","M","S","H","M","S","H","M","S","H","M","S",null,"H","M","S",null,null," ","H","M","S",null,null," ","Seconds","Seconds","Seconds","Seconds","Seconds","Seconds"]
[6,"Dragonfly","S Simpson",38,-13,"W",{"$f":"IF(D3=\"\",\"\",IF(D3<25,\"C\",IF(D3<28.01,\"B\",\"A\")))","v":"A"},9,45,0,10,59,46,11,29,20,null,null,null,null,null,null,null,null,null,null,{"$f":"INT(AQ3/3600)","v":10},{"$f":"INT((AQ3-AA3*3600)/60)","v":14},{"$f":"AQ3-(AA3*3600+AB3*60)","v":34},null,{"$f":"+AT3","v":"W"},null,{"$f":"INT(AR3/3600)","v":8},{"$f":"INT((AR3-AG3*3600)/60)","v":54},{"$f":"AR3-(AG3*3600+AH3*60)","v":40.380000000001019},null,{"$f":"+AW3","v":"W"},null,{"$f":"(P3+O3*60+N3*3600)-(M3+L3*60+K3*3600)","v":1774},{"$f":"(V3+U3*60+T3*3600)-(S3+R3*60+Q3*3600)","v":0},{"$f":"AM3+AN3","v":1774},{"$f":"(Y3+X3*60+W3*3600)-(J3+I3*60+H3*3600)","v":-35100},{"$f":"ABS(AP3-AO3)","v":36874},{"$f":"AQ3*(0.01*(100+E3))","v":32080.38},{"$f":"+IF(F3=\"\",AQ3,500000)","v":500000},{"$f":"IF(F3=\"\",+RANK(AS3,$AS$3:$AS$41,1),+F3)","v":"W"},{"$f":"+IF(AT3<4,\"Trophy\",\"\")","v":""},{"$f":"+IF(F3=\"\",AR3,500000)","v":500000},{"$f":"IF(F3=\"\",+RANK(AV3,$AV$3:$AV$41,1),+F3)","v":"W"},{"$f":"+IF(AW3<4,\"Trophy\",\"\")","v":""}]
[10,"Flight","J Farrow",29.9,-8,null,"A",8,30,0,10,0,37,10,14,14,11,49,17,12,2,3,14,6,41,null,5,10,18,null,16,null,4,45,28.56000000000131,null,14,null,817,766,1583,20201,18618,17128.560000000001,18618,16,"",17128.560000000001,14,""]
[22,"Moonraker","P Jeckells",29.5,2,"DNS","A",null,null,null,null,null,null,null,null,null,null,null,null,null,null,null,null,null,null,null,0,0,0,null,"DNS",null,0,0,0,null,"DNS",null,0,0,0,0,0,0,500000,"DNS","",500000,"DNS",""]
[25,"Melody","M Wells",26,-10,null,"B",8,30,0,9,49,52,9,54,44,11,39,38,11,52,58,14,18,9,null,5,29,57,null,18,null,4,56,57.299999999999272,null,18,null,292,800,1092,20889,19797,17817.3,19797,18,"",17817.3,18,""]
[52,"Maidie","M Barnes",43.2,13,"DNS","A",null,null,null,null,null,null,null,null,null,null,null,null,null,null,null,null,null,null,null,0,0,0,null,"DNS",null,0,0,0,null,"DNS",null,0,0,0,0,0,0,500000,"DNS","",500000,"DNS",""]
[79,"Daisy","T Ford",22,-21,null,"C",7,30,0,9,12,14,9,17,54,11,39,30,11,57,42,14,53,28,null,6,59,36,null,21,null,5,31,29.040000000000873,null,21,null,340,1092,1432,26608,25176,19889.04,25176,21,"",19889.04,21,""]
[87,"Modwena","M Cassidy",24.8,-19,null,"C",8,30,0,10,1,29,10,17,9,11,59,23,12,38,26,15,1,45,null,5,37,2,null,19,null,4,32,59.820000000001528,null,4,null,940,2343,3283,23505,20222,16379.820000000002,20222,19,"",16379.820000000002,4,""]
[109,"Kingfisher","J Flatman",24.5,-19,"W","C",9,0,0,10,33,24,10,37,0,12,48,9,12,54,33,null,null,null,null,9,10,0,null,"W",null,7,25,30,null,"W",null,216,384,600,-32400,33000,26730,500000,"W","",500000,"W",""]
[141,"Nirvana"," M Claridge",20,-23,"P","C",8,0,0,9,33,18,9,37,8,11,40,26,12,0,20,14,36,39,null,6,12,55,null,"P",null,4,47,8.75,null,"P",null,230,1194,1424,23799,22375,17228.75,500000,"P","",500000,"P",""]
[152,"Sabrina 2","J Holmes",29,-7,null,"A",9,0,0,10,21,55,10,35,53,12,11,41,12,19,58,14,20,2,null,4,57,47,null,9,null,4,36,56.31000000000131,null,7,null,838,497,1335,19202,17867,16616.310000000001,17867,9,"",16616.310000000001,7,""]
[155,"Stratus","J Townley",22.6,-17,"W","C",8,30,0,10,0,0,10,14,2,11,55,49,12,17,25,null,null,null,null,9,5,38,null,"W",null,7,32,52.540000000000873,null,"W",null,842,1296,2138,-30600,32738,27172.54,500000,"W","",500000,"W",""]
[177,"Breeze","M Ellis",32,3,"W","A",9,0,0,10,13,0,10,16,25,11,42,59,11,55,12,null,null,null,null,9,15,38,null,"W",null,9,32,18.139999999999418,null,"W",null,205,733,938,-32400,33338,34338.14,500000,"W","",500000,"W",""]
[179,"Waxwing","S Clayton",28,-8,null,"B",8,45,0,10,9,41,10,14,35,11,47,5,12,2,42,14,3,40,null,4,58,9,null,10,null,4,34,17.880000000001019,null,5,null,294,937,1231,19120,17889,16457.88,17889,10,"",16457.88,5,""]
[199,"Morning Calm","W Clark",26,-9,null,"B",8,45,0,10,9,34,10,14,55,11,49,20,12,1,7,14,9,13,null,5,7,5,null,14,null,4,39,26.75,null,9,null,321,707,1028,19453,18425,16766.75,18425,14,"",16766.75,9,""]
[217,"Melinda","P Howes",27.9,1,null,"B",8,30,0,9,46,17,9,50,12,11,26,15,11,37,10,13,43,29,null,4,58,39,null,11,null,5,1,38.18999999999869,null,19,null,235,655,890,18809,17919,18098.189999999999,17919,11,"",18098.189999999999,19,""]
[218,"Mystery","M Ford",26,-9,null,"B",8,45,0,10,14,33,10,18,45,11,53,13,12,16,3,14,20,56,null,5,8,54,null,15,null,4,41,5.9400000000023283,null,12,null,252,1370,1622,20156,18534,16865.940000000002,18534,15,"",16865.940000000002,12,""]
[219,"Farthing","M Farrar",36,3,"W","A",9,30,0,10,39,12,10,41,54,12,6,53,12,16,26,null,null,null,null,9,42,15,null,"W",null,9,59,43.05000000000291,null,"W",null,162,573,735,-34200,34935,35983.050000000003,500000,"W","",500000,"W",""]
[224,"Anna","R Branscombe",25,-10,null,"B",8,45,0,10,9,53,10,15,18,11,51,35,12,3,56,14,13,58,null,5,11,12,null,17,null,4,40,4.7999999999992724,null,10,null,325,741,1066,19738,18672,16804.8,18672,17,"",16804.8,10,""]
[240,"Avocet","R  Branford",28,-16,"W","B",9,30,0,10,47,10,10,51,4,null,null,null,null,null,null,null,null,null,null,9,33,54,null,"W",null,8,2,4.5599999999976717,null,"W",null,234,0,234,-34200,34434,28924.559999999998,500000,"W","",500000,"W",""]
[244,"Catspaw","B Wilkins",28,-4,null,"B",8,0,0,9,18,2,9,22,22,10,59,36,11,27,37,13,24,26,null,4,52,5,null,8,null,4,40,24,null,11,null,260,1681,1941,19466,17525,16824,17525,8,"",16824,11,""]
[262,"Jessie May","S Dugdale",28,-5,null,"B",10,30,0,11,48,19,11,53,34,13,25,20,13,31,8,15,20,47,null,4,39,44,null,7,null,4,25,44.800000000001091,null,2,null,315,348,663,17447,16784,15944.800000000001,16784,7,"",15944.800000000001,2,"Trophy"]
[274,"Elfin","A Bond",21,-27,"DNS","C",null,null,null,null,null,null,null,null,null,null,null,null,null,null,null,null,null,null,null,0,0,0,null,"DNS",null,0,0,0,null,"DNS",null,0,0,0,0,0,0,500000,"DNS","",500000,"DNS",""]
[323,"Starlight Lady","N.Matthews",30,13,null,"A",10,30,0,11,38,8,11,43,30,13,0,26,13,24,24,15,4,21,null,4,5,1,null,1,null,4,36,52.130000000001019,null,6,null,322,1438,1760,16461,14701,16612.13,14701,1,"Trophy",16612.13,6,""]
[335,"Firebird","R Richardson",30,1,"DNS","A",null,null,null,null,null,null,null,null,null,null,null,null,null,null,null,null,null,null,null,0,0,0,null,"DNS",null,0,0,0,null,"DNS",null,0,0,0,0,0,0,500000,"DNS","",500000,"DNS",""]
[368,"Wandering Rose","  Radley",31,-2,null,"A",9,15,0,10,28,40,10,36,4,12,0,55,12,18,23,14,12,45,null,4,32,53,null,4,null,4,27,25.539999999999054,null,3,null,444,1048,1492,17865,16373,16045.539999999999,16373,4,"",16045.539999999999,3,"Trophy"]
[369,"Moonshadow","N Hovey",31.5,4,"","A",8,45,0,10,4,9,10,16,13,11,40,27,11,54,30,13,45,42,null,4,34,35,null,5,null,4,45,34,null,15,null,724,843,1567,18042,16475,17134,16475,5,"",17134,15,""]
[370,"Glory","C Brown",35,-6,"","A",9,15,0,10,30,15,10,36,32,12,3,15,12,34,42,14,30,29,null,4,37,45,null,6,null,4,21,5.1000000000003638,null,1,null,377,1887,2264,18929,16665,15665.1,16665,6,"",15665.1,1,"Trophy"]
[373,"Meggie","J Tansley",34.9,13,"","A",9,0,0,10,13,15,10,16,50,11,39,17,11,47,21,13,41,0,null,4,29,21,null,3,null,5,4,21.930000000000291,null,20,null,215,484,699,16860,16161,18261.93,16161,3,"Trophy",18261.93,20,""]
[400,"Swallow","K Halifax",26.5,-7,"","B",8,45,0,10,9,19,10,15,21,11,48,11,11,56,38,14,3,16,null,5,3,47,null,13,null,4,42,31.110000000000582,null,13,null,362,507,869,19096,18227,16951.11,18227,13,"",16951.11,13,""]
[416,"Alice Rose","D Radley",28.5,-7,"W","A",9,0,0,10,35,1,10,38,25,12,8,27,12,18,55,null,null,null,null,9,13,52,null,"W",null,8,35,5.7600000000020373,null,"W",null,204,628,832,-32400,33232,30905.760000000002,500000,"W","",500000,"W",""]
[417,"Stellar","T Frary",31.3,17,null,"A",8,45,0,9,57,27,10,14,54,11,31,41,11,42,0,13,22,2,null,4,9,16,null,2,null,4,51,38.520000000000437,null,16,null,1047,619,1666,16622,14956,17498.52,14956,2,"Trophy",17498.52,16,""]
[418,"Tinkerbell","A Lincoln",25.2,-7,"","B",9,0,0,10,23,52,10,37,14,12,10,53,12,19,33,14,21,5,null,4,59,3,null,12,null,4,38,6.9900000000016007,null,8,null,802,520,1322,19265,17943,16686.990000000002,17943,12,"",16686.990000000002,8,""]
[429,"Pickle","P Montague",22.6,-17,null,"C",7,45,0,9,12,53,9,18,6,11,14,5,11,24,10,13,52,12,null,5,51,54,null,20,null,4,52,4.6200000000026193,null,17,null,313,605,918,22032,21114,17524.620000000003,21114,20,"",17524.620000000003,17,""]
[]
[]
[]
[]
[]
[]
["xx"]
[]
[{"$f":"COUNT(A3:A43)","v":33}]

{"sheet":"YNR","index":1,"n_rows":42,"n_cols":12,"rows_kept":42,"cut":false,"hidden":false,"merged":[]}
[null,null,null,null,null,null,null,null,"Corrected"]
["No","Yacht","Skipper","Length","H/C","P","Class","H","M","S",null,"Pos"]
[370,{"$f":"+VLOOKUP(+$A3,'Data Input'!$A$3:$AX$41,2,FALSE)","v":"Glory"},{"$f":"+VLOOKUP(+$A3,'Data Input'!$A$3:$AX$41,3,FALSE)","v":"C Brown"},{"$f":"+VLOOKUP(+$A3,'Data Input'!$A$3:$AX$41,4,FALSE)","v":35},{"$f":"+VLOOKUP(+$A3,'Data Input'!$A$3:$AX$41,5,FALSE)","v":-6},{"$f":"+VLOOKUP(+$A3,'Data Input'!$A$3:$AX$41,6,FALSE)","v":""},{"$f":"+VLOOKUP(+$A3,'Data Input'!$A$3:$AX$41,7,FALSE)","v":"A"},{"$f":"+VLOOKUP($A3,'Data Input'!$A$3:$AX$41,33,FALSE)","v":4},{"$f":"+VLOOKUP($A3,'Data Input'!$A$3:$AX$41,34,FALSE)","v":21},{"$f":"+VLOOKUP($A3,'Data Input'!$A$3:$AX$41,35,FALSE)","v":5.1000000000003638},null,{"$f":"+VLOOKUP($A3,'Data Input'!$A$3:$AX$41,37,FALSE)","v":1}]
[262,{"$f":"+VLOOKUP(+$A4,'Data Input'!$A$3:$AX$41,2,FALSE)","v":"Jessie May"},{"$f":"+VLOOKUP(+$A4,'Data Input'!$A$3:$AX$41,3,FALSE)","v":"S Dugdale"},{"$f":"+VLOOKUP(+$A4,'Data Input'!$A$3:$AX$41,4,FALSE)","v":28},{"$f":"+VLOOKUP(+$A4,'Data Input'!$A$3:$AX$41,5,FALSE)","v":-5},{"$f":"+VLOOKUP(+$A4,'Data Input'!$A$3:$AX$41,6,FALSE)","v":0},{"$f":"+VLOOKUP(+$A4,'Data Input'!$A$3:$AX$41,7,FALSE)","v":"B"},{"$f":"+VLOOKUP($A4,'Data Input'!$A$3:$AX$41,33,FALSE)","v":4},{"$f":"+VLOOKUP($A4,'Data Input'!$A$3:$AX$41,34,FALSE)","v":25},{"$f":"+VLOOKUP($A4,'Data Input'!$A$3:$AX$41,35,FALSE)","v":44.800000000001091},null,{"$f":"+VLOOKUP($A4,'Data Input'!$A$3:$AX$41,37,FALSE)","v":2}]
[368,{"$f":"+VLOOKUP(+$A5,'Data Input'!$A$3:$AX$41,2,FALSE)","v":"Wandering Rose"},{"$f":"+VLOOKUP(+$A5,'Data Input'!$A$3:$AX$41,3,FALSE)","v":"  Radley"},{"$f":"+VLOOKUP(+$A5,'Data Input'!$A$3:$AX$41,4,FALSE)","v":31},{"$f":"+VLOOKUP(+$A5,'Data Input'!$A$3:$AX$41,5,FALSE)","v":-2},{"$f":"+VLOOKUP(+$A5,'Data Input'!$A$3:$AX$41,6,FALSE)","v":0},{"$f":"+VLOOKUP(+$A5,'Data Input'!$A$3:$AX$41,7,FALSE)","v":"A"},{"$f":"+VLOOKUP($A5,'Data Input'!$A$3:$AX$41,33,FALSE)","v":4},{"$f":"+VLOOKUP($A5,'Data Input'!$A$3:$AX$41,34,FALSE)","v":27},{"$f":"+VLOOKUP($A5,'Data Input'!$A$3:$AX$41,35,FALSE)","v":25.539999999999054},null,{"$f":"+VLOOKUP($A5,'Data Input'!$A$3:$AX$41,37,FALSE)","v":3}]
[87,{"$f":"+VLOOKUP(+$A6,'Data Input'!$A$3:$AX$41,2,FALSE)","v":"Modwena"},{"$f":"+VLOOKUP(+$A6,'Data Input'!$A$3:$AX$41,3,FALSE)","v":"M Cassidy"},{"$f":"+VLOOKUP(+$A6,'Data Input'!$A$3:$AX$41,4,FALSE)","v":24.8},{"$f":"+VLOOKUP(+$A6,'Data Input'!$A$3:$AX$41,5,FALSE)","v":-19},{"$f":"+VLOOKUP(+$A6,'Data Input'!$A$3:$AX$41,6,FALSE)","v":0},{"$f":"+VLOOKUP(+$A6,'Data Input'!$A$3:$AX$41,7,FALSE)","v":"C"},{"$f":"+VLOOKUP($A6,'Data Input'!$A$3:$AX$41,33,FALSE)","v":4},{"$f":"+VLOOKUP($A6,'Data Input'!$A$3:$AX$41,34,FALSE)","v":32},{"$f":"+VLOOKUP($A6,'Data Input'!$A$3:$AX$41,35,FALSE)","v":59.820000000001528},null,{"$f":"+VLOOKUP($A6,'Data Input'!$A$3:$AX$41,37,FALSE)","v":4}]
[179,{"$f":"+VLOOKUP(+$A7,'Data Input'!$A$3:$AX$41,2,FALSE)","v":"Waxwing"},{"$f":"+VLOOKUP(+$A7,'Data Input'!$A$3:$AX$41,3,FALSE)","v":"S Clayton"},{"$f":"+VLOOKUP(+$A7,'Data Input'!$A$3:$AX$41,4,FALSE)","v":28},{"$f":"+VLOOKUP(+$A7,'Data Input'!$A$3:$AX$41,5,FALSE)","v":-8},{"$f":"+VLOOKUP(+$A7,'Data Input'!$A$3:$AX$41,6,FALSE)","v":0},{"$f":"+VLOOKUP(+$A7,'Data Input'!$A$3:$AX$41,7,FALSE)","v":"B"},{"$f":"+VLOOKUP($A7,'Data Input'!$A$3:$AX$41,33,FALSE)","v":4},{"$f":"+VLOOKUP($A7,'Data Input'!$A$3:$AX$41,34,FALSE)","v":34},{"$f":"+VLOOKUP($A7,'Data Input'!$A$3:$AX$41,35,FALSE)","v":17.880000000001019},null,{"$f":"+VLOOKUP($A7,'Data Input'!$A$3:$AX$41,37,FALSE)","v":5}]
[323,{"$f":"+VLOOKUP(+$A8,'Data Input'!$A$3:$AX$41,2,FALSE)","v":"Starlight Lady"},{"$f":"+VLOOKUP(+$A8,'Data Input'!$A$3:$AX$41,3,FALSE)","v":"N.Matthews"},{"$f":"+VLOOKUP(+$A8,'Data Input'!$A$3:$AX$41,4,FALSE)","v":30},{"$f":"+VLOOKUP(+$A8,'Data Input'!$A$3:$AX$41,5,FALSE)","v":13},{"$f":"+VLOOKUP(+$A8,'Data Input'!$A$3:$AX$41,6,FALSE)","v":0},{"$f":"+VLOOKUP(+$A8,'Data Input'!$A$3:$AX$41,7,FALSE)","v":"A"},{"$f":"+VLOOKUP($A8,'Data Input'!$A$3:$AX$41,33,FALSE)","v":4},{"$f":"+VLOOKUP($A8,'Data Input'!$A$3:$AX$41,34,FALSE)","v":36},{"$f":"+VLOOKUP($A8,'Data Input'!$A$3:$AX$41,35,FALSE)","v":52.130000000001019},null,{"$f":"+VLOOKUP($A8,'Data Input'!$A$3:$AX$41,37,FALSE)","v":6}]
[152,{"$f":"+VLOOKUP(+$A9,'Data Input'!$A$3:$AX$41,2,FALSE)","v":"Sabrina 2"},{"$f":"+VLOOKUP(+$A9,'Data Input'!$A$3:$AX$41,3,FALSE)","v":"J Holmes"},{"$f":"+VLOOKUP(+$A9,'Data Input'!$A$3:$AX$41,4,FALSE)","v":29},{"$f":"+VLOOKUP(+$A9,'Data Input'!$A$3:$AX$41,5,FALSE)","v":-7},{"$f":"+VLOOKUP(+$A9,'Data Input'!$A$3:$AX$41,6,FALSE)","v":0},{"$f":"+VLOOKUP(+$A9,'Data Input'!$A$3:$AX$41,7,FALSE)","v":"A"},{"$f":"+VLOOKUP($A9,'Data Input'!$A$3:$AX$41,33,FALSE)","v":4},{"$f":"+VLOOKUP($A9,'Data Input'!$A$3:$AX$41,34,FALSE)","v":36},{"$f":"+VLOOKUP($A9,'Data Input'!$A$3:$AX$41,35,FALSE)","v":56.31000000000131},null,{"$f":"+VLOOKUP($A9,'Data Input'!$A$3:$AX$41,37,FALSE)","v":7}]
[418,{"$f":"+VLOOKUP(+$A10,'Data Input'!$A$3:$AX$41,2,FALSE)","v":"Tinkerbell"},{"$f":"+VLOOKUP(+$A10,'Data Input'!$A$3:$AX$41,3,FALSE)","v":"A Lincoln"},{"$f":"+VLOOKUP(+$A10,'Data Input'!$A$3:$AX$41,4,FALSE)","v":25.2},{"$f":"+VLOOKUP(+$A10,'Data Input'!$A$3:$AX$41,5,FALSE)","v":-7},{"$f":"+VLOOKUP(+$A10,'Data Input'!$A$3:$AX$41,6,FALSE)","v":""},{"$f":"+VLOOKUP(+$A10,'Data Input'!$A$3:$AX$41,7,FALSE)","v":"B"},{"$f":"+VLOOKUP($A10,'Data Input'!$A$3:$AX$41,33,FALSE)","v":4},{"$f":"+VLOOKUP($A10,'Data Input'!$A$3:$AX$41,34,FALSE)","v":38},{"$f":"+VLOOKUP($A10,'Data Input'!$A$3:$AX$41,35,FALSE)","v":6.9900000000016007},null,{"$f":"+VLOOKUP($A10,'Data Input'!$A$3:$AX$41,37,FALSE)","v":8}]
[199,{"$f":"+VLOOKUP(+$A11,'Data Input'!$A$3:$AX$41,2,FALSE)","v":"Morning Calm"},{"$f":"+VLOOKUP(+$A11,'Data Input'!$A$3:$AX$41,3,FALSE)","v":"W Clark"},{"$f":"+VLOOKUP(+$A11,'Data Input'!$A$3:$AX$41,4,FALSE)","v":26},{"$f":"+VLOOKUP(+$A11,'Data Input'!$A$3:$AX$41,5,FALSE)","v":-9},{"$f":"+VLOOKUP(+$A11,'Data Input'!$A$3:$AX$41,6,FALSE)","v":0},{"$f":"+VLOOKUP(+$A11,'Data Input'!$A$3:$AX$41,7,FALSE)","v":"B"},{"$f":"+VLOOKUP($A11,'Data Input'!$A$3:$AX$41,33,FALSE)","v":4},{"$f":"+VLOOKUP($A11,'Data Input'!$A$3:$AX$41,34,FALSE)","v":39},{"$f":"+VLOOKUP($A11,'Data Input'!$A$3:$AX$41,35,FALSE)","v":26.75},null,{"$f":"+VLOOKUP($A11,'Data Input'!$A$3:$AX$41,37,FALSE)","v":9}]
[224,{"$f":"+VLOOKUP(+$A12,'Data Input'!$A$3:$AX$41,2,FALSE)","v":"Anna"},{"$f":"+VLOOKUP(+$A12,'Data Input'!$A$3:$AX$41,3,FALSE)","v":"R Branscombe"},{"$f":"+VLOOKUP(+$A12,'Data Input'!$A$3:$AX$41,4,FALSE)","v":25},{"$f":"+VLOOKUP(+$A12,'Data Input'!$A$3:$AX$41,5,FALSE)","v":-10},{"$f":"+VLOOKUP(+$A12,'Data Input'!$A$3:$AX$41,6,FALSE)","v":0},{"$f":"+VLOOKUP(+$A12,'Data Input'!$A$3:$AX$41,7,FALSE)","v":"B"},{"$f":"+VLOOKUP($A12,'Data Input'!$A$3:$AX$41,33,FALSE)","v":4},{"$f":"+VLOOKUP($A12,'Data Input'!$A$3:$AX$41,34,FALSE)","v":40},{"$f":"+VLOOKUP($A12,'Data Input'!$A$3:$AX$41,35,FALSE)","v":4.7999999999992724},null,{"$f":"+VLOOKUP($A12,'Data Input'!$A$3:$AX$41,37,FALSE)","v":10}]
[244,{"$f":"+VLOOKUP(+$A13,'Data Input'!$A$3:$AX$41,2,FALSE)","v":"Catspaw"},{"$f":"+VLOOKUP(+$A13,'Data Input'!$A$3:$AX$41,3,FALSE)","v":"B Wilkins"},{"$f":"+VLOOKUP(+$A13,'Data Input'!$A$3:$AX$41,4,FALSE)","v":28},{"$f":"+VLOOKUP(+$A13,'Data Input'!$A$3:$AX$41,5,FALSE)","v":-4},{"$f":"+VLOOKUP(+$A13,'Data Input'!$A$3:$AX$41,6,FALSE)","v":0},{"$f":"+VLOOKUP(+$A13,'Data Input'!$A$3:$AX$41,7,FALSE)","v":"B"},{"$f":"+VLOOKUP($A13,'Data Input'!$A$3:$AX$41,33,FALSE)","v":4},{"$f":"+VLOOKUP($A13,'Data Input'!$A$3:$AX$41,34,FALSE)","v":40},{"$f":"+VLOOKUP($A13,'Data Input'!$A$3:$AX$41,35,FALSE)","v":24},null,{"$f":"+VLOOKUP($A13,'Data Input'!$A$3:$AX$41,37,FALSE)","v":11}]
[218,{"$f":"+VLOOKUP(+$A14,'Data Input'!$A$3:$AX$41,2,FALSE)","v":"Mystery"},{"$f":"+VLOOKUP(+$A14,'Data Input'!$A$3:$AX$41,3,FALSE)","v":"M Ford"},{"$f":"+VLOOKUP(+$A14,'Data Input'!$A$3:$AX$41,4,FALSE)","v":26},{"$f":"+VLOOKUP(+$A14,'Data Input'!$A$3:$AX$41,5,FALSE)","v":-9},{"$f":"+VLOOKUP(+$A14,'Data Input'!$A$3:$AX$41,6,FALSE)","v":0},{"$f":"+VLOOKUP(+$A14,'Data Input'!$A$3:$AX$41,7,FALSE)","v":"B"},{"$f":"+VLOOKUP($A14,'Data Input'!$A$3:$AX$41,33,FALSE)","v":4},{"$f":"+VLOOKUP($A14,'Data Input'!$A$3:$AX$41,34,FALSE)","v":41},{"$f":"+VLOOKUP($A14,'Data Input'!$A$3:$AX$41,35,FALSE)","v":5.9400000000023283},null,{"$f":"+VLOOKUP($A14,'Data Input'!$A$3:$AX$41,37,FALSE)","v":12}]
[400,{"$f":"+VLOOKUP(+$A15,'Data Input'!$A$3:$AX$41,2,FALSE)","v":"Swallow"},{"$f":"+VLOOKUP(+$A15,'Data Input'!$A$3:$AX$41,3,FALSE)","v":"K Halifax"},{"$f":"+VLOOKUP(+$A15,'Data Input'!$A$3:$AX$41,4,FALSE)","v":26.5},{"$f":"+VLOOKUP(+$A15,'Data Input'!$A$3:$AX$41,5,FALSE)","v":-7},{"$f":"+VLOOKUP(+$A15,'Data Input'!$A$3:$AX$41,6,FALSE)","v":""},{"$f":"+VLOOKUP(+$A15,'Data Input'!$A$3:$AX$41,7,FALSE)","v":"B"},{"$f":"+VLOOKUP($A15,'Data Input'!$A$3:$AX$41,33,FALSE)","v":4},{"$f":"+VLOOKUP($A15,'Data Input'!$A$3:$AX$41,34,FALSE)","v":42},{"$f":"+VLOOKUP($A15,'Data Input'!$A$3:$AX$41,35,FALSE)","v":31.110000000000582},null,{"$f":"+VLOOKUP($A15,'Data Input'!$A$3:$AX$41,37,FALSE)","v":13}]
[10,{"$f":"+VLOOKUP(+$A16,'Data Input'!$A$3:$AX$41,2,FALSE)","v":"Flight"},{"$f":"+VLOOKUP(+$A16,'Data Input'!$A$3:$AX$41,3,FALSE)","v":"J Farrow"},{"$f":"+VLOOKUP(+$A16,'Data Input'!$A$3:$AX$41,4,FALSE)","v":29.9},{"$f":"+VLOOKUP(+$A16,'Data Input'!$A$3:$AX$41,5,FALSE)","v":-8},{"$f":"+VLOOKUP(+$A16,'Data Input'!$A$3:$AX$41,6,FALSE)","v":0},{"$f":"+VLOOKUP(+$A16,'Data Input'!$A$3:$AX$41,7,FALSE)","v":"A"},{"$f":"+VLOOKUP($A16,'Data Input'!$A$3:$AX$41,33,FALSE)","v":4},{"$f":"+VLOOKUP($A16,'Data Input'!$A$3:$AX$41,34,FALSE)","v":45},{"$f":"+VLOOKUP($A16,'Data Input'!$A$3:$AX$41,35,FALSE)","v":28.56000000000131},null,{"$f":"+VLOOKUP($A16,'Data Input'!$A$3:$AX$41,37,FALSE)","v":14}]
[369,{"$f":"+VLOOKUP(+$A17,'Data Input'!$A$3:$AX$41,2,FALSE)","v":"Moonshadow"},{"$f":"+VLOOKUP(+$A17,'Data Input'!$A$3:$AX$41,3,FALSE)","v":"N Hovey"},{"$f":"+VLOOKUP(+$A17,'Data Input'!$A$3:$AX$41,4,FALSE)","v":31.5},{"$f":"+VLOOKUP(+$A17,'Data Input'!$A$3:$AX$41,5,FALSE)","v":4},{"$f":"+VLOOKUP(+$A17,'Data Input'!$A$3:$AX$41,6,FALSE)","v":""},{"$f":"+VLOOKUP(+$A17,'Data Input'!$A$3:$AX$41,7,FALSE)","v":"A"},{"$f":"+VLOOKUP($A17,'Data Input'!$A$3:$AX$41,33,FALSE)","v":4},{"$f":"+VLOOKUP($A17,'Data Input'!$A$3:$AX$41,34,FALSE)","v":45},{"$f":"+VLOOKUP($A17,'Data Input'!$A$3:$AX$41,35,FALSE)","v":34},null,{"$f":"+VLOOKUP($A17,'Data Input'!$A$3:$AX$41,37,FALSE)","v":15}]
[417,{"$f":"+VLOOKUP(+$A18,'Data Input'!$A$3:$AX$41,2,FALSE)","v":"Stellar"},{"$f":"+VLOOKUP(+$A18,'Data Input'!$A$3:$AX$41,3,FALSE)","v":"T Frary"},{"$f":"+VLOOKUP(+$A18,'Data Input'!$A$3:$AX$41,4,FALSE)","v":31.3},{"$f":"+VLOOKUP(+$A18,'Data Input'!$A$3:$AX$41,5,FALSE)","v":17},{"$f":"+VLOOKUP(+$A18,'Data Input'!$A$3:$AX$41,6,FALSE)","v":0},{"$f":"+VLOOKUP(+$A18,'Data Input'!$A$3:$AX$41,7,FALSE)","v":"A"},{"$f":"+VLOOKUP($A18,'Data Input'!$A$3:$AX$41,33,FALSE)","v":4},{"$f":"+VLOOKUP($A18,'Data Input'!$A$3:$AX$41,34,FALSE)","v":51},{"$f":"+VLOOKUP($A18,'Data Input'!$A$3:$AX$41,35,FALSE)","v":38.520000000000437},null,{"$f":"+VLOOKUP($A18,'Data Input'!$A$3:$AX$41,37,FALSE)","v":16}]
[429,{"$f":"+VLOOKUP(+$A19,'Data Input'!$A$3:$AX$41,2,FALSE)","v":"Pickle"},{"$f":"+VLOOKUP(+$A19,'Data Input'!$A$3:$AX$41,3,FALSE)","v":"P Montague"},{"$f":"+VLOOKUP(+$A19,'Data Input'!$A$3:$AX$41,4,FALSE)","v":22.6},{"$f":"+VLOOKUP(+$A19,'Data Input'!$A$3:$AX$41,5,FALSE)","v":-17},{"$f":"+VLOOKUP(+$A19,'Data Input'!$A$3:$AX$41,6,FALSE)","v":0},{"$f":"+VLOOKUP(+$A19,'Data Input'!$A$3:$AX$41,7,FALSE)","v":"C"},{"$f":"+VLOOKUP($A19,'Data Input'!$A$3:$AX$41,33,FALSE)","v":4},{"$f":"+VLOOKUP($A19,'Data Input'!$A$3:$AX$41,34,FALSE)","v":52},{"$f":"+VLOOKUP($A19,'Data Input'!$A$3:$AX$41,35,FALSE)","v":4.6200000000026193},null,{"$f":"+VLOOKUP($A19,'Data Input'!$A$3:$AX$41,37,FALSE)","v":17}]
[25,{"$f":"+VLOOKUP(+$A20,'Data Input'!$A$3:$AX$41,2,FALSE)","v":"Melody"},{"$f":"+VLOOKUP(+$A20,'Data Input'!$A$3:$AX$41,3,FALSE)","v":"M Wells"},{"$f":"+VLOOKUP(+$A20,'Data Input'!$A$3:$AX$41,4,FALSE)","v":26},{"$f":"+VLOOKUP(+$A20,'Data Input'!$A$3:$AX$41,5,FALSE)","v":-10},{"$f":"+VLOOKUP(+$A20,'Data Input'!$A$3:$AX$41,6,FALSE)","v":0},{"$f":"+VLOOKUP(+$A20,'Data Input'!$A$3:$AX$41,7,FALSE)","v":"B"},{"$f":"+VLOOKUP($A20,'Data Input'!$A$3:$AX$41,33,FALSE)","v":4},{"$f":"+VLOOKUP($A20,'Data Input'!$A$3:$AX$41,34,FALSE)","v":56},{"$f":"+VLOOKUP($A20,'Data Input'!$A$3:$AX$41,35,FALSE)","v":57.299999999999272},null,{"$f":"+VLOOKUP($A20,'Data Input'!$A$3:$AX$41,37,FALSE)","v":18}]
[217,{"$f":"+VLOOKUP(+$A21,'Data Input'!$A$3:$AX$41,2,FALSE)","v":"Melinda"},{"$f":"+VLOOKUP(+$A21,'Data Input'!$A$3:$AX$41,3,FALSE)","v":"P Howes"},{"$f":"+VLOOKUP(+$A21,'Data Input'!$A$3:$AX$41,4,FALSE)","v":27.9},{"$f":"+VLOOKUP(+$A21,'Data Input'!$A$3:$AX$41,5,FALSE)","v":1},{"$f":"+VLOOKUP(+$A21,'Data Input'!$A$3:$AX$41,6,FALSE)","v":0},{"$f":"+VLOOKUP(+$A21,'Data Input'!$A$3:$AX$41,7,FALSE)","v":"B"},{"$f":"+VLOOKUP($A21,'Data Input'!$A$3:$AX$41,33,FALSE)","v":5},{"$f":"+VLOOKUP($A21,'Data Input'!$A$3:$AX$41,34,FALSE)","v":1},{"$f":"+VLOOKUP($A21,'Data Input'!$A$3:$AX$41,35,FALSE)","v":38.18999999999869},null,{"$f":"+VLOOKUP($A21,'Data Input'!$A$3:$AX$41,37,FALSE)","v":19}]
[373,{"$f":"+VLOOKUP(+$A22,'Data Input'!$A$3:$AX$41,2,FALSE)","v":"Meggie"},{"$f":"+VLOOKUP(+$A22,'Data Input'!$A$3:$AX$41,3,FALSE)","v":"J Tansley"},{"$f":"+VLOOKUP(+$A22,'Data Input'!$A$3:$AX$41,4,FALSE)","v":34.9},{"$f":"+VLOOKUP(+$A22,'Data Input'!$A$3:$AX$41,5,FALSE)","v":13},{"$f":"+VLOOKUP(+$A22,'Data Input'!$A$3:$AX$41,6,FALSE)","v":""},{"$f":"+VLOOKUP(+$A22,'Data Input'!$A$3:$AX$41,7,FALSE)","v":"A"},{"$f":"+VLOOKUP($A22,'Data Input'!$A$3:$AX$41,33,FALSE)","v":5},{"$f":"+VLOOKUP($A22,'Data Input'!$A$3:$AX$41,34,FALSE)","v":4},{"$f":"+VLOOKUP($A22,'Data Input'!$A$3:$AX$41,35,FALSE)","v":21.930000000000291},null,{"$f":"+VLOOKUP($A22,'Data Input'!$A$3:$AX$41,37,FALSE)","v":20}]
[79,{"$f":"+VLOOKUP(+$A23,'Data Input'!$A$3:$AX$41,2,FALSE)","v":"Daisy"},{"$f":"+VLOOKUP(+$A23,'Data Input'!$A$3:$AX$41,3,FALSE)","v":"T Ford"},{"$f":"+VLOOKUP(+$A23,'Data Input'!$A$3:$AX$41,4,FALSE)","v":22},{"$f":"+VLOOKUP(+$A23,'Data Input'!$A$3:$AX$41,5,FALSE)","v":-21},{"$f":"+VLOOKUP(+$A23,'Data Input'!$A$3:$AX$41,6,FALSE)","v":0},{"$f":"+VLOOKUP(+$A23,'Data Input'!$A$3:$AX$41,7,FALSE)","v":"C"},{"$f":"+VLOOKUP($A23,'Data Input'!$A$3:$AX$41,33,FALSE)","v":5},{"$f":"+VLOOKUP($A23,'Data Input'!$A$3:$AX$41,34,FALSE)","v":31},{"$f":"+VLOOKUP($A23,'Data Input'!$A$3:$AX$41,35,FALSE)","v":29.040000000000873},null,{"$f":"+VLOOKUP($A23,'Data Input'!$A$3:$AX$41,37,FALSE)","v":21}]
[22,{"$f":"+VLOOKUP(+$A24,'Data Input'!$A$3:$AX$41,2,FALSE)","v":"Moonraker"},{"$f":"+VLOOKUP(+$A24,'Data Input'!$A$3:$AX$41,3,FALSE)","v":"P Jeckells"},{"$f":"+VLOOKUP(+$A24,'Data Input'!$A$3:$AX$41,4,FALSE)","v":29.5},{"$f":"+VLOOKUP(+$A24,'Data Input'!$A$3:$AX$41,5,FALSE)","v":2},{"$f":"+VLOOKUP(+$A24,'Data Input'!$A$3:$AX$41,6,FALSE)","v":"DNS"},{"$f":"+VLOOKUP(+$A24,'Data Input'!$A$3:$AX$41,7,FALSE)","v":"A"},{"$f":"+VLOOKUP($A24,'Data Input'!$A$3:$AX$41,33,FALSE)","v":0},{"$f":"+VLOOKUP($A24,'Data Input'!$A$3:$AX$41,34,FALSE)","v":0},{"$f":"+VLOOKUP($A24,'Data Input'!$A$3:$AX$41,35,FALSE)","v":0},null,{"$f":"+VLOOKUP($A24,'Data Input'!$A$3:$AX$41,37,FALSE)","v":"DNS"}]
[52,{"$f":"+VLOOKUP(+$A25,'Data Input'!$A$3:$AX$41,2,FALSE)","v":"Maidie"},{"$f":"+VLOOKUP(+$A25,'Data Input'!$A$3:$AX$41,3,FALSE)","v":"M Barnes"},{"$f":"+VLOOKUP(+$A25,'Data Input'!$A$3:$AX$41,4,FALSE)","v":43.2},{"$f":"+VLOOKUP(+$A25,'Data Input'!$A$3:$AX$41,5,FALSE)","v":13},{"$f":"+VLOOKUP(+$A25,'Data Input'!$A$3:$AX$41,6,FALSE)","v":"DNS"},{"$f":"+VLOOKUP(+$A25,'Data Input'!$A$3:$AX$41,7,FALSE)","v":"A"},{"$f":"+VLOOKUP($A25,'Data Input'!$A$3:$AX$41,33,FALSE)","v":0},{"$f":"+VLOOKUP($A25,'Data Input'!$A$3:$AX$41,34,FALSE)","v":0},{"$f":"+VLOOKUP($A25,'Data Input'!$A$3:$AX$41,35,FALSE)","v":0},null,{"$f":"+VLOOKUP($A25,'Data Input'!$A$3:$AX$41,37,FALSE)","v":"DNS"}]
[274,{"$f":"+VLOOKUP(+$A26,'Data Input'!$A$3:$AX$41,2,FALSE)","v":"Elfin"},{"$f":"+VLOOKUP(+$A26,'Data Input'!$A$3:$AX$41,3,FALSE)","v":"A Bond"},{"$f":"+VLOOKUP(+$A26,'Data Input'!$A$3:$AX$41,4,FALSE)","v":21},{"$f":"+VLOOKUP(+$A26,'Data Input'!$A$3:$AX$41,5,FALSE)","v":-27},{"$f":"+VLOOKUP(+$A26,'Data Input'!$A$3:$AX$41,6,FALSE)","v":"DNS"},{"$f":"+VLOOKUP(+$A26,'Data Input'!$A$3:$AX$41,7,FALSE)","v":"C"},{"$f":"+VLOOKUP($A26,'Data Input'!$A$3:$AX$41,33,FALSE)","v":0},{"$f":"+VLOOKUP($A26,'Data Input'!$A$3:$AX$41,34,FALSE)","v":0},{"$f":"+VLOOKUP($A26,'Data Input'!$A$3:$AX$41,35,FALSE)","v":0},null,{"$f":"+VLOOKUP($A26,'Data Input'!$A$3:$AX$41,37,FALSE)","v":"DNS"}]
[335,{"$f":"+VLOOKUP(+$A27,'Data Input'!$A$3:$AX$41,2,FALSE)","v":"Firebird"},{"$f":"+VLOOKUP(+$A27,'Data Input'!$A$3:$AX$41,3,FALSE)","v":"R Richardson"},{"$f":"+VLOOKUP(+$A27,'Data Input'!$A$3:$AX$41,4,FALSE)","v":30},{"$f":"+VLOOKUP(+$A27,'Data Input'!$A$3:$AX$41,5,FALSE)","v":1},{"$f":"+VLOOKUP(+$A27,'Data Input'!$A$3:$AX$41,6,FALSE)","v":"DNS"},{"$f":"+VLOOKUP(+$A27,'Data Input'!$A$3:$AX$41,7,FALSE)","v":"A"},{"$f":"+VLOOKUP($A27,'Data Input'!$A$3:$AX$41,33,FALSE)","v":0},{"$f":"+VLOOKUP($A27,'Data Input'!$A$3:$AX$41,34,FALSE)","v":0},{"$f":"+VLOOKUP($A27,'Data Input'!$A$3:$AX$41,35,FALSE)","v":0},null,{"$f":"+VLOOKUP($A27,'Data Input'!$A$3:$AX$41,37,FALSE)","v":"DNS"}]
[141,{"$f":"+VLOOKUP(+$A28,'Data Input'!$A$3:$AX$41,2,FALSE)","v":"Nirvana"},{"$f":"+VLOOKUP(+$A28,'Data Input'!$A$3:$AX$41,3,FALSE)","v":" M Claridge"},{"$f":"+VLOOKUP(+$A28,'Data Input'!$A$3:$AX$41,4,FALSE)","v":20},{"$f":"+VLOOKUP(+$A28,'Data Input'!$A$3:$AX$41,5,FALSE)","v":-23},{"$f":"+VLOOKUP(+$A28,'Data Input'!$A$3:$AX$41,6,FALSE)","v":"P"},{"$f":"+VLOOKUP(+$A28,'Data Input'!$A$3:$AX$41,7,FALSE)","v":"C"},{"$f":"+VLOOKUP($A28,'Data Input'!$A$3:$AX$41,33,FALSE)","v":4},{"$f":"+VLOOKUP($A28,'Data Input'!$A$3:$AX$41,34,FALSE)","v":47},{"$f":"+VLOOKUP($A28,'Data Input'!$A$3:$AX$41,35,FALSE)","v":8.75},null,{"$f":"+VLOOKUP($A28,'Data Input'!$A$3:$AX$41,37,FALSE)","v":"P"}]
[6,{"$f":"+VLOOKUP(+$A29,'Data Input'!$A$3:$AX$43,2,FALSE)","v":"Dragonfly"},{"$f":"+VLOOKUP(+$A29,'Data Input'!$A$3:$AX$41,3,FALSE)","v":"S Simpson"},{"$f":"+VLOOKUP(+$A29,'Data Input'!$A$3:$AX$41,4,FALSE)","v":38},{"$f":"+VLOOKUP(+$A29,'Data Input'!$A$3:$AX$41,5,FALSE)","v":-13},{"$f":"+VLOOKUP(+$A29,'Data Input'!$A$3:$AX$41,6,FALSE)","v":"W"},{"$f":"+VLOOKUP(+$A29,'Data Input'!$A$3:$AX$41,7,FALSE)","v":"A"},{"$f":"+VLOOKUP($A29,'Data Input'!$A$3:$AX$41,33,FALSE)","v":8},{"$f":"+VLOOKUP($A29,'Data Input'!$A$3:$AX$41,34,FALSE)","v":54},{"$f":"+VLOOKUP($A29,'Data Input'!$A$3:$AX$41,35,FALSE)","v":40.380000000001019},null,{"$f":"+VLOOKUP($A29,'Data Input'!$A$3:$AX$41,37,FALSE)","v":"W"}]
[155,{"$f":"+VLOOKUP(+$A30,'Data Input'!$A$3:$AX$41,2,FALSE)","v":"Stratus"},{"$f":"+VLOOKUP(+$A30,'Data Input'!$A$3:$AX$41,3,FALSE)","v":"J Townley"},{"$f":"+VLOOKUP(+$A30,'Data Input'!$A$3:$AX$41,4,FALSE)","v":22.6},{"$f":"+VLOOKUP(+$A30,'Data Input'!$A$3:$AX$41,5,FALSE)","v":-17},{"$f":"+VLOOKUP(+$A30,'Data Input'!$A$3:$AX$41,6,FALSE)","v":"W"},{"$f":"+VLOOKUP(+$A30,'Data Input'!$A$3:$AX$41,7,FALSE)","v":"C"},{"$f":"+VLOOKUP($A30,'Data Input'!$A$3:$AX$41,33,FALSE)","v":7},{"$f":"+VLOOKUP($A30,'Data Input'!$A$3:$AX$41,34,FALSE)","v":32},{"$f":"+VLOOKUP($A30,'Data Input'!$A$3:$AX$41,35,FALSE)","v":52.540000000000873},null,{"$f":"+VLOOKUP($A30,'Data Input'!$A$3:$AX$41,37,FALSE)","v":"W"}]
[177,{"$f":"+VLOOKUP(+$A31,'Data Input'!$A$3:$AX$41,2,FALSE)","v":"Breeze"},{"$f":"+VLOOKUP(+$A31,'Data Input'!$A$3:$AX$41,3,FALSE)","v":"M Ellis"},{"$f":"+VLOOKUP(+$A31,'Data Input'!$A$3:$AX$41,4,FALSE)","v":32},{"$f":"+VLOOKUP(+$A31,'Data Input'!$A$3:$AX$41,5,FALSE)","v":3},{"$f":"+VLOOKUP(+$A31,'Data Input'!$A$3:$AX$41,6,FALSE)","v":"W"},{"$f":"+VLOOKUP(+$A31,'Data Input'!$A$3:$AX$41,7,FALSE)","v":"A"},{"$f":"+VLOOKUP($A31,'Data Input'!$A$3:$AX$41,33,FALSE)","v":9},{"$f":"+VLOOKUP($A31,'Data Input'!$A$3:$AX$41,34,FALSE)","v":32},{"$f":"+VLOOKUP($A31,'Data Input'!$A$3:$AX$41,35,FALSE)","v":18.139999999999418},null,{"$f":"+VLOOKUP($A31,'Data Input'!$A$3:$AX$41,37,FALSE)","v":"W"}]
[219,{"$f":"+VLOOKUP(+$A32,'Data Input'!$A$3:$AX$41,2,FALSE)","v":"Farthing"},{"$f":"+VLOOKUP(+$A32,'Data Input'!$A$3:$AX$41,3,FALSE)","v":"M Farrar"},{"$f":"+VLOOKUP(+$A32,'Data Input'!$A$3:$AX$41,4,FALSE)","v":36},{"$f":"+VLOOKUP(+$A32,'Data Input'!$A$3:$AX$41,5,FALSE)","v":3},{"$f":"+VLOOKUP(+$A32,'Data Input'!$A$3:$AX$41,6,FALSE)","v":"W"},{"$f":"+VLOOKUP(+$A32,'Data Input'!$A$3:$AX$41,7,FALSE)","v":"A"},{"$f":"+VLOOKUP($A32,'Data Input'!$A$3:$AX$41,33,FALSE)","v":9},{"$f":"+VLOOKUP($A32,'Data Input'!$A$3:$AX$41,34,FALSE)","v":59},{"$f":"+VLOOKUP($A32,'Data Input'!$A$3:$AX$41,35,FALSE)","v":43.05000000000291},null,{"$f":"+VLOOKUP($A32,'Data Input'!$A$3:$AX$41,37,FALSE)","v":"W"}]
[240,{"$f":"+VLOOKUP(+$A33,'Data Input'!$A$3:$AX$41,2,FALSE)","v":"Avocet"},{"$f":"+VLOOKUP(+$A33,'Data Input'!$A$3:$AX$41,3,FALSE)","v":"R  Branford"},{"$f":"+VLOOKUP(+$A33,'Data Input'!$A$3:$AX$41,4,FALSE)","v":28},{"$f":"+VLOOKUP(+$A33,'Data Input'!$A$3:$AX$41,5,FALSE)","v":-16},{"$f":"+VLOOKUP(+$A33,'Data Input'!$A$3:$AX$41,6,FALSE)","v":"W"},{"$f":"+VLOOKUP(+$A33,'Data Input'!$A$3:$AX$41,7,FALSE)","v":"B"},{"$f":"+VLOOKUP($A33,'Data Input'!$A$3:$AX$41,33,FALSE)","v":8},{"$f":"+VLOOKUP($A33,'Data Input'!$A$3:$AX$41,34,FALSE)","v":2},{"$f":"+VLOOKUP($A33,'Data Input'!$A$3:$AX$41,35,FALSE)","v":4.5599999999976717},null,{"$f":"+VLOOKUP($A33,'Data Input'!$A$3:$AX$41,37,FALSE)","v":"W"}]
[416,{"$f":"+VLOOKUP(+$A34,'Data Input'!$A$3:$AX$41,2,FALSE)","v":"Alice Rose"},{"$f":"+VLOOKUP(+$A34,'Data Input'!$A$3:$AX$41,3,FALSE)","v":"D Radley"},{"$f":"+VLOOKUP(+$A34,'Data Input'!$A$3:$AX$41,4,FALSE)","v":28.5},{"$f":"+VLOOKUP(+$A34,'Data Input'!$A$3:$AX$41,5,FALSE)","v":-7},{"$f":"+VLOOKUP(+$A34,'Data Input'!$A$3:$AX$41,6,FALSE)","v":"W"},{"$f":"+VLOOKUP(+$A34,'Data Input'!$A$3:$AX$41,7,FALSE)","v":"A"},{"$f":"+VLOOKUP($A34,'Data Input'!$A$3:$AX$41,33,FALSE)","v":8},{"$f":"+VLOOKUP($A34,'Data Input'!$A$3:$AX$41,34,FALSE)","v":35},{"$f":"+VLOOKUP($A34,'Data Input'!$A$3:$AX$41,35,FALSE)","v":5.7600000000020373},null,{"$f":"+VLOOKUP($A34,'Data Input'!$A$3:$AX$41,37,FALSE)","v":"W"}]
[109,{"$f":"+VLOOKUP(+$A35,'Data Input'!$A$3:$AX$41,2,FALSE)","v":"Kingfisher"},{"$f":"+VLOOKUP(+$A35,'Data Input'!$A$3:$AX$41,3,FALSE)","v":"J Flatman"},{"$f":"+VLOOKUP(+$A35,'Data Input'!$A$3:$AX$41,4,FALSE)","v":24.5},{"$f":"+VLOOKUP(+$A35,'Data Input'!$A$3:$AX$41,5,FALSE)","v":-19},{"$f":"+VLOOKUP(+$A35,'Data Input'!$A$3:$AX$41,6,FALSE)","v":"W"},{"$f":"+VLOOKUP(+$A35,'Data Input'!$A$3:$AX$41,7,FALSE)","v":"C"},{"$f":"+VLOOKUP($A35,'Data Input'!$A$3:$AX$41,33,FALSE)","v":7},{"$f":"+VLOOKUP($A35,'Data Input'!$A$3:$AX$41,34,FALSE)","v":25},{"$f":"+VLOOKUP($A35,'Data Input'!$A$3:$AX$41,35,FALSE)","v":30},null,{"$f":"+VLOOKUP($A35,'Data Input'!$A$3:$AX$41,37,FALSE)","v":"W"}]
[]
[]
[]
[]
[]
[]
[{"$f":"COUNT(A3:A41)","v":33}]

{"sheet":"Moonraker","index":2,"n_rows":42,"n_cols":13,"rows_kept":42,"cut":false,"hidden":false,"merged":[]}
[null,null,null,null,null,null,null,null,"Elapsed"]
["No","Yacht","Skipper","Length","H/C","P","Class","H","M","S",null,"Pos"," "]
[323,{"$f":"+VLOOKUP(+$A3,'Data Input'!$A$3:$AX$41,2,FALSE)","v":"Starlight Lady"},{"$f":"+VLOOKUP(+$A3,'Data Input'!$A$3:$AX$41,3,FALSE)","v":"N.Matthews"},{"$f":"+VLOOKUP(+$A3,'Data Input'!$A$3:$AX$41,4,FALSE)","v":30},{"$f":"+VLOOKUP(+$A3,'Data Input'!$A$3:$AX$41,5,FALSE)","v":13},{"$f":"+VLOOKUP(+$A3,'Data Input'!$A$3:$AX$41,6,FALSE)","v":0},{"$f":"+VLOOKUP(+$A3,'Data Input'!$A$3:$AX$41,7,FALSE)","v":"A"},{"$f":"+VLOOKUP($A3,'Data Input'!$A$3:$AX$41,27,FALSE)","v":4},{"$f":"+VLOOKUP($A3,'Data Input'!$A$3:$AX$41,28,FALSE)","v":5},{"$f":"+VLOOKUP($A3,'Data Input'!$A$3:$AX$41,29,FALSE)","v":1},null,{"$f":"+VLOOKUP($A3,'Data Input'!$A$3:$AX$41,31,FALSE)","v":1}]
[417,{"$f":"+VLOOKUP(+$A4,'Data Input'!$A$3:$AX$41,2,FALSE)","v":"Stellar"},{"$f":"+VLOOKUP(+$A4,'Data Input'!$A$3:$AX$41,3,FALSE)","v":"T Frary"},{"$f":"+VLOOKUP(+$A4,'Data Input'!$A$3:$AX$41,4,FALSE)","v":31.3},{"$f":"+VLOOKUP(+$A4,'Data Input'!$A$3:$AX$41,5,FALSE)","v":17},{"$f":"+VLOOKUP(+$A4,'Data Input'!$A$3:$AX$41,6,FALSE)","v":0},{"$f":"+VLOOKUP(+$A4,'Data Input'!$A$3:$AX$41,7,FALSE)","v":"A"},{"$f":"+VLOOKUP($A4,'Data Input'!$A$3:$AX$41,27,FALSE)","v":4},{"$f":"+VLOOKUP($A4,'Data Input'!$A$3:$AX$41,28,FALSE)","v":9},{"$f":"+VLOOKUP($A4,'Data Input'!$A$3:$AX$41,29,FALSE)","v":16},null,{"$f":"+VLOOKUP($A4,'Data Input'!$A$3:$AX$41,31,FALSE)","v":2}]
[373,{"$f":"+VLOOKUP(+$A5,'Data Input'!$A$3:$AX$41,2,FALSE)","v":"Meggie"},{"$f":"+VLOOKUP(+$A5,'Data Input'!$A$3:$AX$41,3,FALSE)","v":"J Tansley"},{"$f":"+VLOOKUP(+$A5,'Data Input'!$A$3:$AX$41,4,FALSE)","v":34.9},{"$f":"+VLOOKUP(+$A5,'Data Input'!$A$3:$AX$41,5,FALSE)","v":13},{"$f":"+VLOOKUP(+$A5,'Data Input'!$A$3:$AX$41,6,FALSE)","v":""},{"$f":"+VLOOKUP(+$A5,'Data Input'!$A$3:$AX$41,7,FALSE)","v":"A"},{"$f":"+VLOOKUP($A5,'Data Input'!$A$3:$AX$41,27,FALSE)","v":4},{"$f":"+VLOOKUP($A5,'Data Input'!$A$3:$AX$41,28,FALSE)","v":29},{"$f":"+VLOOKUP($A5,'Data Input'!$A$3:$AX$41,29,FALSE)","v":21},null,{"$f":"+VLOOKUP($A5,'Data Input'!$A$3:$AX$41,31,FALSE)","v":3}]
[368,{"$f":"+VLOOKUP(+$A6,'Data Input'!$A$3:$AX$41,2,FALSE)","v":"Wandering Rose"},{"$f":"+VLOOKUP(+$A6,'Data Input'!$A$3:$AX$41,3,FALSE)","v":"  Radley"},{"$f":"+VLOOKUP(+$A6,'Data Input'!$A$3:$AX$41,4,FALSE)","v":31},{"$f":"+VLOOKUP(+$A6,'Data Input'!$A$3:$AX$41,5,FALSE)","v":-2},{"$f":"+VLOOKUP(+$A6,'Data Input'!$A$3:$AX$41,6,FALSE)","v":0},{"$f":"+VLOOKUP(+$A6,'Data Input'!$A$3:$AX$41,7,FALSE)","v":"A"},{"$f":"+VLOOKUP($A6,'Data Input'!$A$3:$AX$41,27,FALSE)","v":4},{"$f":"+VLOOKUP($A6,'Data Input'!$A$3:$AX$41,28,FALSE)","v":32},{"$f":"+VLOOKUP($A6,'Data Input'!$A$3:$AX$41,29,FALSE)","v":53},null,{"$f":"+VLOOKUP($A6,'Data Input'!$A$3:$AX$41,31,FALSE)","v":4}]
[369,{"$f":"+VLOOKUP(+$A7,'Data Input'!$A$3:$AX$41,2,FALSE)","v":"Moonshadow"},{"$f":"+VLOOKUP(+$A7,'Data Input'!$A$3:$AX$41,3,FALSE)","v":"N Hovey"},{"$f":"+VLOOKUP(+$A7,'Data Input'!$A$3:$AX$41,4,FALSE)","v":31.5},{"$f":"+VLOOKUP(+$A7,'Data Input'!$A$3:$AX$41,5,FALSE)","v":4},{"$f":"+VLOOKUP(+$A7,'Data Input'!$A$3:$AX$41,6,FALSE)","v":""},{"$f":"+VLOOKUP(+$A7,'Data Input'!$A$3:$AX$41,7,FALSE)","v":"A"},{"$f":"+VLOOKUP($A7,'Data Input'!$A$3:$AX$41,27,FALSE)","v":4},{"$f":"+VLOOKUP($A7,'Data Input'!$A$3:$AX$41,28,FALSE)","v":34},{"$f":"+VLOOKUP($A7,'Data Input'!$A$3:$AX$41,29,FALSE)","v":35},null,{"$f":"+VLOOKUP($A7,'Data Input'!$A$3:$AX$41,31,FALSE)","v":5}]
[370,{"$f":"+VLOOKUP(+$A8,'Data Input'!$A$3:$AX$41,2,FALSE)","v":"Glory"},{"$f":"+VLOOKUP(+$A8,'Data Input'!$A$3:$AX$41,3,FALSE)","v":"C Brown"},{"$f":"+VLOOKUP(+$A8,'Data Input'!$A$3:$AX$41,4,FALSE)","v":35},{"$f":"+VLOOKUP(+$A8,'Data Input'!$A$3:$AX$41,5,FALSE)","v":-6},{"$f":"+VLOOKUP(+$A8,'Data Input'!$A$3:$AX$41,6,FALSE)","v":""},{"$f":"+VLOOKUP(+$A8,'Data Input'!$A$3:$AX$41,7,FALSE)","v":"A"},{"$f":"+VLOOKUP($A8,'Data Input'!$A$3:$AX$41,27,FALSE)","v":4},{"$f":"+VLOOKUP($A8,'Data Input'!$A$3:$AX$41,28,FALSE)","v":37},{"$f":"+VLOOKUP($A8,'Data Input'!$A$3:$AX$41,29,FALSE)","v":45},null,{"$f":"+VLOOKUP($A8,'Data Input'!$A$3:$AX$41,31,FALSE)","v":6}]
[262,{"$f":"+VLOOKUP(+$A9,'Data Input'!$A$3:$AX$41,2,FALSE)","v":"Jessie May"},{"$f":"+VLOOKUP(+$A9,'Data Input'!$A$3:$AX$41,3,FALSE)","v":"S Dugdale"},{"$f":"+VLOOKUP(+$A9,'Data Input'!$A$3:$AX$41,4,FALSE)","v":28},{"$f":"+VLOOKUP(+$A9,'Data Input'!$A$3:$AX$41,5,FALSE)","v":-5},{"$f":"+VLOOKUP(+$A9,'Data Input'!$A$3:$AX$41,6,FALSE)","v":0},{"$f":"+VLOOKUP(+$A9,'Data Input'!$A$3:$AX$41,7,FALSE)","v":"B"},{"$f":"+VLOOKUP($A9,'Data Input'!$A$3:$AX$41,27,FALSE)","v":4},{"$f":"+VLOOKUP($A9,'Data Input'!$A$3:$AX$41,28,FALSE)","v":39},{"$f":"+VLOOKUP($A9,'Data Input'!$A$3:$AX$41,29,FALSE)","v":44},null,{"$f":"+VLOOKUP($A9,'Data Input'!$A$3:$AX$41,31,FALSE)","v":7}]
[244,{"$f":"+VLOOKUP(+$A10,'Data Input'!$A$3:$AX$41,2,FALSE)","v":"Catspaw"},{"$f":"+VLOOKUP(+$A10,'Data Input'!$A$3:$AX$41,3,FALSE)","v":"B Wilkins"},{"$f":"+VLOOKUP(+$A10,'Data Input'!$A$3:$AX$41,4,FALSE)","v":28},{"$f":"+VLOOKUP(+$A10,'Data Input'!$A$3:$AX$41,5,FALSE)","v":-4},{"$f":"+VLOOKUP(+$A10,'Data Input'!$A$3:$AX$41,6,FALSE)","v":0},{"$f":"+VLOOKUP(+$A10,'Data Input'!$A$3:$AX$41,7,FALSE)","v":"B"},{"$f":"+VLOOKUP($A10,'Data Input'!$A$3:$AX$41,27,FALSE)","v":4},{"$f":"+VLOOKUP($A10,'Data Input'!$A$3:$AX$41,28,FALSE)","v":52},{"$f":"+VLOOKUP($A10,'Data Input'!$A$3:$AX$41,29,FALSE)","v":5},null,{"$f":"+VLOOKUP($A10,'Data Input'!$A$3:$AX$41,31,FALSE)","v":8}]
[152,{"$f":"+VLOOKUP(+$A11,'Data Input'!$A$3:$AX$41,2,FALSE)","v":"Sabrina 2"},{"$f":"+VLOOKUP(+$A11,'Data Input'!$A$3:$AX$41,3,FALSE)","v":"J Holmes"},{"$f":"+VLOOKUP(+$A11,'Data Input'!$A$3:$AX$41,4,FALSE)","v":29},{"$f":"+VLOOKUP(+$A11,'Data Input'!$A$3:$AX$41,5,FALSE)","v":-7},{"$f":"+VLOOKUP(+$A11,'Data Input'!$A$3:$AX$41,6,FALSE)","v":0},{"$f":"+VLOOKUP(+$A11,'Data Input'!$A$3:$AX$41,7,FALSE)","v":"A"},{"$f":"+VLOOKUP($A11,'Data Input'!$A$3:$AX$41,27,FALSE)","v":4},{"$f":"+VLOOKUP($A11,'Data Input'!$A$3:$AX$41,28,FALSE)","v":57},{"$f":"+VLOOKUP($A11,'Data Input'!$A$3:$AX$41,29,FALSE)","v":47},null,{"$f":"+VLOOKUP($A11,'Data Input'!$A$3:$AX$41,31,FALSE)","v":9}]
[179,{"$f":"+VLOOKUP(+$A12,'Data Input'!$A$3:$AX$41,2,FALSE)","v":"Waxwing"},{"$f":"+VLOOKUP(+$A12,'Data Input'!$A$3:$AX$41,3,FALSE)","v":"S Clayton"},{"$f":"+VLOOKUP(+$A12,'Data Input'!$A$3:$AX$41,4,FALSE)","v":28},{"$f":"+VLOOKUP(+$A12,'Data Input'!$A$3:$AX$41,5,FALSE)","v":-8},{"$f":"+VLOOKUP(+$A12,'Data Input'!$A$3:$AX$41,6,FALSE)","v":0},{"$f":"+VLOOKUP(+$A12,'Data Input'!$A$3:$AX$41,7,FALSE)","v":"B"},{"$f":"+VLOOKUP($A12,'Data Input'!$A$3:$AX$41,27,FALSE)","v":4},{"$f":"+VLOOKUP($A12,'Data Input'!$A$3:$AX$41,28,FALSE)","v":58},{"$f":"+VLOOKUP($A12,'Data Input'!$A$3:$AX$41,29,FALSE)","v":9},null,{"$f":"+VLOOKUP($A12,'Data Input'!$A$3:$AX$41,31,FALSE)","v":10}]
[217,{"$f":"+VLOOKUP(+$A13,'Data Input'!$A$3:$AX$41,2,FALSE)","v":"Melinda"},{"$f":"+VLOOKUP(+$A13,'Data Input'!$A$3:$AX$41,3,FALSE)","v":"P Howes"},{"$f":"+VLOOKUP(+$A13,'Data Input'!$A$3:$AX$41,4,FALSE)","v":27.9},{"$f":"+VLOOKUP(+$A13,'Data Input'!$A$3:$AX$41,5,FALSE)","v":1},{"$f":"+VLOOKUP(+$A13,'Data Input'!$A$3:$AX$41,6,FALSE)","v":0},{"$f":"+VLOOKUP(+$A13,'Data Input'!$A$3:$AX$41,7,FALSE)","v":"B"},{"$f":"+VLOOKUP($A13,'Data Input'!$A$3:$AX$41,27,FALSE)","v":4},{"$f":"+VLOOKUP($A13,'Data Input'!$A$3:$AX$41,28,FALSE)","v":58},{"$f":"+VLOOKUP($A13,'Data Input'!$A$3:$AX$41,29,FALSE)","v":39},null,{"$f":"+VLOOKUP($A13,'Data Input'!$A$3:$AX$41,31,FALSE)","v":11}]
[418,{"$f":"+VLOOKUP(+$A14,'Data Input'!$A$3:$AX$41,2,FALSE)","v":"Tinkerbell"},{"$f":"+VLOOKUP(+$A14,'Data Input'!$A$3:$AX$41,3,FALSE)","v":"A Lincoln"},{"$f":"+VLOOKUP(+$A14,'Data Input'!$A$3:$AX$41,4,FALSE)","v":25.2},{"$f":"+VLOOKUP(+$A14,'Data Input'!$A$3:$AX$41,5,FALSE)","v":-7},{"$f":"+VLOOKUP(+$A14,'Data Input'!$A$3:$AX$41,6,FALSE)","v":""},{"$f":"+VLOOKUP(+$A14,'Data Input'!$A$3:$AX$41,7,FALSE)","v":"B"},{"$f":"+VLOOKUP($A14,'Data Input'!$A$3:$AX$41,27,FALSE)","v":4},{"$f":"+VLOOKUP($A14,'Data Input'!$A$3:$AX$41,28,FALSE)","v":59},{"$f":"+VLOOKUP($A14,'Data Input'!$A$3:$AX$41,29,FALSE)","v":3},null,{"$f":"+VLOOKUP($A14,'Data Input'!$A$3:$AX$41,31,FALSE)","v":12}]
[400,{"$f":"+VLOOKUP(+$A15,'Data Input'!$A$3:$AX$41,2,FALSE)","v":"Swallow"},{"$f":"+VLOOKUP(+$A15,'Data Input'!$A$3:$AX$41,3,FALSE)","v":"K Halifax"},{"$f":"+VLOOKUP(+$A15,'Data Input'!$A$3:$AX$41,4,FALSE)","v":26.5},{"$f":"+VLOOKUP(+$A15,'Data Input'!$A$3:$AX$41,5,FALSE)","v":-7},{"$f":"+VLOOKUP(+$A15,'Data Input'!$A$3:$AX$41,6,FALSE)","v":""},{"$f":"+VLOOKUP(+$A15,'Data Input'!$A$3:$AX$41,7,FALSE)","v":"B"},{"$f":"+VLOOKUP($A15,'Data Input'!$A$3:$AX$41,27,FALSE)","v":5},{"$f":"+VLOOKUP($A15,'Data Input'!$A$3:$AX$41,28,FALSE)","v":3},{"$f":"+VLOOKUP($A15,'Data Input'!$A$3:$AX$41,29,FALSE)","v":47},null,{"$f":"+VLOOKUP($A15,'Data Input'!$A$3:$AX$41,31,FALSE)","v":13}]
[199,{"$f":"+VLOOKUP(+$A16,'Data Input'!$A$3:$AX$41,2,FALSE)","v":"Morning Calm"},{"$f":"+VLOOKUP(+$A16,'Data Input'!$A$3:$AX$41,3,FALSE)","v":"W Clark"},{"$f":"+VLOOKUP(+$A16,'Data Input'!$A$3:$AX$41,4,FALSE)","v":26},{"$f":"+VLOOKUP(+$A16,'Data Input'!$A$3:$AX$41,5,FALSE)","v":-9},{"$f":"+VLOOKUP(+$A16,'Data Input'!$A$3:$AX$41,6,FALSE)","v":0},{"$f":"+VLOOKUP(+$A16,'Data Input'!$A$3:$AX$41,7,FALSE)","v":"B"},{"$f":"+VLOOKUP($A16,'Data Input'!$A$3:$AX$41,27,FALSE)","v":5},{"$f":"+VLOOKUP($A16,'Data Input'!$A$3:$AX$41,28,FALSE)","v":7},{"$f":"+VLOOKUP($A16,'Data Input'!$A$3:$AX$41,29,FALSE)","v":5},null,{"$f":"+VLOOKUP($A16,'Data Input'!$A$3:$AX$41,31,FALSE)","v":14}]
[218,{"$f":"+VLOOKUP(+$A17,'Data Input'!$A$3:$AX$41,2,FALSE)","v":"Mystery"},{"$f":"+VLOOKUP(+$A17,'Data Input'!$A$3:$AX$41,3,FALSE)","v":"M Ford"},{"$f":"+VLOOKUP(+$A17,'Data Input'!$A$3:$AX$41,4,FALSE)","v":26},{"$f":"+VLOOKUP(+$A17,'Data Input'!$A$3:$AX$41,5,FALSE)","v":-9},{"$f":"+VLOOKUP(+$A17,'Data Input'!$A$3:$AX$41,6,FALSE)","v":0},{"$f":"+VLOOKUP(+$A17,'Data Input'!$A$3:$AX$41,7,FALSE)","v":"B"},{"$f":"+VLOOKUP($A17,'Data Input'!$A$3:$AX$41,27,FALSE)","v":5},{"$f":"+VLOOKUP($A17,'Data Input'!$A$3:$AX$41,28,FALSE)","v":8},{"$f":"+VLOOKUP($A17,'Data Input'!$A$3:$AX$41,29,FALSE)","v":54},null,{"$f":"+VLOOKUP($A17,'Data Input'!$A$3:$AX$41,31,FALSE)","v":15}]
[10,{"$f":"+VLOOKUP(+$A18,'Data Input'!$A$3:$AX$41,2,FALSE)","v":"Flight"},{"$f":"+VLOOKUP(+$A18,'Data Input'!$A$3:$AX$41,3,FALSE)","v":"J Farrow"},{"$f":"+VLOOKUP(+$A18,'Data Input'!$A$3:$AX$41,4,FALSE)","v":29.9},{"$f":"+VLOOKUP(+$A18,'Data Input'!$A$3:$AX$41,5,FALSE)","v":-8},{"$f":"+VLOOKUP(+$A18,'Data Input'!$A$3:$AX$41,6,FALSE)","v":0},{"$f":"+VLOOKUP(+$A18,'Data Input'!$A$3:$AX$41,7,FALSE)","v":"A"},{"$f":"+VLOOKUP($A18,'Data Input'!$A$3:$AX$41,27,FALSE)","v":5},{"$f":"+VLOOKUP($A18,'Data Input'!$A$3:$AX$41,28,FALSE)","v":10},{"$f":"+VLOOKUP($A18,'Data Input'!$A$3:$AX$41,29,FALSE)","v":18},null,{"$f":"+VLOOKUP($A18,'Data Input'!$A$3:$AX$41,31,FALSE)","v":16}]
[224,{"$f":"+VLOOKUP(+$A19,'Data Input'!$A$3:$AX$41,2,FALSE)","v":"Anna"},{"$f":"+VLOOKUP(+$A19,'Data Input'!$A$3:$AX$41,3,FALSE)","v":"R Branscombe"},{"$f":"+VLOOKUP(+$A19,'Data Input'!$A$3:$AX$41,4,FALSE)","v":25},{"$f":"+VLOOKUP(+$A19,'Data Input'!$A$3:$AX$41,5,FALSE)","v":-10},{"$f":"+VLOOKUP(+$A19,'Data Input'!$A$3:$AX$41,6,FALSE)","v":0},{"$f":"+VLOOKUP(+$A19,'Data Input'!$A$3:$AX$41,7,FALSE)","v":"B"},{"$f":"+VLOOKUP($A19,'Data Input'!$A$3:$AX$41,27,FALSE)","v":5},{"$f":"+VLOOKUP($A19,'Data Input'!$A$3:$AX$41,28,FALSE)","v":11},{"$f":"+VLOOKUP($A19,'Data Input'!$A$3:$AX$41,29,FALSE)","v":12},null,{"$f":"+VLOOKUP($A19,'Data Input'!$A$3:$AX$41,31,FALSE)","v":17}]
[25,{"$f":"+VLOOKUP(+$A20,'Data Input'!$A$3:$AX$41,2,FALSE)","v":"Melody"},{"$f":"+VLOOKUP(+$A20,'Data Input'!$A$3:$AX$41,3,FALSE)","v":"M Wells"},{"$f":"+VLOOKUP(+$A20,'Data Input'!$A$3:$AX$41,4,FALSE)","v":26},{"$f":"+VLOOKUP(+$A20,'Data Input'!$A$3:$AX$41,5,FALSE)","v":-10},{"$f":"+VLOOKUP(+$A20,'Data Input'!$A$3:$AX$41,6,FALSE)","v":0},{"$f":"+VLOOKUP(+$A20,'Data Input'!$A$3:$AX$41,7,FALSE)","v":"B"},{"$f":"+VLOOKUP($A20,'Data Input'!$A$3:$AX$41,27,FALSE)","v":5},{"$f":"+VLOOKUP($A20,'Data Input'!$A$3:$AX$41,28,FALSE)","v":29},{"$f":"+VLOOKUP($A20,'Data Input'!$A$3:$AX$41,29,FALSE)","v":57},null,{"$f":"+VLOOKUP($A20,'Data Input'!$A$3:$AX$41,31,FALSE)","v":18}]
[87,{"$f":"+VLOOKUP(+$A21,'Data Input'!$A$3:$AX$41,2,FALSE)","v":"Modwena"},{"$f":"+VLOOKUP(+$A21,'Data Input'!$A$3:$AX$41,3,FALSE)","v":"M Cassidy"},{"$f":"+VLOOKUP(+$A21,'Data Input'!$A$3:$AX$41,4,FALSE)","v":24.8},{"$f":"+VLOOKUP(+$A21,'Data Input'!$A$3:$AX$41,5,FALSE)","v":-19},{"$f":"+VLOOKUP(+$A21,'Data Input'!$A$3:$AX$41,6,FALSE)","v":0},{"$f":"+VLOOKUP(+$A21,'Data Input'!$A$3:$AX$41,7,FALSE)","v":"C"},{"$f":"+VLOOKUP($A21,'Data Input'!$A$3:$AX$41,27,FALSE)","v":5},{"$f":"+VLOOKUP($A21,'Data Input'!$A$3:$AX$41,28,FALSE)","v":37},{"$f":"+VLOOKUP($A21,'Data Input'!$A$3:$AX$41,29,FALSE)","v":2},null,{"$f":"+VLOOKUP($A21,'Data Input'!$A$3:$AX$41,31,FALSE)","v":19}]
[429,{"$f":"+VLOOKUP(+$A22,'Data Input'!$A$3:$AX$41,2,FALSE)","v":"Pickle"},{"$f":"+VLOOKUP(+$A22,'Data Input'!$A$3:$AX$41,3,FALSE)","v":"P Montague"},{"$f":"+VLOOKUP(+$A22,'Data Input'!$A$3:$AX$41,4,FALSE)","v":22.6},{"$f":"+VLOOKUP(+$A22,'Data Input'!$A$3:$AX$41,5,FALSE)","v":-17},{"$f":"+VLOOKUP(+$A22,'Data Input'!$A$3:$AX$41,6,FALSE)","v":0},{"$f":"+VLOOKUP(+$A22,'Data Input'!$A$3:$AX$41,7,FALSE)","v":"C"},{"$f":"+VLOOKUP($A22,'Data Input'!$A$3:$AX$41,27,FALSE)","v":5},{"$f":"+VLOOKUP($A22,'Data Input'!$A$3:$AX$41,28,FALSE)","v":51},{"$f":"+VLOOKUP($A22,'Data Input'!$A$3:$AX$41,29,FALSE)","v":54},null,{"$f":"+VLOOKUP($A22,'Data Input'!$A$3:$AX$41,31,FALSE)","v":20}]
[79,{"$f":"+VLOOKUP(+$A23,'Data Input'!$A$3:$AX$41,2,FALSE)","v":"Daisy"},{"$f":"+VLOOKUP(+$A23,'Data Input'!$A$3:$AX$41,3,FALSE)","v":"T Ford"},{"$f":"+VLOOKUP(+$A23,'Data Input'!$A$3:$AX$41,4,FALSE)","v":22},{"$f":"+VLOOKUP(+$A23,'Data Input'!$A$3:$AX$41,5,FALSE)","v":-21},{"$f":"+VLOOKUP(+$A23,'Data Input'!$A$3:$AX$41,6,FALSE)","v":0},{"$f":"+VLOOKUP(+$A23,'Data Input'!$A$3:$AX$41,7,FALSE)","v":"C"},{"$f":"+VLOOKUP($A23,'Data Input'!$A$3:$AX$41,27,FALSE)","v":6},{"$f":"+VLOOKUP($A23,'Data Input'!$A$3:$AX$41,28,FALSE)","v":59},{"$f":"+VLOOKUP($A23,'Data Input'!$A$3:$AX$41,29,FALSE)","v":36},null,{"$f":"+VLOOKUP($A23,'Data Input'!$A$3:$AX$41,31,FALSE)","v":21}]
[22,{"$f":"+VLOOKUP(+$A24,'Data Input'!$A$3:$AX$41,2,FALSE)","v":"Moonraker"},{"$f":"+VLOOKUP(+$A24,'Data Input'!$A$3:$AX$41,3,FALSE)","v":"P Jeckells"},{"$f":"+VLOOKUP(+$A24,'Data Input'!$A$3:$AX$41,4,FALSE)","v":29.5},{"$f":"+VLOOKUP(+$A24,'Data Input'!$A$3:$AX$41,5,FALSE)","v":2},{"$f":"+VLOOKUP(+$A24,'Data Input'!$A$3:$AX$41,6,FALSE)","v":"DNS"},{"$f":"+VLOOKUP(+$A24,'Data Input'!$A$3:$AX$41,7,FALSE)","v":"A"},{"$f":"+VLOOKUP($A24,'Data Input'!$A$3:$AX$41,27,FALSE)","v":0},{"$f":"+VLOOKUP($A24,'Data Input'!$A$3:$AX$41,28,FALSE)","v":0},{"$f":"+VLOOKUP($A24,'Data Input'!$A$3:$AX$41,29,FALSE)","v":0},null,{"$f":"+VLOOKUP($A24,'Data Input'!$A$3:$AX$41,31,FALSE)","v":"DNS"}]
[52,{"$f":"+VLOOKUP(+$A25,'Data Input'!$A$3:$AX$41,2,FALSE)","v":"Maidie"},{"$f":"+VLOOKUP(+$A25,'Data Input'!$A$3:$AX$41,3,FALSE)","v":"M Barnes"},{"$f":"+VLOOKUP(+$A25,'Data Input'!$A$3:$AX$41,4,FALSE)","v":43.2},{"$f":"+VLOOKUP(+$A25,'Data Input'!$A$3:$AX$41,5,FALSE)","v":13},{"$f":"+VLOOKUP(+$A25,'Data Input'!$A$3:$AX$41,6,FALSE)","v":"DNS"},{"$f":"+VLOOKUP(+$A25,'Data Input'!$A$3:$AX$41,7,FALSE)","v":"A"},{"$f":"+VLOOKUP($A25,'Data Input'!$A$3:$AX$41,27,FALSE)","v":0},{"$f":"+VLOOKUP($A25,'Data Input'!$A$3:$AX$41,28,FALSE)","v":0},{"$f":"+VLOOKUP($A25,'Data Input'!$A$3:$AX$41,29,FALSE)","v":0},null,{"$f":"+VLOOKUP($A25,'Data Input'!$A$3:$AX$41,31,FALSE)","v":"DNS"}]
[274,{"$f":"+VLOOKUP(+$A26,'Data Input'!$A$3:$AX$41,2,FALSE)","v":"Elfin"},{"$f":"+VLOOKUP(+$A26,'Data Input'!$A$3:$AX$41,3,FALSE)","v":"A Bond"},{"$f":"+VLOOKUP(+$A26,'Data Input'!$A$3:$AX$41,4,FALSE)","v":21},{"$f":"+VLOOKUP(+$A26,'Data Input'!$A$3:$AX$41,5,FALSE)","v":-27},{"$f":"+VLOOKUP(+$A26,'Data Input'!$A$3:$AX$41,6,FALSE)","v":"DNS"},{"$f":"+VLOOKUP(+$A26,'Data Input'!$A$3:$AX$41,7,FALSE)","v":"C"},{"$f":"+VLOOKUP($A26,'Data Input'!$A$3:$AX$41,27,FALSE)","v":0},{"$f":"+VLOOKUP($A26,'Data Input'!$A$3:$AX$41,28,FALSE)","v":0},{"$f":"+VLOOKUP($A26,'Data Input'!$A$3:$AX$41,29,FALSE)","v":0},null,{"$f":"+VLOOKUP($A26,'Data Input'!$A$3:$AX$41,31,FALSE)","v":"DNS"}]
[335,{"$f":"+VLOOKUP(+$A27,'Data Input'!$A$3:$AX$41,2,FALSE)","v":"Firebird"},{"$f":"+VLOOKUP(+$A27,'Data Input'!$A$3:$AX$41,3,FALSE)","v":"R Richardson"},{"$f":"+VLOOKUP(+$A27,'Data Input'!$A$3:$AX$41,4,FALSE)","v":30},{"$f":"+VLOOKUP(+$A27,'Data Input'!$A$3:$AX$41,5,FALSE)","v":1},{"$f":"+VLOOKUP(+$A27,'Data Input'!$A$3:$AX$41,6,FALSE)","v":"DNS"},{"$f":"+VLOOKUP(+$A27,'Data Input'!$A$3:$AX$41,7,FALSE)","v":"A"},{"$f":"+VLOOKUP($A27,'Data Input'!$A$3:$AX$41,27,FALSE)","v":0},{"$f":"+VLOOKUP($A27,'Data Input'!$A$3:$AX$41,28,FALSE)","v":0},{"$f":"+VLOOKUP($A27,'Data Input'!$A$3:$AX$41,29,FALSE)","v":0},null,{"$f":"+VLOOKUP($A27,'Data Input'!$A$3:$AX$41,31,FALSE)","v":"DNS"}]
[141,{"$f":"+VLOOKUP(+$A28,'Data Input'!$A$3:$AX$41,2,FALSE)","v":"Nirvana"},{"$f":"+VLOOKUP(+$A28,'Data Input'!$A$3:$AX$41,3,FALSE)","v":" M Claridge"},{"$f":"+VLOOKUP(+$A28,'Data Input'!$A$3:$AX$41,4,FALSE)","v":20},{"$f":"+VLOOKUP(+$A28,'Data Input'!$A$3:$AX$41,5,FALSE)","v":-23},{"$f":"+VLOOKUP(+$A28,'Data Input'!$A$3:$AX$41,6,FALSE)","v":"P"},{"$f":"+VLOOKUP(+$A28,'Data Input'!$A$3:$AX$41,7,FALSE)","v":"C"},{"$f":"+VLOOKUP($A28,'Data Input'!$A$3:$AX$41,27,FALSE)","v":6},{"$f":"+VLOOKUP($A28,'Data Input'!$A$3:$AX$41,28,FALSE)","v":12},{"$f":"+VLOOKUP($A28,'Data Input'!$A$3:$AX$41,29,FALSE)","v":55},null,{"$f":"+VLOOKUP($A28,'Data Input'!$A$3:$AX$41,31,FALSE)","v":"P"}]
[6,{"$f":"+VLOOKUP(+$A29,'Data Input'!$A$3:$AX$41,2,FALSE)","v":"Dragonfly"},{"$f":"+VLOOKUP(+$A29,'Data Input'!$A$3:$AX$41,3,FALSE)","v":"S Simpson"},{"$f":"+VLOOKUP(+$A29,'Data Input'!$A$3:$AX$41,4,FALSE)","v":38},{"$f":"+VLOOKUP(+$A29,'Data Input'!$A$3:$AX$41,5,FALSE)","v":-13},{"$f":"+VLOOKUP(+$A29,'Data Input'!$A$3:$AX$41,6,FALSE)","v":"W"},{"$f":"+VLOOKUP(+$A29,'Data Input'!$A$3:$AX$41,7,FALSE)","v":"A"},{"$f":"+VLOOKUP($A29,'Data Input'!$A$3:$AX$41,27,FALSE)","v":10},{"$f":"+VLOOKUP($A29,'Data Input'!$A$3:$AX$41,28,FALSE)","v":14},{"$f":"+VLOOKUP($A29,'Data Input'!$A$3:$AX$41,29,FALSE)","v":34},null,{"$f":"+VLOOKUP($A29,'Data Input'!$A$3:$AX$41,31,FALSE)","v":"W"}]
[155,{"$f":"+VLOOKUP(+$A30,'Data Input'!$A$3:$AX$41,2,FALSE)","v":"Stratus"},{"$f":"+VLOOKUP(+$A30,'Data Input'!$A$3:$AX$41,3,FALSE)","v":"J Townley"},{"$f":"+VLOOKUP(+$A30,'Data Input'!$A$3:$AX$41,4,FALSE)","v":22.6},{"$f":"+VLOOKUP(+$A30,'Data Input'!$A$3:$AX$41,5,FALSE)","v":-17},{"$f":"+VLOOKUP(+$A30,'Data Input'!$A$3:$AX$41,6,FALSE)","v":"W"},{"$f":"+VLOOKUP(+$A30,'Data Input'!$A$3:$AX$41,7,FALSE)","v":"C"},{"$f":"+VLOOKUP($A30,'Data Input'!$A$3:$AX$41,27,FALSE)","v":9},{"$f":"+VLOOKUP($A30,'Data Input'!$A$3:$AX$41,28,FALSE)","v":5},{"$f":"+VLOOKUP($A30,'Data Input'!$A$3:$AX$41,29,FALSE)","v":38},null,{"$f":"+VLOOKUP($A30,'Data Input'!$A$3:$AX$41,31,FALSE)","v":"W"}]
[177,{"$f":"+VLOOKUP(+$A31,'Data Input'!$A$3:$AX$41,2,FALSE)","v":"Breeze"},{"$f":"+VLOOKUP(+$A31,'Data Input'!$A$3:$AX$41,3,FALSE)","v":"M Ellis"},{"$f":"+VLOOKUP(+$A31,'Data Input'!$A$3:$AX$41,4,FALSE)","v":32},{"$f":"+VLOOKUP(+$A31,'Data Input'!$A$3:$AX$41,5,FALSE)","v":3},{"$f":"+VLOOKUP(+$A31,'Data Input'!$A$3:$AX$41,6,FALSE)","v":"W"},{"$f":"+VLOOKUP(+$A31,'Data Input'!$A$3:$AX$41,7,FALSE)","v":"A"},{"$f":"+VLOOKUP($A31,'Data Input'!$A$3:$AX$41,27,FALSE)","v":9},{"$f":"+VLOOKUP($A31,'Data Input'!$A$3:$AX$41,28,FALSE)","v":15},{"$f":"+VLOOKUP($A31,'Data Input'!$A$3:$AX$41,29,FALSE)","v":38},null,{"$f":"+VLOOKUP($A31,'Data Input'!$A$3:$AX$41,31,FALSE)","v":"W"}]
[219,{"$f":"+VLOOKUP(+$A32,'Data Input'!$A$3:$AX$41,2,FALSE)","v":"Farthing"},{"$f":"+VLOOKUP(+$A32,'Data Input'!$A$3:$AX$41,3,FALSE)","v":"M Farrar"},{"$f":"+VLOOKUP(+$A32,'Data Input'!$A$3:$AX$41,4,FALSE)","v":36},{"$f":"+VLOOKUP(+$A32,'Data Input'!$A$3:$AX$41,5,FALSE)","v":3},{"$f":"+VLOOKUP(+$A32,'Data Input'!$A$3:$AX$41,6,FALSE)","v":"W"},{"$f":"+VLOOKUP(+$A32,'Data Input'!$A$3:$AX$41,7,FALSE)","v":"A"},{"$f":"+VLOOKUP($A32,'Data Input'!$A$3:$AX$41,27,FALSE)","v":9},{"$f":"+VLOOKUP($A32,'Data Input'!$A$3:$AX$41,28,FALSE)","v":42},{"$f":"+VLOOKUP($A32,'Data Input'!$A$3:$AX$41,29,FALSE)","v":15},null,{"$f":"+VLOOKUP($A32,'Data Input'!$A$3:$AX$41,31,FALSE)","v":"W"}]
[240,{"$f":"+VLOOKUP(+$A33,'Data Input'!$A$3:$AX$41,2,FALSE)","v":"Avocet"},{"$f":"+VLOOKUP(+$A33,'Data Input'!$A$3:$AX$41,3,FALSE)","v":"R  Branford"},{"$f":"+VLOOKUP(+$A33,'Data Input'!$A$3:$AX$41,4,FALSE)","v":28},{"$f":"+VLOOKUP(+$A33,'Data Input'!$A$3:$AX$41,5,FALSE)","v":-16},{"$f":"+VLOOKUP(+$A33,'Data Input'!$A$3:$AX$41,6,FALSE)","v":"W"},{"$f":"+VLOOKUP(+$A33,'Data Input'!$A$3:$AX$41,7,FALSE)","v":"B"},{"$f":"+VLOOKUP($A33,'Data Input'!$A$3:$AX$41,27,FALSE)","v":9},{"$f":"+VLOOKUP($A33,'Data Input'!$A$3:$AX$41,28,FALSE)","v":33},{"$f":"+VLOOKUP($A33,'Data Input'!$A$3:$AX$41,29,FALSE)","v":54},null,{"$f":"+VLOOKUP($A33,'Data Input'!$A$3:$AX$41,31,FALSE)","v":"W"}]
[416,{"$f":"+VLOOKUP(+$A34,'Data Input'!$A$3:$AX$41,2,FALSE)","v":"Alice Rose"},{"$f":"+VLOOKUP(+$A34,'Data Input'!$A$3:$AX$41,3,FALSE)","v":"D Radley"},{"$f":"+VLOOKUP(+$A34,'Data Input'!$A$3:$AX$41,4,FALSE)","v":28.5},{"$f":"+VLOOKUP(+$A34,'Data Input'!$A$3:$AX$41,5,FALSE)","v":-7},{"$f":"+VLOOKUP(+$A34,'Data Input'!$A$3:$AX$41,6,FALSE)","v":"W"},{"$f":"+VLOOKUP(+$A34,'Data Input'!$A$3:$AX$41,7,FALSE)","v":"A"},{"$f":"+VLOOKUP($A34,'Data Input'!$A$3:$AX$41,27,FALSE)","v":9},{"$f":"+VLOOKUP($A34,'Data Input'!$A$3:$AX$41,28,FALSE)","v":13},{"$f":"+VLOOKUP($A34,'Data Input'!$A$3:$AX$41,29,FALSE)","v":52},null,{"$f":"+VLOOKUP($A34,'Data Input'!$A$3:$AX$41,31,FALSE)","v":"W"}]
[109,{"$f":"+VLOOKUP(+$A35,'Data Input'!$A$3:$AX$41,2,FALSE)","v":"Kingfisher"},{"$f":"+VLOOKUP(+$A35,'Data Input'!$A$3:$AX$41,3,FALSE)","v":"J Flatman"},{"$f":"+VLOOKUP(+$A35,'Data Input'!$A$3:$AX$41,4,FALSE)","v":24.5},{"$f":"+VLOOKUP(+$A35,'Data Input'!$A$3:$AX$41,5,FALSE)","v":-19},{"$f":"+VLOOKUP(+$A35,'Data Input'!$A$3:$AX$41,6,FALSE)","v":"W"},{"$f":"+VLOOKUP(+$A35,'Data Input'!$A$3:$AX$41,7,FALSE)","v":"C"},{"$f":"+VLOOKUP($A35,'Data Input'!$A$3:$AX$41,27,FALSE)","v":9},{"$f":"+VLOOKUP($A35,'Data Input'!$A$3:$AX$41,28,FALSE)","v":10},{"$f":"+VLOOKUP($A35,'Data Input'!$A$3:$AX$41,29,FALSE)","v":0},null,{"$f":"+VLOOKUP($A35,'Data Input'!$A$3:$AX$41,31,FALSE)","v":"W"}]
[]
[]
[]
[]
[]
[]
[{"$f":"COUNT(A3:A41)","v":33}]

{"sheet":"Classes","index":3,"n_rows":42,"n_cols":15,"rows_kept":42,"cut":false,"hidden":false,"merged":[]}
[null,null,null,null,null,null,null,null,"Corrected",null,null,null,null,null,"Don’t use filters on this page"]
["No","Yacht","Skipper","Length","H/C","P","Class","H","M","S",null,"Pos"," ",null,"Sort will place into clases and then order.  You can then insert rows with Trophy Name before printing"]
[6,{"$f":"+VLOOKUP(+$A3,'Data Input'!$A$3:$AX$41,2,FALSE)","v":"Dragonfly"},{"$f":"+VLOOKUP(+$A3,'Data Input'!$A$3:$AX$41,3,FALSE)","v":"S Simpson"},{"$f":"+VLOOKUP(+$A3,'Data Input'!$A$3:$AX$41,4,FALSE)","v":38},{"$f":"+VLOOKUP(+$A3,'Data Input'!$A$3:$AX$41,5,FALSE)","v":-13},{"$f":"+VLOOKUP(+$A3,'Data Input'!$A$3:$AX$41,6,FALSE)","v":"W"},{"$f":"+VLOOKUP(+$A3,'Data Input'!$A$3:$AX$41,7,FALSE)","v":"A"},{"$f":"+VLOOKUP($A3,'Data Input'!$A$3:$AX$41,33,FALSE)","v":8},{"$f":"+VLOOKUP($A3,'Data Input'!$A$3:$AX$41,34,FALSE)","v":54},{"$f":"+VLOOKUP($A3,'Data Input'!$A$3:$AX$41,35,FALSE)","v":40.380000000001019},null,{"$f":"+VLOOKUP($A3,'Data Input'!$A$3:$AX$41,37,FALSE)","v":"W"},null,null,"Starlight Lady"]
[10,{"$f":"+VLOOKUP(+$A4,'Data Input'!$A$3:$AX$41,2,FALSE)","v":"Flight"},{"$f":"+VLOOKUP(+$A4,'Data Input'!$A$3:$AX$41,3,FALSE)","v":"J Farrow"},{"$f":"+VLOOKUP(+$A4,'Data Input'!$A$3:$AX$41,4,FALSE)","v":29.9},{"$f":"+VLOOKUP(+$A4,'Data Input'!$A$3:$AX$41,5,FALSE)","v":-8},{"$f":"+VLOOKUP(+$A4,'Data Input'!$A$3:$AX$41,6,FALSE)","v":0},{"$f":"+VLOOKUP(+$A4,'Data Input'!$A$3:$AX$41,7,FALSE)","v":"A"},{"$f":"+VLOOKUP($A4,'Data Input'!$A$3:$AX$41,33,FALSE)","v":4},{"$f":"+VLOOKUP($A4,'Data Input'!$A$3:$AX$41,34,FALSE)","v":45},{"$f":"+VLOOKUP($A4,'Data Input'!$A$3:$AX$41,35,FALSE)","v":28.56000000000131},null,{"$f":"+VLOOKUP($A4,'Data Input'!$A$3:$AX$41,37,FALSE)","v":14},null,null,"Jeckells"]
[22,{"$f":"+VLOOKUP(+$A5,'Data Input'!$A$3:$AX$41,2,FALSE)","v":"Moonraker"},{"$f":"+VLOOKUP(+$A5,'Data Input'!$A$3:$AX$41,3,FALSE)","v":"P Jeckells"},{"$f":"+VLOOKUP(+$A5,'Data Input'!$A$3:$AX$41,4,FALSE)","v":29.5},{"$f":"+VLOOKUP(+$A5,'Data Input'!$A$3:$AX$41,5,FALSE)","v":2},{"$f":"+VLOOKUP(+$A5,'Data Input'!$A$3:$AX$41,6,FALSE)","v":"DNS"},{"$f":"+VLOOKUP(+$A5,'Data Input'!$A$3:$AX$41,7,FALSE)","v":"A"},{"$f":"+VLOOKUP($A5,'Data Input'!$A$3:$AX$41,33,FALSE)","v":0},{"$f":"+VLOOKUP($A5,'Data Input'!$A$3:$AX$41,34,FALSE)","v":0},{"$f":"+VLOOKUP($A5,'Data Input'!$A$3:$AX$41,35,FALSE)","v":0},null,{"$f":"+VLOOKUP($A5,'Data Input'!$A$3:$AX$41,37,FALSE)","v":"DNS"},null,null,"Wilberforce Smith"]
[52,{"$f":"+VLOOKUP(+$A6,'Data Input'!$A$3:$AX$41,2,FALSE)","v":"Maidie"},{"$f":"+VLOOKUP(+$A6,'Data Input'!$A$3:$AX$41,3,FALSE)","v":"M Barnes"},{"$f":"+VLOOKUP(+$A6,'Data Input'!$A$3:$AX$41,4,FALSE)","v":43.2},{"$f":"+VLOOKUP(+$A6,'Data Input'!$A$3:$AX$41,5,FALSE)","v":13},{"$f":"+VLOOKUP(+$A6,'Data Input'!$A$3:$AX$41,6,FALSE)","v":"DNS"},{"$f":"+VLOOKUP(+$A6,'Data Input'!$A$3:$AX$41,7,FALSE)","v":"A"},{"$f":"+VLOOKUP($A6,'Data Input'!$A$3:$AX$41,33,FALSE)","v":0},{"$f":"+VLOOKUP($A6,'Data Input'!$A$3:$AX$41,34,FALSE)","v":0},{"$f":"+VLOOKUP($A6,'Data Input'!$A$3:$AX$41,35,FALSE)","v":0},null,{"$f":"+VLOOKUP($A6,'Data Input'!$A$3:$AX$41,37,FALSE)","v":"DNS"}]
[152,{"$f":"+VLOOKUP(+$A7,'Data Input'!$A$3:$AX$41,2,FALSE)","v":"Sabrina 2"},{"$f":"+VLOOKUP(+$A7,'Data Input'!$A$3:$AX$41,3,FALSE)","v":"J Holmes"},{"$f":"+VLOOKUP(+$A7,'Data Input'!$A$3:$AX$41,4,FALSE)","v":29},{"$f":"+VLOOKUP(+$A7,'Data Input'!$A$3:$AX$41,5,FALSE)","v":-7},{"$f":"+VLOOKUP(+$A7,'Data Input'!$A$3:$AX$41,6,FALSE)","v":0},{"$f":"+VLOOKUP(+$A7,'Data Input'!$A$3:$AX$41,7,FALSE)","v":"A"},{"$f":"+VLOOKUP($A7,'Data Input'!$A$3:$AX$41,33,FALSE)","v":4},{"$f":"+VLOOKUP($A7,'Data Input'!$A$3:$AX$41,34,FALSE)","v":36},{"$f":"+VLOOKUP($A7,'Data Input'!$A$3:$AX$41,35,FALSE)","v":56.31000000000131},null,{"$f":"+VLOOKUP($A7,'Data Input'!$A$3:$AX$41,37,FALSE)","v":7}]
[177,{"$f":"+VLOOKUP(+$A8,'Data Input'!$A$3:$AX$41,2,FALSE)","v":"Breeze"},{"$f":"+VLOOKUP(+$A8,'Data Input'!$A$3:$AX$41,3,FALSE)","v":"M Ellis"},{"$f":"+VLOOKUP(+$A8,'Data Input'!$A$3:$AX$41,4,FALSE)","v":32},{"$f":"+VLOOKUP(+$A8,'Data Input'!$A$3:$AX$41,5,FALSE)","v":3},{"$f":"+VLOOKUP(+$A8,'Data Input'!$A$3:$AX$41,6,FALSE)","v":"W"},{"$f":"+VLOOKUP(+$A8,'Data Input'!$A$3:$AX$41,7,FALSE)","v":"A"},{"$f":"+VLOOKUP($A8,'Data Input'!$A$3:$AX$41,33,FALSE)","v":9},{"$f":"+VLOOKUP($A8,'Data Input'!$A$3:$AX$41,34,FALSE)","v":32},{"$f":"+VLOOKUP($A8,'Data Input'!$A$3:$AX$41,35,FALSE)","v":18.139999999999418},null,{"$f":"+VLOOKUP($A8,'Data Input'!$A$3:$AX$41,37,FALSE)","v":"W"}]
[219,{"$f":"+VLOOKUP(+$A9,'Data Input'!$A$3:$AX$41,2,FALSE)","v":"Farthing"},{"$f":"+VLOOKUP(+$A9,'Data Input'!$A$3:$AX$41,3,FALSE)","v":"M Farrar"},{"$f":"+VLOOKUP(+$A9,'Data Input'!$A$3:$AX$41,4,FALSE)","v":36},{"$f":"+VLOOKUP(+$A9,'Data Input'!$A$3:$AX$41,5,FALSE)","v":3},{"$f":"+VLOOKUP(+$A9,'Data Input'!$A$3:$AX$41,6,FALSE)","v":"W"},{"$f":"+VLOOKUP(+$A9,'Data Input'!$A$3:$AX$41,7,FALSE)","v":"A"},{"$f":"+VLOOKUP($A9,'Data Input'!$A$3:$AX$41,33,FALSE)","v":9},{"$f":"+VLOOKUP($A9,'Data Input'!$A$3:$AX$41,34,FALSE)","v":59},{"$f":"+VLOOKUP($A9,'Data Input'!$A$3:$AX$41,35,FALSE)","v":43.05000000000291},null,{"$f":"+VLOOKUP($A9,'Data Input'!$A$3:$AX$41,37,FALSE)","v":"W"}]
[323,{"$f":"+VLOOKUP(+$A10,'Data Input'!$A$3:$AX$41,2,FALSE)","v":"Starlight Lady"},{"$f":"+VLOOKUP(+$A10,'Data Input'!$A$3:$AX$41,3,FALSE)","v":"N.Matthews"},{"$f":"+VLOOKUP(+$A10,'Data Input'!$A$3:$AX$41,4,FALSE)","v":30},{"$f":"+VLOOKUP(+$A10,'Data Input'!$A$3:$AX$41,5,FALSE)","v":13},{"$f":"+VLOOKUP(+$A10,'Data Input'!$A$3:$AX$41,6,FALSE)","v":0},{"$f":"+VLOOKUP(+$A10,'Data Input'!$A$3:$AX$41,7,FALSE)","v":"A"},{"$f":"+VLOOKUP($A10,'Data Input'!$A$3:$AX$41,33,FALSE)","v":4},{"$f":"+VLOOKUP($A10,'Data Input'!$A$3:$AX$41,34,FALSE)","v":36},{"$f":"+VLOOKUP($A10,'Data Input'!$A$3:$AX$41,35,FALSE)","v":52.130000000001019},null,{"$f":"+VLOOKUP($A10,'Data Input'!$A$3:$AX$41,37,FALSE)","v":6}]
[335,{"$f":"+VLOOKUP(+$A11,'Data Input'!$A$3:$AX$41,2,FALSE)","v":"Firebird"},{"$f":"+VLOOKUP(+$A11,'Data Input'!$A$3:$AX$41,3,FALSE)","v":"R Richardson"},{"$f":"+VLOOKUP(+$A11,'Data Input'!$A$3:$AX$41,4,FALSE)","v":30},{"$f":"+VLOOKUP(+$A11,'Data Input'!$A$3:$AX$41,5,FALSE)","v":1},{"$f":"+VLOOKUP(+$A11,'Data Input'!$A$3:$AX$41,6,FALSE)","v":"DNS"},{"$f":"+VLOOKUP(+$A11,'Data Input'!$A$3:$AX$41,7,FALSE)","v":"A"},{"$f":"+VLOOKUP($A11,'Data Input'!$A$3:$AX$41,33,FALSE)","v":0},{"$f":"+VLOOKUP($A11,'Data Input'!$A$3:$AX$41,34,FALSE)","v":0},{"$f":"+VLOOKUP($A11,'Data Input'!$A$3:$AX$41,35,FALSE)","v":0},null,{"$f":"+VLOOKUP($A11,'Data Input'!$A$3:$AX$41,37,FALSE)","v":"DNS"}]
[368,{"$f":"+VLOOKUP(+$A12,'Data Input'!$A$3:$AX$41,2,FALSE)","v":"Wandering Rose"},{"$f":"+VLOOKUP(+$A12,'Data Input'!$A$3:$AX$41,3,FALSE)","v":"  Radley"},{"$f":"+VLOOKUP(+$A12,'Data Input'!$A$3:$AX$41,4,FALSE)","v":31},{"$f":"+VLOOKUP(+$A12,'Data Input'!$A$3:$AX$41,5,FALSE)","v":-2},{"$f":"+VLOOKUP(+$A12,'Data Input'!$A$3:$AX$41,6,FALSE)","v":0},{"$f":"+VLOOKUP(+$A12,'Data Input'!$A$3:$AX$41,7,FALSE)","v":"A"},{"$f":"+VLOOKUP($A12,'Data Input'!$A$3:$AX$41,33,FALSE)","v":4},{"$f":"+VLOOKUP($A12,'Data Input'!$A$3:$AX$41,34,FALSE)","v":27},{"$f":"+VLOOKUP($A12,'Data Input'!$A$3:$AX$41,35,FALSE)","v":25.539999999999054},null,{"$f":"+VLOOKUP($A12,'Data Input'!$A$3:$AX$41,37,FALSE)","v":3}]
[369,{"$f":"+VLOOKUP(+$A13,'Data Input'!$A$3:$AX$41,2,FALSE)","v":"Moonshadow"},{"$f":"+VLOOKUP(+$A13,'Data Input'!$A$3:$AX$41,3,FALSE)","v":"N Hovey"},{"$f":"+VLOOKUP(+$A13,'Data Input'!$A$3:$AX$41,4,FALSE)","v":31.5},{"$f":"+VLOOKUP(+$A13,'Data Input'!$A$3:$AX$41,5,FALSE)","v":4},{"$f":"+VLOOKUP(+$A13,'Data Input'!$A$3:$AX$41,6,FALSE)","v":""},{"$f":"+VLOOKUP(+$A13,'Data Input'!$A$3:$AX$41,7,FALSE)","v":"A"},{"$f":"+VLOOKUP($A13,'Data Input'!$A$3:$AX$41,33,FALSE)","v":4},{"$f":"+VLOOKUP($A13,'Data Input'!$A$3:$AX$41,34,FALSE)","v":45},{"$f":"+VLOOKUP($A13,'Data Input'!$A$3:$AX$41,35,FALSE)","v":34},null,{"$f":"+VLOOKUP($A13,'Data Input'!$A$3:$AX$41,37,FALSE)","v":15}]
[370,{"$f":"+VLOOKUP(+$A14,'Data Input'!$A$3:$AX$41,2,FALSE)","v":"Glory"},{"$f":"+VLOOKUP(+$A14,'Data Input'!$A$3:$AX$41,3,FALSE)","v":"C Brown"},{"$f":"+VLOOKUP(+$A14,'Data Input'!$A$3:$AX$41,4,FALSE)","v":35},{"$f":"+VLOOKUP(+$A14,'Data Input'!$A$3:$AX$41,5,FALSE)","v":-6},{"$f":"+VLOOKUP(+$A14,'Data Input'!$A$3:$AX$41,6,FALSE)","v":""},{"$f":"+VLOOKUP(+$A14,'Data Input'!$A$3:$AX$41,7,FALSE)","v":"A"},{"$f":"+VLOOKUP($A14,'Data Input'!$A$3:$AX$41,33,FALSE)","v":4},{"$f":"+VLOOKUP($A14,'Data Input'!$A$3:$AX$41,34,FALSE)","v":21},{"$f":"+VLOOKUP($A14,'Data Input'!$A$3:$AX$41,35,FALSE)","v":5.1000000000003638},null,{"$f":"+VLOOKUP($A14,'Data Input'!$A$3:$AX$41,37,FALSE)","v":1}]
[373,{"$f":"+VLOOKUP(+$A15,'Data Input'!$A$3:$AX$41,2,FALSE)","v":"Meggie"},{"$f":"+VLOOKUP(+$A15,'Data Input'!$A$3:$AX$41,3,FALSE)","v":"J Tansley"},{"$f":"+VLOOKUP(+$A15,'Data Input'!$A$3:$AX$41,4,FALSE)","v":34.9},{"$f":"+VLOOKUP(+$A15,'Data Input'!$A$3:$AX$41,5,FALSE)","v":13},{"$f":"+VLOOKUP(+$A15,'Data Input'!$A$3:$AX$41,6,FALSE)","v":""},{"$f":"+VLOOKUP(+$A15,'Data Input'!$A$3:$AX$41,7,FALSE)","v":"A"},{"$f":"+VLOOKUP($A15,'Data Input'!$A$3:$AX$41,33,FALSE)","v":5},{"$f":"+VLOOKUP($A15,'Data Input'!$A$3:$AX$41,34,FALSE)","v":4},{"$f":"+VLOOKUP($A15,'Data Input'!$A$3:$AX$41,35,FALSE)","v":21.930000000000291},null,{"$f":"+VLOOKUP($A15,'Data Input'!$A$3:$AX$41,37,FALSE)","v":20}]
[417,{"$f":"+VLOOKUP(+$A16,'Data Input'!$A$3:$AX$41,2,FALSE)","v":"Stellar"},{"$f":"+VLOOKUP(+$A16,'Data Input'!$A$3:$AX$41,3,FALSE)","v":"T Frary"},{"$f":"+VLOOKUP(+$A16,'Data Input'!$A$3:$AX$41,4,FALSE)","v":31.3},{"$f":"+VLOOKUP(+$A16,'Data Input'!$A$3:$AX$41,5,FALSE)","v":17},{"$f":"+VLOOKUP(+$A16,'Data Input'!$A$3:$AX$41,6,FALSE)","v":0},{"$f":"+VLOOKUP(+$A16,'Data Input'!$A$3:$AX$41,7,FALSE)","v":"A"},{"$f":"+VLOOKUP($A16,'Data Input'!$A$3:$AX$41,33,FALSE)","v":4},{"$f":"+VLOOKUP($A16,'Data Input'!$A$3:$AX$41,34,FALSE)","v":51},{"$f":"+VLOOKUP($A16,'Data Input'!$A$3:$AX$41,35,FALSE)","v":38.520000000000437},null,{"$f":"+VLOOKUP($A16,'Data Input'!$A$3:$AX$41,37,FALSE)","v":16}]
[25,{"$f":"+VLOOKUP(+$A17,'Data Input'!$A$3:$AX$41,2,FALSE)","v":"Melody"},{"$f":"+VLOOKUP(+$A17,'Data Input'!$A$3:$AX$41,3,FALSE)","v":"M Wells"},{"$f":"+VLOOKUP(+$A17,'Data Input'!$A$3:$AX$41,4,FALSE)","v":26},{"$f":"+VLOOKUP(+$A17,'Data Input'!$A$3:$AX$41,5,FALSE)","v":-10},{"$f":"+VLOOKUP(+$A17,'Data Input'!$A$3:$AX$41,6,FALSE)","v":0},{"$f":"+VLOOKUP(+$A17,'Data Input'!$A$3:$AX$41,7,FALSE)","v":"B"},{"$f":"+VLOOKUP($A17,'Data Input'!$A$3:$AX$41,33,FALSE)","v":4},{"$f":"+VLOOKUP($A17,'Data Input'!$A$3:$AX$41,34,FALSE)","v":56},{"$f":"+VLOOKUP($A17,'Data Input'!$A$3:$AX$41,35,FALSE)","v":57.299999999999272},null,{"$f":"+VLOOKUP($A17,'Data Input'!$A$3:$AX$41,37,FALSE)","v":18}]
[179,{"$f":"+VLOOKUP(+$A18,'Data Input'!$A$3:$AX$41,2,FALSE)","v":"Waxwing"},{"$f":"+VLOOKUP(+$A18,'Data Input'!$A$3:$AX$41,3,FALSE)","v":"S Clayton"},{"$f":"+VLOOKUP(+$A18,'Data Input'!$A$3:$AX$41,4,FALSE)","v":28},{"$f":"+VLOOKUP(+$A18,'Data Input'!$A$3:$AX$41,5,FALSE)","v":-8},{"$f":"+VLOOKUP(+$A18,'Data Input'!$A$3:$AX$41,6,FALSE)","v":0},{"$f":"+VLOOKUP(+$A18,'Data Input'!$A$3:$AX$41,7,FALSE)","v":"B"},{"$f":"+VLOOKUP($A18,'Data Input'!$A$3:$AX$41,33,FALSE)","v":4},{"$f":"+VLOOKUP($A18,'Data Input'!$A$3:$AX$41,34,FALSE)","v":34},{"$f":"+VLOOKUP($A18,'Data Input'!$A$3:$AX$41,35,FALSE)","v":17.880000000001019},null,{"$f":"+VLOOKUP($A18,'Data Input'!$A$3:$AX$41,37,FALSE)","v":5}]
[199,{"$f":"+VLOOKUP(+$A19,'Data Input'!$A$3:$AX$41,2,FALSE)","v":"Morning Calm"},{"$f":"+VLOOKUP(+$A19,'Data Input'!$A$3:$AX$41,3,FALSE)","v":"W Clark"},{"$f":"+VLOOKUP(+$A19,'Data Input'!$A$3:$AX$41,4,FALSE)","v":26},{"$f":"+VLOOKUP(+$A19,'Data Input'!$A$3:$AX$41,5,FALSE)","v":-9},{"$f":"+VLOOKUP(+$A19,'Data Input'!$A$3:$AX$41,6,FALSE)","v":0},{"$f":"+VLOOKUP(+$A19,'Data Input'!$A$3:$AX$41,7,FALSE)","v":"B"},{"$f":"+VLOOKUP($A19,'Data Input'!$A$3:$AX$41,33,FALSE)","v":4},{"$f":"+VLOOKUP($A19,'Data Input'!$A$3:$AX$41,34,FALSE)","v":39},{"$f":"+VLOOKUP($A19,'Data Input'!$A$3:$AX$41,35,FALSE)","v":26.75},null,{"$f":"+VLOOKUP($A19,'Data Input'!$A$3:$AX$41,37,FALSE)","v":9}]
[217,{"$f":"+VLOOKUP(+$A20,'Data Input'!$A$3:$AX$41,2,FALSE)","v":"Melinda"},{"$f":"+VLOOKUP(+$A20,'Data Input'!$A$3:$AX$41,3,FALSE)","v":"P Howes"},{"$f":"+VLOOKUP(+$A20,'Data Input'!$A$3:$AX$41,4,FALSE)","v":27.9},{"$f":"+VLOOKUP(+$A20,'Data Input'!$A$3:$AX$41,5,FALSE)","v":1},{"$f":"+VLOOKUP(+$A20,'Data Input'!$A$3:$AX$41,6,FALSE)","v":0},{"$f":"+VLOOKUP(+$A20,'Data Input'!$A$3:$AX$41,7,FALSE)","v":"B"},{"$f":"+VLOOKUP($A20,'Data Input'!$A$3:$AX$41,33,FALSE)","v":5},{"$f":"+VLOOKUP($A20,'Data Input'!$A$3:$AX$41,34,FALSE)","v":1},{"$f":"+VLOOKUP($A20,'Data Input'!$A$3:$AX$41,35,FALSE)","v":38.18999999999869},null,{"$f":"+VLOOKUP($A20,'Data Input'!$A$3:$AX$41,37,FALSE)","v":19}]
[218,{"$f":"+VLOOKUP(+$A21,'Data Input'!$A$3:$AX$41,2,FALSE)","v":"Mystery"},{"$f":"+VLOOKUP(+$A21,'Data Input'!$A$3:$AX$41,3,FALSE)","v":"M Ford"},{"$f":"+VLOOKUP(+$A21,'Data Input'!$A$3:$AX$41,4,FALSE)","v":26},{"$f":"+VLOOKUP(+$A21,'Data Input'!$A$3:$AX$41,5,FALSE)","v":-9},{"$f":"+VLOOKUP(+$A21,'Data Input'!$A$3:$AX$41,6,FALSE)","v":0},{"$f":"+VLOOKUP(+$A21,'Data Input'!$A$3:$AX$41,7,FALSE)","v":"B"},{"$f":"+VLOOKUP($A21,'Data Input'!$A$3:$AX$41,33,FALSE)","v":4},{"$f":"+VLOOKUP($A21,'Data Input'!$A$3:$AX$41,34,FALSE)","v":41},{"$f":"+VLOOKUP($A21,'Data Input'!$A$3:$AX$41,35,FALSE)","v":5.9400000000023283},null,{"$f":"+VLOOKUP($A21,'Data Input'!$A$3:$AX$41,37,FALSE)","v":12}]
[224,{"$f":"+VLOOKUP(+$A22,'Data Input'!$A$3:$AX$41,2,FALSE)","v":"Anna"},{"$f":"+VLOOKUP(+$A22,'Data Input'!$A$3:$AX$41,3,FALSE)","v":"R Branscombe"},{"$f":"+VLOOKUP(+$A22,'Data Input'!$A$3:$AX$41,4,FALSE)","v":25},{"$f":"+VLOOKUP(+$A22,'Data Input'!$A$3:$AX$41,5,FALSE)","v":-10},{"$f":"+VLOOKUP(+$A22,'Data Input'!$A$3:$AX$41,6,FALSE)","v":0},{"$f":"+VLOOKUP(+$A22,'Data Input'!$A$3:$AX$41,7,FALSE)","v":"B"},{"$f":"+VLOOKUP($A22,'Data Input'!$A$3:$AX$41,33,FALSE)","v":4},{"$f":"+VLOOKUP($A22,'Data Input'!$A$3:$AX$41,34,FALSE)","v":40},{"$f":"+VLOOKUP($A22,'Data Input'!$A$3:$AX$41,35,FALSE)","v":4.7999999999992724},null,{"$f":"+VLOOKUP($A22,'Data Input'!$A$3:$AX$41,37,FALSE)","v":10}]
[240,{"$f":"+VLOOKUP(+$A23,'Data Input'!$A$3:$AX$41,2,FALSE)","v":"Avocet"},{"$f":"+VLOOKUP(+$A23,'Data Input'!$A$3:$AX$41,3,FALSE)","v":"R  Branford"},{"$f":"+VLOOKUP(+$A23,'Data Input'!$A$3:$AX$41,4,FALSE)","v":28},{"$f":"+VLOOKUP(+$A23,'Data Input'!$A$3:$AX$41,5,FALSE)","v":-16},{"$f":"+VLOOKUP(+$A23,'Data Input'!$A$3:$AX$41,6,FALSE)","v":"W"},{"$f":"+VLOOKUP(+$A23,'Data Input'!$A$3:$AX$41,7,FALSE)","v":"B"},{"$f":"+VLOOKUP($A23,'Data Input'!$A$3:$AX$41,33,FALSE)","v":8},{"$f":"+VLOOKUP($A23,'Data Input'!$A$3:$AX$41,34,FALSE)","v":2},{"$f":"+VLOOKUP($A23,'Data Input'!$A$3:$AX$41,35,FALSE)","v":4.5599999999976717},null,{"$f":"+VLOOKUP($A23,'Data Input'!$A$3:$AX$41,37,FALSE)","v":"W"}]
[244,{"$f":"+VLOOKUP(+$A24,'Data Input'!$A$3:$AX$41,2,FALSE)","v":"Catspaw"},{"$f":"+VLOOKUP(+$A24,'Data Input'!$A$3:$AX$41,3,FALSE)","v":"B Wilkins"},{"$f":"+VLOOKUP(+$A24,'Data Input'!$A$3:$AX$41,4,FALSE)","v":28},{"$f":"+VLOOKUP(+$A24,'Data Input'!$A$3:$AX$41,5,FALSE)","v":-4},{"$f":"+VLOOKUP(+$A24,'Data Input'!$A$3:$AX$41,6,FALSE)","v":0},{"$f":"+VLOOKUP(+$A24,'Data Input'!$A$3:$AX$41,7,FALSE)","v":"B"},{"$f":"+VLOOKUP($A24,'Data Input'!$A$3:$AX$41,33,FALSE)","v":4},{"$f":"+VLOOKUP($A24,'Data Input'!$A$3:$AX$41,34,FALSE)","v":40},{"$f":"+VLOOKUP($A24,'Data Input'!$A$3:$AX$41,35,FALSE)","v":24},null,{"$f":"+VLOOKUP($A24,'Data Input'!$A$3:$AX$41,37,FALSE)","v":11}]
[262,{"$f":"+VLOOKUP(+$A25,'Data Input'!$A$3:$AX$41,2,FALSE)","v":"Jessie May"},{"$f":"+VLOOKUP(+$A25,'Data Input'!$A$3:$AX$41,3,FALSE)","v":"S Dugdale"},{"$f":"+VLOOKUP(+$A25,'Data Input'!$A$3:$AX$41,4,FALSE)","v":28},{"$f":"+VLOOKUP(+$A25,'Data Input'!$A$3:$AX$41,5,FALSE)","v":-5},{"$f":"+VLOOKUP(+$A25,'Data Input'!$A$3:$AX$41,6,FALSE)","v":0},{"$f":"+VLOOKUP(+$A25,'Data Input'!$A$3:$AX$41,7,FALSE)","v":"B"},{"$f":"+VLOOKUP($A25,'Data Input'!$A$3:$AX$41,33,FALSE)","v":4},{"$f":"+VLOOKUP($A25,'Data Input'!$A$3:$AX$41,34,FALSE)","v":25},{"$f":"+VLOOKUP($A25,'Data Input'!$A$3:$AX$41,35,FALSE)","v":44.800000000001091},null,{"$f":"+VLOOKUP($A25,'Data Input'!$A$3:$AX$41,37,FALSE)","v":2}]
[400,{"$f":"+VLOOKUP(+$A26,'Data Input'!$A$3:$AX$41,2,FALSE)","v":"Swallow"},{"$f":"+VLOOKUP(+$A26,'Data Input'!$A$3:$AX$41,3,FALSE)","v":"K Halifax"},{"$f":"+VLOOKUP(+$A26,'Data Input'!$A$3:$AX$41,4,FALSE)","v":26.5},{"$f":"+VLOOKUP(+$A26,'Data Input'!$A$3:$AX$41,5,FALSE)","v":-7},{"$f":"+VLOOKUP(+$A26,'Data Input'!$A$3:$AX$41,6,FALSE)","v":""},{"$f":"+VLOOKUP(+$A26,'Data Input'!$A$3:$AX$41,7,FALSE)","v":"B"},{"$f":"+VLOOKUP($A26,'Data Input'!$A$3:$AX$41,33,FALSE)","v":4},{"$f":"+VLOOKUP($A26,'Data Input'!$A$3:$AX$41,34,FALSE)","v":42},{"$f":"+VLOOKUP($A26,'Data Input'!$A$3:$AX$41,35,FALSE)","v":31.110000000000582},null,{"$f":"+VLOOKUP($A26,'Data Input'!$A$3:$AX$41,37,FALSE)","v":13}]
[416,{"$f":"+VLOOKUP(+$A27,'Data Input'!$A$3:$AX$41,2,FALSE)","v":"Alice Rose"},{"$f":"+VLOOKUP(+$A27,'Data Input'!$A$3:$AX$41,3,FALSE)","v":"D Radley"},{"$f":"+VLOOKUP(+$A27,'Data Input'!$A$3:$AX$41,4,FALSE)","v":28.5},{"$f":"+VLOOKUP(+$A27,'Data Input'!$A$3:$AX$41,5,FALSE)","v":-7},{"$f":"+VLOOKUP(+$A27,'Data Input'!$A$3:$AX$41,6,FALSE)","v":"W"},{"$f":"+VLOOKUP(+$A27,'Data Input'!$A$3:$AX$41,7,FALSE)","v":"A"},{"$f":"+VLOOKUP($A27,'Data Input'!$A$3:$AX$41,33,FALSE)","v":8},{"$f":"+VLOOKUP($A27,'Data Input'!$A$3:$AX$41,34,FALSE)","v":35},{"$f":"+VLOOKUP($A27,'Data Input'!$A$3:$AX$41,35,FALSE)","v":5.7600000000020373},null,{"$f":"+VLOOKUP($A27,'Data Input'!$A$3:$AX$41,37,FALSE)","v":"W"}]
[418,{"$f":"+VLOOKUP(+$A28,'Data Input'!$A$3:$AX$41,2,FALSE)","v":"Tinkerbell"},{"$f":"+VLOOKUP(+$A28,'Data Input'!$A$3:$AX$41,3,FALSE)","v":"A Lincoln"},{"$f":"+VLOOKUP(+$A28,'Data Input'!$A$3:$AX$41,4,FALSE)","v":25.2},{"$f":"+VLOOKUP(+$A28,'Data Input'!$A$3:$AX$41,5,FALSE)","v":-7},{"$f":"+VLOOKUP(+$A28,'Data Input'!$A$3:$AX$41,6,FALSE)","v":""},{"$f":"+VLOOKUP(+$A28,'Data Input'!$A$3:$AX$41,7,FALSE)","v":"B"},{"$f":"+VLOOKUP($A28,'Data Input'!$A$3:$AX$41,33,FALSE)","v":4},{"$f":"+VLOOKUP($A28,'Data Input'!$A$3:$AX$41,34,FALSE)","v":38},{"$f":"+VLOOKUP($A28,'Data Input'!$A$3:$AX$41,35,FALSE)","v":6.9900000000016007},null,{"$f":"+VLOOKUP($A28,'Data Input'!$A$3:$AX$41,37,FALSE)","v":8}]
[79,{"$f":"+VLOOKUP(+$A29,'Data Input'!$A$3:$AX$41,2,FALSE)","v":"Daisy"},{"$f":"+VLOOKUP(+$A29,'Data Input'!$A$3:$AX$41,3,FALSE)","v":"T Ford"},{"$f":"+VLOOKUP(+$A29,'Data Input'!$A$3:$AX$41,4,FALSE)","v":22},{"$f":"+VLOOKUP(+$A29,'Data Input'!$A$3:$AX$41,5,FALSE)","v":-21},{"$f":"+VLOOKUP(+$A29,'Data Input'!$A$3:$AX$41,6,FALSE)","v":0},{"$f":"+VLOOKUP(+$A29,'Data Input'!$A$3:$AX$41,7,FALSE)","v":"C"},{"$f":"+VLOOKUP($A29,'Data Input'!$A$3:$AX$41,33,FALSE)","v":5},{"$f":"+VLOOKUP($A29,'Data Input'!$A$3:$AX$41,34,FALSE)","v":31},{"$f":"+VLOOKUP($A29,'Data Input'!$A$3:$AX$41,35,FALSE)","v":29.040000000000873},null,{"$f":"+VLOOKUP($A29,'Data Input'!$A$3:$AX$41,37,FALSE)","v":21}]
[87,{"$f":"+VLOOKUP(+$A30,'Data Input'!$A$3:$AX$41,2,FALSE)","v":"Modwena"},{"$f":"+VLOOKUP(+$A30,'Data Input'!$A$3:$AX$41,3,FALSE)","v":"M Cassidy"},{"$f":"+VLOOKUP(+$A30,'Data Input'!$A$3:$AX$41,4,FALSE)","v":24.8},{"$f":"+VLOOKUP(+$A30,'Data Input'!$A$3:$AX$41,5,FALSE)","v":-19},{"$f":"+VLOOKUP(+$A30,'Data Input'!$A$3:$AX$41,6,FALSE)","v":0},{"$f":"+VLOOKUP(+$A30,'Data Input'!$A$3:$AX$41,7,FALSE)","v":"C"},{"$f":"+VLOOKUP($A30,'Data Input'!$A$3:$AX$41,33,FALSE)","v":4},{"$f":"+VLOOKUP($A30,'Data Input'!$A$3:$AX$41,34,FALSE)","v":32},{"$f":"+VLOOKUP($A30,'Data Input'!$A$3:$AX$41,35,FALSE)","v":59.820000000001528},null,{"$f":"+VLOOKUP($A30,'Data Input'!$A$3:$AX$41,37,FALSE)","v":4}]
[155,{"$f":"+VLOOKUP(+$A31,'Data Input'!$A$3:$AX$41,2,FALSE)","v":"Stratus"},{"$f":"+VLOOKUP(+$A31,'Data Input'!$A$3:$AX$41,3,FALSE)","v":"J Townley"},{"$f":"+VLOOKUP(+$A31,'Data Input'!$A$3:$AX$41,4,FALSE)","v":22.6},{"$f":"+VLOOKUP(+$A31,'Data Input'!$A$3:$AX$41,5,FALSE)","v":-17},{"$f":"+VLOOKUP(+$A31,'Data Input'!$A$3:$AX$41,6,FALSE)","v":"W"},{"$f":"+VLOOKUP(+$A31,'Data Input'!$A$3:$AX$41,7,FALSE)","v":"C"},{"$f":"+VLOOKUP($A31,'Data Input'!$A$3:$AX$41,33,FALSE)","v":7},{"$f":"+VLOOKUP($A31,'Data Input'!$A$3:$AX$41,34,FALSE)","v":32},{"$f":"+VLOOKUP($A31,'Data Input'!$A$3:$AX$41,35,FALSE)","v":52.540000000000873},null,{"$f":"+VLOOKUP($A31,'Data Input'!$A$3:$AX$41,37,FALSE)","v":"W"}]
[274,{"$f":"+VLOOKUP(+$A32,'Data Input'!$A$3:$AX$41,2,FALSE)","v":"Elfin"},{"$f":"+VLOOKUP(+$A32,'Data Input'!$A$3:$AX$41,3,FALSE)","v":"A Bond"},{"$f":"+VLOOKUP(+$A32,'Data Input'!$A$3:$AX$41,4,FALSE)","v":21},{"$f":"+VLOOKUP(+$A32,'Data Input'!$A$3:$AX$41,5,FALSE)","v":-27},{"$f":"+VLOOKUP(+$A32,'Data Input'!$A$3:$AX$41,6,FALSE)","v":"DNS"},{"$f":"+VLOOKUP(+$A32,'Data Input'!$A$3:$AX$41,7,FALSE)","v":"C"},{"$f":"+VLOOKUP($A32,'Data Input'!$A$3:$AX$41,33,FALSE)","v":0},{"$f":"+VLOOKUP($A32,'Data Input'!$A$3:$AX$41,34,FALSE)","v":0},{"$f":"+VLOOKUP($A32,'Data Input'!$A$3:$AX$41,35,FALSE)","v":0},null,{"$f":"+VLOOKUP($A32,'Data Input'!$A$3:$AX$41,37,FALSE)","v":"DNS"}]
[429,{"$f":"+VLOOKUP(+$A33,'Data Input'!$A$3:$AX$41,2,FALSE)","v":"Pickle"},{"$f":"+VLOOKUP(+$A33,'Data Input'!$A$3:$AX$41,3,FALSE)","v":"P Montague"},{"$f":"+VLOOKUP(+$A33,'Data Input'!$A$3:$AX$41,4,FALSE)","v":22.6},{"$f":"+VLOOKUP(+$A33,'Data Input'!$A$3:$AX$41,5,FALSE)","v":-17},{"$f":"+VLOOKUP(+$A33,'Data Input'!$A$3:$AX$41,6,FALSE)","v":0},{"$f":"+VLOOKUP(+$A33,'Data Input'!$A$3:$AX$41,7,FALSE)","v":"C"},{"$f":"+VLOOKUP($A33,'Data Input'!$A$3:$AX$41,33,FALSE)","v":4},{"$f":"+VLOOKUP($A33,'Data Input'!$A$3:$AX$41,34,FALSE)","v":52},{"$f":"+VLOOKUP($A33,'Data Input'!$A$3:$AX$41,35,FALSE)","v":4.6200000000026193},null,{"$f":"+VLOOKUP($A33,'Data Input'!$A$3:$AX$41,37,FALSE)","v":17}]
[109,{"$f":"+VLOOKUP(+$A34,'Data Input'!$A$3:$AX$41,2,FALSE)","v":"Kingfisher"},{"$f":"+VLOOKUP(+$A34,'Data Input'!$A$3:$AX$41,3,FALSE)","v":"J Flatman"},{"$f":"+VLOOKUP(+$A34,'Data Input'!$A$3:$AX$41,4,FALSE)","v":24.5},{"$f":"+VLOOKUP(+$A34,'Data Input'!$A$3:$AX$41,5,FALSE)","v":-19},{"$f":"+VLOOKUP(+$A34,'Data Input'!$A$3:$AX$41,6,FALSE)","v":"W"},{"$f":"+VLOOKUP(+$A34,'Data Input'!$A$3:$AX$41,7,FALSE)","v":"C"},{"$f":"+VLOOKUP($A34,'Data Input'!$A$3:$AX$41,33,FALSE)","v":7},{"$f":"+VLOOKUP($A34,'Data Input'!$A$3:$AX$41,34,FALSE)","v":25},{"$f":"+VLOOKUP($A34,'Data Input'!$A$3:$AX$41,35,FALSE)","v":30},null,{"$f":"+VLOOKUP($A34,'Data Input'!$A$3:$AX$41,37,FALSE)","v":"W"}]
[141,{"$f":"+VLOOKUP(+$A35,'Data Input'!$A$3:$AX$41,2,FALSE)","v":"Nirvana"},{"$f":"+VLOOKUP(+$A35,'Data Input'!$A$3:$AX$41,3,FALSE)","v":" M Claridge"},{"$f":"+VLOOKUP(+$A35,'Data Input'!$A$3:$AX$41,4,FALSE)","v":20},{"$f":"+VLOOKUP(+$A35,'Data Input'!$A$3:$AX$41,5,FALSE)","v":-23},{"$f":"+VLOOKUP(+$A35,'Data Input'!$A$3:$AX$41,6,FALSE)","v":"P"},{"$f":"+VLOOKUP(+$A35,'Data Input'!$A$3:$AX$41,7,FALSE)","v":"C"},{"$f":"+VLOOKUP($A35,'Data Input'!$A$3:$AX$41,33,FALSE)","v":4},{"$f":"+VLOOKUP($A35,'Data Input'!$A$3:$AX$41,34,FALSE)","v":47},{"$f":"+VLOOKUP($A35,'Data Input'!$A$3:$AX$41,35,FALSE)","v":8.75},null,{"$f":"+VLOOKUP($A35,'Data Input'!$A$3:$AX$41,37,FALSE)","v":"P"}]
[]
[]
[]
[]
[]
[]
[{"$f":"+COUNT(A3:A41)","v":33}]

{"sheet":"Classes A","index":4,"n_rows":25,"n_cols":13,"rows_kept":25,"cut":false,"hidden":false,"merged":[]}
["Starlight Lady",null,null,null,null,null,null,null,"Corrected"]
["No","Yacht","Skipper","Length","H/C","P","Class","H","M","S",null,"Pos"," "]
[370,{"$f":"+VLOOKUP(+$A3,'Data Input'!$A$3:$AX$41,2,FALSE)","v":"Glory"},{"$f":"+VLOOKUP(+$A3,'Data Input'!$A$3:$AX$41,3,FALSE)","v":"C Brown"},{"$f":"+VLOOKUP(+$A3,'Data Input'!$A$3:$AX$41,4,FALSE)","v":35},{"$f":"+VLOOKUP(+$A3,'Data Input'!$A$3:$AX$41,5,FALSE)","v":-6},{"$f":"+VLOOKUP(+$A3,'Data Input'!$A$3:$AX$41,6,FALSE)","v":""},{"$f":"+VLOOKUP(+$A3,'Data Input'!$A$3:$AX$41,7,FALSE)","v":"A"},{"$f":"+VLOOKUP($A3,'Data Input'!$A$3:$AX$41,33,FALSE)","v":4},{"$f":"+VLOOKUP($A3,'Data Input'!$A$3:$AX$41,34,FALSE)","v":21},{"$f":"+VLOOKUP($A3,'Data Input'!$A$3:$AX$41,35,FALSE)","v":5.1000000000003638},null,{"$f":"+VLOOKUP($A3,'Data Input'!$A$3:$AX$41,37,FALSE)","v":1}]
[368,{"$f":"+VLOOKUP(+$A4,'Data Input'!$A$3:$AX$41,2,FALSE)","v":"Wandering Rose"},{"$f":"+VLOOKUP(+$A4,'Data Input'!$A$3:$AX$41,3,FALSE)","v":"  Radley"},{"$f":"+VLOOKUP(+$A4,'Data Input'!$A$3:$AX$41,4,FALSE)","v":31},{"$f":"+VLOOKUP(+$A4,'Data Input'!$A$3:$AX$41,5,FALSE)","v":-2},{"$f":"+VLOOKUP(+$A4,'Data Input'!$A$3:$AX$41,6,FALSE)","v":0},{"$f":"+VLOOKUP(+$A4,'Data Input'!$A$3:$AX$41,7,FALSE)","v":"A"},{"$f":"+VLOOKUP($A4,'Data Input'!$A$3:$AX$41,33,FALSE)","v":4},{"$f":"+VLOOKUP($A4,'Data Input'!$A$3:$AX$41,34,FALSE)","v":27},{"$f":"+VLOOKUP($A4,'Data Input'!$A$3:$AX$41,35,FALSE)","v":25.539999999999054},null,{"$f":"L3+1","v":2}]
[323,{"$f":"+VLOOKUP(+$A5,'Data Input'!$A$3:$AX$41,2,FALSE)","v":"Starlight Lady"},{"$f":"+VLOOKUP(+$A5,'Data Input'!$A$3:$AX$41,3,FALSE)","v":"N.Matthews"},{"$f":"+VLOOKUP(+$A5,'Data Input'!$A$3:$AX$41,4,FALSE)","v":30},{"$f":"+VLOOKUP(+$A5,'Data Input'!$A$3:$AX$41,5,FALSE)","v":13},{"$f":"+VLOOKUP(+$A5,'Data Input'!$A$3:$AX$41,6,FALSE)","v":0},{"$f":"+VLOOKUP(+$A5,'Data Input'!$A$3:$AX$41,7,FALSE)","v":"A"},{"$f":"+VLOOKUP($A5,'Data Input'!$A$3:$AX$41,33,FALSE)","v":4},{"$f":"+VLOOKUP($A5,'Data Input'!$A$3:$AX$41,34,FALSE)","v":36},{"$f":"+VLOOKUP($A5,'Data Input'!$A$3:$AX$41,35,FALSE)","v":52.130000000001019},null,{"$f":"L4+1","v":3}]
[152,{"$f":"+VLOOKUP(+$A6,'Data Input'!$A$3:$AX$41,2,FALSE)","v":"Sabrina 2"},{"$f":"+VLOOKUP(+$A6,'Data Input'!$A$3:$AX$41,3,FALSE)","v":"J Holmes"},{"$f":"+VLOOKUP(+$A6,'Data Input'!$A$3:$AX$41,4,FALSE)","v":29},{"$f":"+VLOOKUP(+$A6,'Data Input'!$A$3:$AX$41,5,FALSE)","v":-7},{"$f":"+VLOOKUP(+$A6,'Data Input'!$A$3:$AX$41,6,FALSE)","v":0},{"$f":"+VLOOKUP(+$A6,'Data Input'!$A$3:$AX$41,7,FALSE)","v":"A"},{"$f":"+VLOOKUP($A6,'Data Input'!$A$3:$AX$41,33,FALSE)","v":4},{"$f":"+VLOOKUP($A6,'Data Input'!$A$3:$AX$41,34,FALSE)","v":36},{"$f":"+VLOOKUP($A6,'Data Input'!$A$3:$AX$41,35,FALSE)","v":56.31000000000131},null,4]
[10,{"$f":"+VLOOKUP(+$A7,'Data Input'!$A$3:$AX$41,2,FALSE)","v":"Flight"},{"$f":"+VLOOKUP(+$A7,'Data Input'!$A$3:$AX$41,3,FALSE)","v":"J Farrow"},{"$f":"+VLOOKUP(+$A7,'Data Input'!$A$3:$AX$41,4,FALSE)","v":29.9},{"$f":"+VLOOKUP(+$A7,'Data Input'!$A$3:$AX$41,5,FALSE)","v":-8},{"$f":"+VLOOKUP(+$A7,'Data Input'!$A$3:$AX$41,6,FALSE)","v":0},{"$f":"+VLOOKUP(+$A7,'Data Input'!$A$3:$AX$41,7,FALSE)","v":"A"},{"$f":"+VLOOKUP($A7,'Data Input'!$A$3:$AX$41,33,FALSE)","v":4},{"$f":"+VLOOKUP($A7,'Data Input'!$A$3:$AX$41,34,FALSE)","v":45},{"$f":"+VLOOKUP($A7,'Data Input'!$A$3:$AX$41,35,FALSE)","v":28.56000000000131},null,5]
[369,{"$f":"+VLOOKUP(+$A8,'Data Input'!$A$3:$AX$41,2,FALSE)","v":"Moonshadow"},{"$f":"+VLOOKUP(+$A8,'Data Input'!$A$3:$AX$41,3,FALSE)","v":"N Hovey"},{"$f":"+VLOOKUP(+$A8,'Data Input'!$A$3:$AX$41,4,FALSE)","v":31.5},{"$f":"+VLOOKUP(+$A8,'Data Input'!$A$3:$AX$41,5,FALSE)","v":4},{"$f":"+VLOOKUP(+$A8,'Data Input'!$A$3:$AX$41,6,FALSE)","v":""},{"$f":"+VLOOKUP(+$A8,'Data Input'!$A$3:$AX$41,7,FALSE)","v":"A"},{"$f":"+VLOOKUP($A8,'Data Input'!$A$3:$AX$41,33,FALSE)","v":4},{"$f":"+VLOOKUP($A8,'Data Input'!$A$3:$AX$41,34,FALSE)","v":45},{"$f":"+VLOOKUP($A8,'Data Input'!$A$3:$AX$41,35,FALSE)","v":34},null,6]
[417,{"$f":"+VLOOKUP(+$A9,'Data Input'!$A$3:$AX$41,2,FALSE)","v":"Stellar"},{"$f":"+VLOOKUP(+$A9,'Data Input'!$A$3:$AX$41,3,FALSE)","v":"T Frary"},{"$f":"+VLOOKUP(+$A9,'Data Input'!$A$3:$AX$41,4,FALSE)","v":31.3},{"$f":"+VLOOKUP(+$A9,'Data Input'!$A$3:$AX$41,5,FALSE)","v":17},{"$f":"+VLOOKUP(+$A9,'Data Input'!$A$3:$AX$41,6,FALSE)","v":0},{"$f":"+VLOOKUP(+$A9,'Data Input'!$A$3:$AX$41,7,FALSE)","v":"A"},{"$f":"+VLOOKUP($A9,'Data Input'!$A$3:$AX$41,33,FALSE)","v":4},{"$f":"+VLOOKUP($A9,'Data Input'!$A$3:$AX$41,34,FALSE)","v":51},{"$f":"+VLOOKUP($A9,'Data Input'!$A$3:$AX$41,35,FALSE)","v":38.520000000000437},null,7]
[373,{"$f":"+VLOOKUP(+$A10,'Data Input'!$A$3:$AX$41,2,FALSE)","v":"Meggie"},{"$f":"+VLOOKUP(+$A10,'Data Input'!$A$3:$AX$41,3,FALSE)","v":"J Tansley"},{"$f":"+VLOOKUP(+$A10,'Data Input'!$A$3:$AX$41,4,FALSE)","v":34.9},{"$f":"+VLOOKUP(+$A10,'Data Input'!$A$3:$AX$41,5,FALSE)","v":13},{"$f":"+VLOOKUP(+$A10,'Data Input'!$A$3:$AX$41,6,FALSE)","v":""},{"$f":"+VLOOKUP(+$A10,'Data Input'!$A$3:$AX$41,7,FALSE)","v":"A"},{"$f":"+VLOOKUP($A10,'Data Input'!$A$3:$AX$41,33,FALSE)","v":5},{"$f":"+VLOOKUP($A10,'Data Input'!$A$3:$AX$41,34,FALSE)","v":4},{"$f":"+VLOOKUP($A10,'Data Input'!$A$3:$AX$41,35,FALSE)","v":21.930000000000291},null,8]
[22,{"$f":"+VLOOKUP(+$A11,'Data Input'!$A$3:$AX$41,2,FALSE)","v":"Moonraker"},{"$f":"+VLOOKUP(+$A11,'Data Input'!$A$3:$AX$41,3,FALSE)","v":"P Jeckells"},{"$f":"+VLOOKUP(+$A11,'Data Input'!$A$3:$AX$41,4,FALSE)","v":29.5},{"$f":"+VLOOKUP(+$A11,'Data Input'!$A$3:$AX$41,5,FALSE)","v":2},{"$f":"+VLOOKUP(+$A11,'Data Input'!$A$3:$AX$41,6,FALSE)","v":"DNS"},{"$f":"+VLOOKUP(+$A11,'Data Input'!$A$3:$AX$41,7,FALSE)","v":"A"},{"$f":"+VLOOKUP($A11,'Data Input'!$A$3:$AX$41,33,FALSE)","v":0},{"$f":"+VLOOKUP($A11,'Data Input'!$A$3:$AX$41,34,FALSE)","v":0},{"$f":"+VLOOKUP($A11,'Data Input'!$A$3:$AX$41,35,FALSE)","v":0},null,{"$f":"+VLOOKUP($A11,'Data Input'!$A$3:$AX$41,37,FALSE)","v":"DNS"}]
[52,{"$f":"+VLOOKUP(+$A12,'Data Input'!$A$3:$AX$41,2,FALSE)","v":"Maidie"},{"$f":"+VLOOKUP(+$A12,'Data Input'!$A$3:$AX$41,3,FALSE)","v":"M Barnes"},{"$f":"+VLOOKUP(+$A12,'Data Input'!$A$3:$AX$41,4,FALSE)","v":43.2},{"$f":"+VLOOKUP(+$A12,'Data Input'!$A$3:$AX$41,5,FALSE)","v":13},{"$f":"+VLOOKUP(+$A12,'Data Input'!$A$3:$AX$41,6,FALSE)","v":"DNS"},{"$f":"+VLOOKUP(+$A12,'Data Input'!$A$3:$AX$41,7,FALSE)","v":"A"},{"$f":"+VLOOKUP($A12,'Data Input'!$A$3:$AX$41,33,FALSE)","v":0},{"$f":"+VLOOKUP($A12,'Data Input'!$A$3:$AX$41,34,FALSE)","v":0},{"$f":"+VLOOKUP($A12,'Data Input'!$A$3:$AX$41,35,FALSE)","v":0},null,{"$f":"+VLOOKUP($A12,'Data Input'!$A$3:$AX$41,37,FALSE)","v":"DNS"}]
[335,{"$f":"+VLOOKUP(+$A13,'Data Input'!$A$3:$AX$41,2,FALSE)","v":"Firebird"},{"$f":"+VLOOKUP(+$A13,'Data Input'!$A$3:$AX$41,3,FALSE)","v":"R Richardson"},{"$f":"+VLOOKUP(+$A13,'Data Input'!$A$3:$AX$41,4,FALSE)","v":30},{"$f":"+VLOOKUP(+$A13,'Data Input'!$A$3:$AX$41,5,FALSE)","v":1},{"$f":"+VLOOKUP(+$A13,'Data Input'!$A$3:$AX$41,6,FALSE)","v":"DNS"},{"$f":"+VLOOKUP(+$A13,'Data Input'!$A$3:$AX$41,7,FALSE)","v":"A"},{"$f":"+VLOOKUP($A13,'Data Input'!$A$3:$AX$41,33,FALSE)","v":0},{"$f":"+VLOOKUP($A13,'Data Input'!$A$3:$AX$41,34,FALSE)","v":0},{"$f":"+VLOOKUP($A13,'Data Input'!$A$3:$AX$41,35,FALSE)","v":0},null,{"$f":"+VLOOKUP($A13,'Data Input'!$A$3:$AX$41,37,FALSE)","v":"DNS"}]
[6,{"$f":"+VLOOKUP(+$A14,'Data Input'!$A$3:$AX$41,2,FALSE)","v":"Dragonfly"},{"$f":"+VLOOKUP(+$A14,'Data Input'!$A$3:$AX$41,3,FALSE)","v":"S Simpson"},{"$f":"+VLOOKUP(+$A14,'Data Input'!$A$3:$AX$41,4,FALSE)","v":38},{"$f":"+VLOOKUP(+$A14,'Data Input'!$A$3:$AX$41,5,FALSE)","v":-13},{"$f":"+VLOOKUP(+$A14,'Data Input'!$A$3:$AX$41,6,FALSE)","v":"W"},{"$f":"+VLOOKUP(+$A14,'Data Input'!$A$3:$AX$41,7,FALSE)","v":"A"},{"$f":"+VLOOKUP($A14,'Data Input'!$A$3:$AX$41,33,FALSE)","v":8},{"$f":"+VLOOKUP($A14,'Data Input'!$A$3:$AX$41,34,FALSE)","v":54},{"$f":"+VLOOKUP($A14,'Data Input'!$A$3:$AX$41,35,FALSE)","v":40.380000000001019},null,{"$f":"+VLOOKUP($A14,'Data Input'!$A$3:$AX$41,37,FALSE)","v":"W"}]
[177,{"$f":"+VLOOKUP(+$A15,'Data Input'!$A$3:$AX$41,2,FALSE)","v":"Breeze"},{"$f":"+VLOOKUP(+$A15,'Data Input'!$A$3:$AX$41,3,FALSE)","v":"M Ellis"},{"$f":"+VLOOKUP(+$A15,'Data Input'!$A$3:$AX$41,4,FALSE)","v":32},{"$f":"+VLOOKUP(+$A15,'Data Input'!$A$3:$AX$41,5,FALSE)","v":3},{"$f":"+VLOOKUP(+$A15,'Data Input'!$A$3:$AX$41,6,FALSE)","v":"W"},{"$f":"+VLOOKUP(+$A15,'Data Input'!$A$3:$AX$41,7,FALSE)","v":"A"},{"$f":"+VLOOKUP($A15,'Data Input'!$A$3:$AX$41,33,FALSE)","v":9},{"$f":"+VLOOKUP($A15,'Data Input'!$A$3:$AX$41,34,FALSE)","v":32},{"$f":"+VLOOKUP($A15,'Data Input'!$A$3:$AX$41,35,FALSE)","v":18.139999999999418},null,{"$f":"+VLOOKUP($A15,'Data Input'!$A$3:$AX$41,37,FALSE)","v":"W"}]
[219,{"$f":"+VLOOKUP(+$A16,'Data Input'!$A$3:$AX$41,2,FALSE)","v":"Farthing"},{"$f":"+VLOOKUP(+$A16,'Data Input'!$A$3:$AX$41,3,FALSE)","v":"M Farrar"},{"$f":"+VLOOKUP(+$A16,'Data Input'!$A$3:$AX$41,4,FALSE)","v":36},{"$f":"+VLOOKUP(+$A16,'Data Input'!$A$3:$AX$41,5,FALSE)","v":3},{"$f":"+VLOOKUP(+$A16,'Data Input'!$A$3:$AX$41,6,FALSE)","v":"W"},{"$f":"+VLOOKUP(+$A16,'Data Input'!$A$3:$AX$41,7,FALSE)","v":"A"},{"$f":"+VLOOKUP($A16,'Data Input'!$A$3:$AX$41,33,FALSE)","v":9},{"$f":"+VLOOKUP($A16,'Data Input'!$A$3:$AX$41,34,FALSE)","v":59},{"$f":"+VLOOKUP($A16,'Data Input'!$A$3:$AX$41,35,FALSE)","v":43.05000000000291},null,{"$f":"+VLOOKUP($A16,'Data Input'!$A$3:$AX$41,37,FALSE)","v":"W"}]
[416,{"$f":"+VLOOKUP(+$A17,'Data Input'!$A$3:$AX$41,2,FALSE)","v":"Alice Rose"},{"$f":"+VLOOKUP(+$A17,'Data Input'!$A$3:$AX$41,3,FALSE)","v":"D Radley"},{"$f":"+VLOOKUP(+$A17,'Data Input'!$A$3:$AX$41,4,FALSE)","v":28.5},{"$f":"+VLOOKUP(+$A17,'Data Input'!$A$3:$AX$41,5,FALSE)","v":-7},{"$f":"+VLOOKUP(+$A17,'Data Input'!$A$3:$AX$41,6,FALSE)","v":"W"},{"$f":"+VLOOKUP(+$A17,'Data Input'!$A$3:$AX$41,7,FALSE)","v":"A"},{"$f":"+VLOOKUP($A17,'Data Input'!$A$3:$AX$41,33,FALSE)","v":8},{"$f":"+VLOOKUP($A17,'Data Input'!$A$3:$AX$41,34,FALSE)","v":35},{"$f":"+VLOOKUP($A17,'Data Input'!$A$3:$AX$41,35,FALSE)","v":5.7600000000020373},null,{"$f":"+VLOOKUP($A17,'Data Input'!$A$3:$AX$41,37,FALSE)","v":"W"}]
[]
[]
[]
[]
[]
[]
[]
[{"$f":"+COUNT(A3:A24)","v":15}]

{"sheet":"Classes B","index":5,"n_rows":23,"n_cols":13,"rows_kept":23,"cut":false,"hidden":false,"merged":[]}
["Jeckells",null,null,null,null,null,null,null,"Corrected"]
["No","Yacht","Skipper","Length","H/C","P","Class","H","M","S",null,"Pos"," "]
[262,{"$f":"+VLOOKUP(+$A3,'Data Input'!$A$3:$AX$41,2,FALSE)","v":"Jessie May"},{"$f":"+VLOOKUP(+$A3,'Data Input'!$A$3:$AX$41,3,FALSE)","v":"S Dugdale"},{"$f":"+VLOOKUP(+$A3,'Data Input'!$A$3:$AX$41,4,FALSE)","v":28},{"$f":"+VLOOKUP(+$A3,'Data Input'!$A$3:$AX$41,5,FALSE)","v":-5},{"$f":"+VLOOKUP(+$A3,'Data Input'!$A$3:$AX$41,6,FALSE)","v":0},{"$f":"+VLOOKUP(+$A3,'Data Input'!$A$3:$AX$41,7,FALSE)","v":"B"},{"$f":"+VLOOKUP($A3,'Data Input'!$A$3:$AX$41,33,FALSE)","v":4},{"$f":"+VLOOKUP($A3,'Data Input'!$A$3:$AX$41,34,FALSE)","v":25},{"$f":"+VLOOKUP($A3,'Data Input'!$A$3:$AX$41,35,FALSE)","v":44.800000000001091},null,1]
[179,{"$f":"+VLOOKUP(+$A4,'Data Input'!$A$3:$AX$41,2,FALSE)","v":"Waxwing"},{"$f":"+VLOOKUP(+$A4,'Data Input'!$A$3:$AX$41,3,FALSE)","v":"S Clayton"},{"$f":"+VLOOKUP(+$A4,'Data Input'!$A$3:$AX$41,4,FALSE)","v":28},{"$f":"+VLOOKUP(+$A4,'Data Input'!$A$3:$AX$41,5,FALSE)","v":-8},{"$f":"+VLOOKUP(+$A4,'Data Input'!$A$3:$AX$41,6,FALSE)","v":0},{"$f":"+VLOOKUP(+$A4,'Data Input'!$A$3:$AX$41,7,FALSE)","v":"B"},{"$f":"+VLOOKUP($A4,'Data Input'!$A$3:$AX$41,33,FALSE)","v":4},{"$f":"+VLOOKUP($A4,'Data Input'!$A$3:$AX$41,34,FALSE)","v":34},{"$f":"+VLOOKUP($A4,'Data Input'!$A$3:$AX$41,35,FALSE)","v":17.880000000001019},null,{"$f":"L3+1","v":2}]
[418,{"$f":"+VLOOKUP(+$A5,'Data Input'!$A$3:$AX$41,2,FALSE)","v":"Tinkerbell"},{"$f":"+VLOOKUP(+$A5,'Data Input'!$A$3:$AX$41,3,FALSE)","v":"A Lincoln"},{"$f":"+VLOOKUP(+$A5,'Data Input'!$A$3:$AX$41,4,FALSE)","v":25.2},{"$f":"+VLOOKUP(+$A5,'Data Input'!$A$3:$AX$41,5,FALSE)","v":-7},{"$f":"+VLOOKUP(+$A5,'Data Input'!$A$3:$AX$41,6,FALSE)","v":""},{"$f":"+VLOOKUP(+$A5,'Data Input'!$A$3:$AX$41,7,FALSE)","v":"B"},{"$f":"+VLOOKUP($A5,'Data Input'!$A$3:$AX$41,33,FALSE)","v":4},{"$f":"+VLOOKUP($A5,'Data Input'!$A$3:$AX$41,34,FALSE)","v":38},{"$f":"+VLOOKUP($A5,'Data Input'!$A$3:$AX$41,35,FALSE)","v":6.9900000000016007},null,{"$f":"L4+1","v":3}]
[199,{"$f":"+VLOOKUP(+$A6,'Data Input'!$A$3:$AX$41,2,FALSE)","v":"Morning Calm"},{"$f":"+VLOOKUP(+$A6,'Data Input'!$A$3:$AX$41,3,FALSE)","v":"W Clark"},{"$f":"+VLOOKUP(+$A6,'Data Input'!$A$3:$AX$41,4,FALSE)","v":26},{"$f":"+VLOOKUP(+$A6,'Data Input'!$A$3:$AX$41,5,FALSE)","v":-9},{"$f":"+VLOOKUP(+$A6,'Data Input'!$A$3:$AX$41,6,FALSE)","v":0},{"$f":"+VLOOKUP(+$A6,'Data Input'!$A$3:$AX$41,7,FALSE)","v":"B"},{"$f":"+VLOOKUP($A6,'Data Input'!$A$3:$AX$41,33,FALSE)","v":4},{"$f":"+VLOOKUP($A6,'Data Input'!$A$3:$AX$41,34,FALSE)","v":39},{"$f":"+VLOOKUP($A6,'Data Input'!$A$3:$AX$41,35,FALSE)","v":26.75},null,4]
[224,{"$f":"+VLOOKUP(+$A7,'Data Input'!$A$3:$AX$41,2,FALSE)","v":"Anna"},{"$f":"+VLOOKUP(+$A7,'Data Input'!$A$3:$AX$41,3,FALSE)","v":"R Branscombe"},{"$f":"+VLOOKUP(+$A7,'Data Input'!$A$3:$AX$41,4,FALSE)","v":25},{"$f":"+VLOOKUP(+$A7,'Data Input'!$A$3:$AX$41,5,FALSE)","v":-10},{"$f":"+VLOOKUP(+$A7,'Data Input'!$A$3:$AX$41,6,FALSE)","v":0},{"$f":"+VLOOKUP(+$A7,'Data Input'!$A$3:$AX$41,7,FALSE)","v":"B"},{"$f":"+VLOOKUP($A7,'Data Input'!$A$3:$AX$41,33,FALSE)","v":4},{"$f":"+VLOOKUP($A7,'Data Input'!$A$3:$AX$41,34,FALSE)","v":40},{"$f":"+VLOOKUP($A7,'Data Input'!$A$3:$AX$41,35,FALSE)","v":4.7999999999992724},null,5]
[244,{"$f":"+VLOOKUP(+$A8,'Data Input'!$A$3:$AX$41,2,FALSE)","v":"Catspaw"},{"$f":"+VLOOKUP(+$A8,'Data Input'!$A$3:$AX$41,3,FALSE)","v":"B Wilkins"},{"$f":"+VLOOKUP(+$A8,'Data Input'!$A$3:$AX$41,4,FALSE)","v":28},{"$f":"+VLOOKUP(+$A8,'Data Input'!$A$3:$AX$41,5,FALSE)","v":-4},{"$f":"+VLOOKUP(+$A8,'Data Input'!$A$3:$AX$41,6,FALSE)","v":0},{"$f":"+VLOOKUP(+$A8,'Data Input'!$A$3:$AX$41,7,FALSE)","v":"B"},{"$f":"+VLOOKUP($A8,'Data Input'!$A$3:$AX$41,33,FALSE)","v":4},{"$f":"+VLOOKUP($A8,'Data Input'!$A$3:$AX$41,34,FALSE)","v":40},{"$f":"+VLOOKUP($A8,'Data Input'!$A$3:$AX$41,35,FALSE)","v":24},null,6]
[218,{"$f":"+VLOOKUP(+$A9,'Data Input'!$A$3:$AX$41,2,FALSE)","v":"Mystery"},{"$f":"+VLOOKUP(+$A9,'Data Input'!$A$3:$AX$41,3,FALSE)","v":"M Ford"},{"$f":"+VLOOKUP(+$A9,'Data Input'!$A$3:$AX$41,4,FALSE)","v":26},{"$f":"+VLOOKUP(+$A9,'Data Input'!$A$3:$AX$41,5,FALSE)","v":-9},{"$f":"+VLOOKUP(+$A9,'Data Input'!$A$3:$AX$41,6,FALSE)","v":0},{"$f":"+VLOOKUP(+$A9,'Data Input'!$A$3:$AX$41,7,FALSE)","v":"B"},{"$f":"+VLOOKUP($A9,'Data Input'!$A$3:$AX$41,33,FALSE)","v":4},{"$f":"+VLOOKUP($A9,'Data Input'!$A$3:$AX$41,34,FALSE)","v":41},{"$f":"+VLOOKUP($A9,'Data Input'!$A$3:$AX$41,35,FALSE)","v":5.9400000000023283},null,7]
[400,{"$f":"+VLOOKUP(+$A10,'Data Input'!$A$3:$AX$41,2,FALSE)","v":"Swallow"},{"$f":"+VLOOKUP(+$A10,'Data Input'!$A$3:$AX$41,3,FALSE)","v":"K Halifax"},{"$f":"+VLOOKUP(+$A10,'Data Input'!$A$3:$AX$41,4,FALSE)","v":26.5},{"$f":"+VLOOKUP(+$A10,'Data Input'!$A$3:$AX$41,5,FALSE)","v":-7},{"$f":"+VLOOKUP(+$A10,'Data Input'!$A$3:$AX$41,6,FALSE)","v":""},{"$f":"+VLOOKUP(+$A10,'Data Input'!$A$3:$AX$41,7,FALSE)","v":"B"},{"$f":"+VLOOKUP($A10,'Data Input'!$A$3:$AX$41,33,FALSE)","v":4},{"$f":"+VLOOKUP($A10,'Data Input'!$A$3:$AX$41,34,FALSE)","v":42},{"$f":"+VLOOKUP($A10,'Data Input'!$A$3:$AX$41,35,FALSE)","v":31.110000000000582},null,8]
[25,{"$f":"+VLOOKUP(+$A11,'Data Input'!$A$3:$AX$41,2,FALSE)","v":"Melody"},{"$f":"+VLOOKUP(+$A11,'Data Input'!$A$3:$AX$41,3,FALSE)","v":"M Wells"},{"$f":"+VLOOKUP(+$A11,'Data Input'!$A$3:$AX$41,4,FALSE)","v":26},{"$f":"+VLOOKUP(+$A11,'Data Input'!$A$3:$AX$41,5,FALSE)","v":-10},{"$f":"+VLOOKUP(+$A11,'Data Input'!$A$3:$AX$41,6,FALSE)","v":0},{"$f":"+VLOOKUP(+$A11,'Data Input'!$A$3:$AX$41,7,FALSE)","v":"B"},{"$f":"+VLOOKUP($A11,'Data Input'!$A$3:$AX$41,33,FALSE)","v":4},{"$f":"+VLOOKUP($A11,'Data Input'!$A$3:$AX$41,34,FALSE)","v":56},{"$f":"+VLOOKUP($A11,'Data Input'!$A$3:$AX$41,35,FALSE)","v":57.299999999999272},null,9]
[217,{"$f":"+VLOOKUP(+$A12,'Data Input'!$A$3:$AX$41,2,FALSE)","v":"Melinda"},{"$f":"+VLOOKUP(+$A12,'Data Input'!$A$3:$AX$41,3,FALSE)","v":"P Howes"},{"$f":"+VLOOKUP(+$A12,'Data Input'!$A$3:$AX$41,4,FALSE)","v":27.9},{"$f":"+VLOOKUP(+$A12,'Data Input'!$A$3:$AX$41,5,FALSE)","v":1},{"$f":"+VLOOKUP(+$A12,'Data Input'!$A$3:$AX$41,6,FALSE)","v":0},{"$f":"+VLOOKUP(+$A12,'Data Input'!$A$3:$AX$41,7,FALSE)","v":"B"},{"$f":"+VLOOKUP($A12,'Data Input'!$A$3:$AX$41,33,FALSE)","v":5},{"$f":"+VLOOKUP($A12,'Data Input'!$A$3:$AX$41,34,FALSE)","v":1},{"$f":"+VLOOKUP($A12,'Data Input'!$A$3:$AX$41,35,FALSE)","v":38.18999999999869},null,10]
[240,{"$f":"+VLOOKUP(+$A13,'Data Input'!$A$3:$AX$41,2,FALSE)","v":"Avocet"},{"$f":"+VLOOKUP(+$A13,'Data Input'!$A$3:$AX$41,3,FALSE)","v":"R  Branford"},{"$f":"+VLOOKUP(+$A13,'Data Input'!$A$3:$AX$41,4,FALSE)","v":28},{"$f":"+VLOOKUP(+$A13,'Data Input'!$A$3:$AX$41,5,FALSE)","v":-16},{"$f":"+VLOOKUP(+$A13,'Data Input'!$A$3:$AX$41,6,FALSE)","v":"W"},{"$f":"+VLOOKUP(+$A13,'Data Input'!$A$3:$AX$41,7,FALSE)","v":"B"},{"$f":"+VLOOKUP($A13,'Data Input'!$A$3:$AX$41,33,FALSE)","v":8},{"$f":"+VLOOKUP($A13,'Data Input'!$A$3:$AX$41,34,FALSE)","v":2},{"$f":"+VLOOKUP($A13,'Data Input'!$A$3:$AX$41,35,FALSE)","v":4.5599999999976717},null,{"$f":"+VLOOKUP($A13,'Data Input'!$A$3:$AX$41,37,FALSE)","v":"W"}]
[]
[]
[]
[]
[]
[]
[]
[]
[]
[{"$f":"+COUNT(A3:A22)","v":11}]

{"sheet":"Classes C","index":6,"n_rows":15,"n_cols":13,"rows_kept":15,"cut":false,"hidden":false,"merged":[]}
["Wilberforce Smith",null,null,null,null,null,null,null,"Corrected"]
["No","Yacht","Skipper","Length","H/C","P","Class","H","M","S",null,"Pos"," "]
[87,{"$f":"+VLOOKUP(+$A3,'Data Input'!$A$3:$AX$41,2,FALSE)","v":"Modwena"},{"$f":"+VLOOKUP(+$A3,'Data Input'!$A$3:$AX$41,3,FALSE)","v":"M Cassidy"},{"$f":"+VLOOKUP(+$A3,'Data Input'!$A$3:$AX$41,4,FALSE)","v":24.8},{"$f":"+VLOOKUP(+$A3,'Data Input'!$A$3:$AX$41,5,FALSE)","v":-19},{"$f":"+VLOOKUP(+$A3,'Data Input'!$A$3:$AX$41,6,FALSE)","v":0},{"$f":"+VLOOKUP(+$A3,'Data Input'!$A$3:$AX$41,7,FALSE)","v":"C"},{"$f":"+VLOOKUP($A3,'Data Input'!$A$3:$AX$41,33,FALSE)","v":4},{"$f":"+VLOOKUP($A3,'Data Input'!$A$3:$AX$41,34,FALSE)","v":32},{"$f":"+VLOOKUP($A3,'Data Input'!$A$3:$AX$41,35,FALSE)","v":59.820000000001528},null,1]
[429,{"$f":"+VLOOKUP(+$A4,'Data Input'!$A$3:$AX$41,2,FALSE)","v":"Pickle"},{"$f":"+VLOOKUP(+$A4,'Data Input'!$A$3:$AX$41,3,FALSE)","v":"P Montague"},{"$f":"+VLOOKUP(+$A4,'Data Input'!$A$3:$AX$41,4,FALSE)","v":22.6},{"$f":"+VLOOKUP(+$A4,'Data Input'!$A$3:$AX$41,5,FALSE)","v":-17},{"$f":"+VLOOKUP(+$A4,'Data Input'!$A$3:$AX$41,6,FALSE)","v":0},{"$f":"+VLOOKUP(+$A4,'Data Input'!$A$3:$AX$41,7,FALSE)","v":"C"},{"$f":"+VLOOKUP($A4,'Data Input'!$A$3:$AX$41,33,FALSE)","v":4},{"$f":"+VLOOKUP($A4,'Data Input'!$A$3:$AX$41,34,FALSE)","v":52},{"$f":"+VLOOKUP($A4,'Data Input'!$A$3:$AX$41,35,FALSE)","v":4.6200000000026193},null,{"$f":"L3+1","v":2}]
[79,{"$f":"+VLOOKUP(+$A5,'Data Input'!$A$3:$AX$41,2,FALSE)","v":"Daisy"},{"$f":"+VLOOKUP(+$A5,'Data Input'!$A$3:$AX$41,3,FALSE)","v":"T Ford"},{"$f":"+VLOOKUP(+$A5,'Data Input'!$A$3:$AX$41,4,FALSE)","v":22},{"$f":"+VLOOKUP(+$A5,'Data Input'!$A$3:$AX$41,5,FALSE)","v":-21},{"$f":"+VLOOKUP(+$A5,'Data Input'!$A$3:$AX$41,6,FALSE)","v":0},{"$f":"+VLOOKUP(+$A5,'Data Input'!$A$3:$AX$41,7,FALSE)","v":"C"},{"$f":"+VLOOKUP($A5,'Data Input'!$A$3:$AX$41,33,FALSE)","v":5},{"$f":"+VLOOKUP($A5,'Data Input'!$A$3:$AX$41,34,FALSE)","v":31},{"$f":"+VLOOKUP($A5,'Data Input'!$A$3:$AX$41,35,FALSE)","v":29.040000000000873},null,{"$f":"L4+1","v":3}]
[274,{"$f":"+VLOOKUP(+$A6,'Data Input'!$A$3:$AX$41,2,FALSE)","v":"Elfin"},{"$f":"+VLOOKUP(+$A6,'Data Input'!$A$3:$AX$41,3,FALSE)","v":"A Bond"},{"$f":"+VLOOKUP(+$A6,'Data Input'!$A$3:$AX$41,4,FALSE)","v":21},{"$f":"+VLOOKUP(+$A6,'Data Input'!$A$3:$AX$41,5,FALSE)","v":-27},{"$f":"+VLOOKUP(+$A6,'Data Input'!$A$3:$AX$41,6,FALSE)","v":"DNS"},{"$f":"+VLOOKUP(+$A6,'Data Input'!$A$3:$AX$41,7,FALSE)","v":"C"},{"$f":"+VLOOKUP($A6,'Data Input'!$A$3:$AX$41,33,FALSE)","v":0},{"$f":"+VLOOKUP($A6,'Data Input'!$A$3:$AX$41,34,FALSE)","v":0},{"$f":"+VLOOKUP($A6,'Data Input'!$A$3:$AX$41,35,FALSE)","v":0},null,{"$f":"+VLOOKUP($A6,'Data Input'!$A$3:$AX$41,37,FALSE)","v":"DNS"}]
[141,{"$f":"+VLOOKUP(+$A7,'Data Input'!$A$3:$AX$41,2,FALSE)","v":"Nirvana"},{"$f":"+VLOOKUP(+$A7,'Data Input'!$A$3:$AX$41,3,FALSE)","v":" M Claridge"},{"$f":"+VLOOKUP(+$A7,'Data Input'!$A$3:$AX$41,4,FALSE)","v":20},{"$f":"+VLOOKUP(+$A7,'Data Input'!$A$3:$AX$41,5,FALSE)","v":-23},{"$f":"+VLOOKUP(+$A7,'Data Input'!$A$3:$AX$41,6,FALSE)","v":"P"},{"$f":"+VLOOKUP(+$A7,'Data Input'!$A$3:$AX$41,7,FALSE)","v":"C"},{"$f":"+VLOOKUP($A7,'Data Input'!$A$3:$AX$41,33,FALSE)","v":4},{"$f":"+VLOOKUP($A7,'Data Input'!$A$3:$AX$41,34,FALSE)","v":47},{"$f":"+VLOOKUP($A7,'Data Input'!$A$3:$AX$41,35,FALSE)","v":8.75},null,{"$f":"+VLOOKUP($A7,'Data Input'!$A$3:$AX$41,37,FALSE)","v":"P"}]
[155,{"$f":"+VLOOKUP(+$A8,'Data Input'!$A$3:$AX$41,2,FALSE)","v":"Stratus"},{"$f":"+VLOOKUP(+$A8,'Data Input'!$A$3:$AX$41,3,FALSE)","v":"J Townley"},{"$f":"+VLOOKUP(+$A8,'Data Input'!$A$3:$AX$41,4,FALSE)","v":22.6},{"$f":"+VLOOKUP(+$A8,'Data Input'!$A$3:$AX$41,5,FALSE)","v":-17},{"$f":"+VLOOKUP(+$A8,'Data Input'!$A$3:$AX$41,6,FALSE)","v":"W"},{"$f":"+VLOOKUP(+$A8,'Data Input'!$A$3:$AX$41,7,FALSE)","v":"C"},{"$f":"+VLOOKUP($A8,'Data Input'!$A$3:$AX$41,33,FALSE)","v":7},{"$f":"+VLOOKUP($A8,'Data Input'!$A$3:$AX$41,34,FALSE)","v":32},{"$f":"+VLOOKUP($A8,'Data Input'!$A$3:$AX$41,35,FALSE)","v":52.540000000000873},null,{"$f":"+VLOOKUP($A8,'Data Input'!$A$3:$AX$41,37,FALSE)","v":"W"}]
[109,{"$f":"+VLOOKUP(+$A9,'Data Input'!$A$3:$AX$41,2,FALSE)","v":"Kingfisher"},{"$f":"+VLOOKUP(+$A9,'Data Input'!$A$3:$AX$41,3,FALSE)","v":"J Flatman"},{"$f":"+VLOOKUP(+$A9,'Data Input'!$A$3:$AX$41,4,FALSE)","v":24.5},{"$f":"+VLOOKUP(+$A9,'Data Input'!$A$3:$AX$41,5,FALSE)","v":-19},{"$f":"+VLOOKUP(+$A9,'Data Input'!$A$3:$AX$41,6,FALSE)","v":"W"},{"$f":"+VLOOKUP(+$A9,'Data Input'!$A$3:$AX$41,7,FALSE)","v":"C"},{"$f":"+VLOOKUP($A9,'Data Input'!$A$3:$AX$41,33,FALSE)","v":7},{"$f":"+VLOOKUP($A9,'Data Input'!$A$3:$AX$41,34,FALSE)","v":25},{"$f":"+VLOOKUP($A9,'Data Input'!$A$3:$AX$41,35,FALSE)","v":30},null,{"$f":"+VLOOKUP($A9,'Data Input'!$A$3:$AX$41,37,FALSE)","v":"W"}]
[]
[]
[]
[]
[]
[{"$f":"+COUNT(A3:A14)","v":7}]