{"text_format":"1","workbook":"xlsx","n_sheets":7,"sheets":["Data Input","YNR","Moonraker","Classes","Classes A","Classes B","Classes C"],"not_rendered":{"charts":0,"images":0,"macros":1,"external_links":0,"defined_names":16,"comments":0,"pivot_tables":0},"unopened":[],"bounds":{"document_bytes":16777216,"sheet_cells":100000,"rows_first":2000,"rows_last":500,"rows_between":2000,"halvings":0,"cell_chars":16384,"cell_head_chars":4096},"cells_cut":0,"cells_raw":0,"read":"whole","date_system":"1900"}

{"sheet":"Data Input","index":0,"n_rows":44,"n_cols":50,"rows_kept":44,"cut":false,"hidden":false,"merged":[]}
["No","Yacht","Skipper","Length","H/C","P","Class",null,"Start",null,null,"Out 1",null,null,"In 1",null,null,"Out 2",null,null,"In 2",null,null,"Finish",null,null,null,"Elapsed",null,null,"Pos",null,null,"Corrected",null,null,"Pos",null,"Bridge1","Bridge 2","Bridge T","T","T-B elapsed","Corr"]
[null,null,null,null,null,null,null,"H","M","S","H","M","S","H","M","S","H","M","S","H","M","S","H","M","S",null,"H","M","S",null,null," ","H","M","S",null,null," ","Seconds","Seconds","Seconds","Seconds","Seconds","Seconds"]
[6,"Dragonfly","S Simpson",38,-13,"W",{"$f":"IF(D3=\"\",\"\",IF(D3<25,\"C\",IF(D3<28.01,\"B\",\"A\")))","v":"A"},9,45,0,10,59,46,11,29,20,null,null,null,null,null,null,null,null,null,null,{"$f":"INT(AQ3/3600)","v":10},{"$f":"INT((AQ3-AA3*3600)/60)","v":14},{"$f":"AQ3-(AA3*3600+AB3*60)","v":34},null,{"$f":"+AT3","v":"W"},null,{"$f":"INT(AR3/3600)","v":8},{"$f":"INT((AR3-AG3*3600)/60)","v":54},{"$f":"AR3-(AG3*3600+AH3*60)","v":40.380000000001019},null,{"$f":"+AW3","v":"W"},null,{"$f":"(P3+O3*60+N3*3600)-(M3+L3*60+K3*3600)","v":1774},{"$f":"(V3+U3*60+T3*3600)-(S3+R3*60+Q3*3600)","v":0},{"$f":"AM3+AN3","v":1774},{"$f":"(Y3+X3*60+W3*3600)-(J3+I3*60+H3*3600)","v":-35100},{"$f":"ABS(AP3-AO3)","v":36874},{"$f":"AQ3*(0.01*(100+E3))","v":32080.38},{"$f":"+IF(F3=\"\",AQ3,500000)","v":500000},{"$f":"IF(F3=\"\",+RANK(AS3,$AS$3:$AS$41,1),+F3)","v":"W"},{"$f":"+IF(AT3<4,\"Trophy\",\"\")","v":""},{"$f":"+IF(F3=\"\",AR3,500000)","v":500000},{"$f":"IF(F3=\"\",+RANK(AV3,$AV$3:$AV$41,1),+F3)","v":"W"},{"$f":"+IF(AW3<4,\"Trophy\",\"\")","v":""}]
[10,"Flight","J Farrow",29.9,-8,null,"A",8,30,0,10,0,37,10,14,14,11,49,17,12,2,3,14,6,41,null,5,10,18,null,16,null,4,45,28.56000000000131,null,14,null,817,766,1583,20201,18618,17128.560000000001,18618,16,"",17128.560000000001,14,""]
[22,"Moonraker","P Jeckells",29.5,2,"DNS","A",null,null,null,null,null,null,null,null,null,null,null,null,null,null,null,null,null,null,null,0,0,0,null,"DNS",null,0,0,0,null,"DNS",null,0,0,0,0,0,0,500000,"DNS","",500000,"DNS",""]
[25,"Melody","M Wells",26,-10,null,"B",8,30,0,9,49,52,9,54,44,11,39,38,11,52,58,14,18,9,null,5,29,57,null,18,null,4,56,57.299999999999272,null,18,null,292,800,1092,20889,19797,17817.3,19797,18,"",17817.3,18,""]
{"$rows_left_out":39}
{"sheet":"YNR","index":1,"n_rows":42,"n_cols":12,"rows_kept":42,"cut":false,"hidden":false,"merged":[]}
[null,null,null,null,null,null,null,null,"Corrected"]
["No","Yacht","Skipper","Length","H/C","P","Class","H","M","S",null,"Pos"]
[370,{"$f":"+VLOOKUP(+$A3,'Data Input'!$A$3:$AX$41,2,FALSE)","v":"Glory"},{"$f":"+VLOOKUP(+$A3,'Data Input'!$A$3:$AX$41,3,FALSE)","v":"C Brown"},{"$f":"+VLOOKUP(+$A3,'Data Input'!$A$3:$AX$41,4,FALSE)","v":35},{"$f":"+VLOOKUP(+$A3,'Data Input'!$A$3:$AX$41,5,FALSE)","v":-6},{"$f":"+VLOOKUP(+$A3,'Data Input'!$A$3:$AX$41,6,FALSE)","v":""},{"$f":"+VLOOKUP(+$A3,'Data Input'!$A$3:$AX$41,7,FALSE)","v":"A"},{"$f":"+VLOOKUP($A3,'Data Input'!$A$3:$AX$41,33,FALSE)","v":4},{"$f":"+VLOOKUP($A3,'Data Input'!$A$3:$AX$41,34,FALSE)","v":21},{"$f":"+VLOOKUP($A3,'Data Input'!$A$3:$AX$41,35,FALSE)","v":5.1000000000003638},null,{"$f":"+VLOOKUP($A3,'Data Input'!$A$3:$AX$41,37,FALSE)","v":1}]
[262,{"$f":"+VLOOKUP(+$A4,'Data Input'!$A$3:$AX$41,2,FALSE)","v":"Jessie May"},{"$f":"+VLOOKUP(+$A4,'Data Input'!$A$3:$AX$41,3,FALSE)","v":"S Dugdale"},{"$f":"+VLOOKUP(+$A4,'Data Input'!$A$3:$AX$41,4,FALSE)","v":28},{"$f":"+VLOOKUP(+$A4,'Data Input'!$A$3:$AX$41,5,FALSE)","v":-5},{"$f":"+VLOOKUP(+$A4,'Data Input'!$A$3:$AX$41,6,FALSE)","v":0},{"$f":"+VLOOKUP(+$A4,'Data Input'!$A$3:$AX$41,7,FALSE)","v":"B"},{"$f":"+VLOOKUP($A4,'Data Input'!$A$3:$AX$41,33,FALSE)","v":4},{"$f":"+VLOOKUP($A4,'Data Input'!$A$3:$AX$41,34,FALSE)","v":25},{"$f":"+VLOOKUP($A4,'Data Input'!$A$3:$AX$41,35,FALSE)","v":44.800000000001091},null,{"$f":"+VLOOKUP($A4,'Data Input'!$A$3:$AX$41,37,FALSE)","v":2}]
[368,{"$f":"+VLOOKUP(+$A5,'Data Input'!$A$3:$AX$41,2,FALSE)","v":"Wandering Rose"},{"$f":"+VLOOKUP(+$A5,'Data Input'!$A$3:$AX$41,3,FALSE)","v":"  Radley"},{"$f":"+VLOOKUP(+$A5,'Data Input'!$A$3:$AX$41,4,FALSE)","v":31},{"$f":"+VLOOKUP(+$A5,'Data Input'!$A$3:$AX$41,5,FALSE)","v":-2},{"$f":"+VLOOKUP(+$A5,'Data Input'!$A$3:$AX$41,6,FALSE)","v":0},{"$f":"+VLOOKUP(+$A5,'Data Input'!$A$3:$AX$41,7,FALSE)","v":"A"},{"$f":"+VLOOKUP($A5,'Data Input'!$A$3:$AX$41,33,FALSE)","v":4},{"$f":"+VLOOKUP($A5,'Data Input'!$A$3:$AX$41,34,FALSE)","v":27},{"$f":"+VLOOKUP($A5,'Data Input'!$A$3:$AX$41,35,FALSE)","v":25.539999999999054},null,{"$f":"+VLOOKUP($A5,'Data Input'!$A$3:$AX$41,37,FALSE)","v":3}]
[87,{"$f":"+VLOOKUP(+$A6,'Data Input'!$A$3:$AX$41,2,FALSE)","v":"Modwena"},{"$f":"+VLOOKUP(+$A6,'Data Input'!$A$3:$AX$41,3,FALSE)","v":"M Cassidy"},{"$f":"+VLOOKUP(+$A6,'Data Input'!$A$3:$AX$41,4,FALSE)","v":24.8},{"$f":"+VLOOKUP(+$A6,'Data Input'!$A$3:$AX$41,5,FALSE)","v":-19},{"$f":"+VLOOKUP(+$A6,'Data Input'!$A$3:$AX$41,6,FALSE)","v":0},{"$f":"+VLOOKUP(+$A6,'Data Input'!$A$3:$AX$41,7,FALSE)","v":"C"},{"$f":"+VLOOKUP($A6,'Data Input'!$A$3:$AX$41,33,FALSE)","v":4},{"$f":"+VLOOKUP($A6,'Data Input'!$A$3:$AX$41,34,FALSE)","v":32},{"$f":"+VLOOKUP($A6,'Data Input'!$A$3:$AX$41,35,FALSE)","v":59.820000000001528},null,{"$f":"+VLOOKUP($A6,'Data Input'!$A$3:$AX$41,37,FALSE)","v":4}]
{"$rows_left_out":37}
{"sheet":"Moonraker","index":2,"n_rows":42,"n_cols":13,"rows_kept":42,"cut":false,"hidden":false,"merged":[]}
[null,null,null,null,null,null,null,null,"Elapsed"]
["No","Yacht","Skipper","Length","H/C","P","Class","H","M","S",null,"Pos"," "]
[323,{"$f":"+VLOOKUP(+$A3,'Data Input'!$A$3:$AX$41,2,FALSE)","v":"Starlight Lady"},{"$f":"+VLOOKUP(+$A3,'Data Input'!$A$3:$AX$41,3,FALSE)","v":"N.Matthews"},{"$f":"+VLOOKUP(+$A3,'Data Input'!$A$3:$AX$41,4,FALSE)","v":30},{"$f":"+VLOOKUP(+$A3,'Data Input'!$A$3:$AX$41,5,FALSE)","v":13},{"$f":"+VLOOKUP(+$A3,'Data Input'!$A$3:$AX$41,6,FALSE)","v":0},{"$f":"+VLOOKUP(+$A3,'Data Input'!$A$3:$AX$41,7,FALSE)","v":"A"},{"$f":"+VLOOKUP($A3,'Data Input'!$A$3:$AX$41,27,FALSE)","v":4},{"$f":"+VLOOKUP($A3,'Data Input'!$A$3:$AX$41,28,FALSE)","v":5},{"$f":"+VLOOKUP($A3,'Data Input'!$A$3:$AX$41,29,FALSE)","v":1},null,{"$f":"+VLOOKUP($A3,'Data Input'!$A$3:$AX$41,31,FALSE)","v":1}]
[417,{"$f":"+VLOOKUP(+$A4,'Data Input'!$A$3:$AX$41,2,FALSE)","v":"Stellar"},{"$f":"+VLOOKUP(+$A4,'Data Input'!$A$3:$AX$41,3,FALSE)","v":"T Frary"},{"$f":"+VLOOKUP(+$A4,'Data Input'!$A$3:$AX$41,4,FALSE)","v":31.3},{"$f":"+VLOOKUP(+$A4,'Data Input'!$A$3:$AX$41,5,FALSE)","v":17},{"$f":"+VLOOKUP(+$A4,'Data Input'!$A$3:$AX$41,6,FALSE)","v":0},{"$f":"+VLOOKUP(+$A4,'Data Input'!$A$3:$AX$41,7,FALSE)","v":"A"},{"$f":"+VLOOKUP($A4,'Data Input'!$A$3:$AX$41,27,FALSE)","v":4},{"$f":"+VLOOKUP($A4,'Data Input'!$A$3:$AX$41,28,FALSE)","v":9},{"$f":"+VLOOKUP($A4,'Data Input'!$A$3:$AX$41,29,FALSE)","v":16},null,{"$f":"+VLOOKUP($A4,'Data Input'!$A$3:$AX$41,31,FALSE)","v":2}]
[373,{"$f":"+VLOOKUP(+$A5,'Data Input'!$A$3:$AX$41,2,FALSE)","v":"Meggie"},{"$f":"+VLOOKUP(+$A5,'Data Input'!$A$3:$AX$41,3,FALSE)","v":"J Tansley"},{"$f":"+VLOOKUP(+$A5,'Data Input'!$A$3:$AX$41,4,FALSE)","v":34.9},{"$f":"+VLOOKUP(+$A5,'Data Input'!$A$3:$AX$41,5,FALSE)","v":13},{"$f":"+VLOOKUP(+$A5,'Data Input'!$A$3:$AX$41,6,FALSE)","v":""},{"$f":"+VLOOKUP(+$A5,'Data Input'!$A$3:$AX$41,7,FALSE)","v":"A"},{"$f":"+VLOOKUP($A5,'Data Input'!$A$3:$AX$41,27,FALSE)","v":4},{"$f":"+VLOOKUP($A5,'Data Input'!$A$3:$AX$41,28,FALSE)","v":29},{"$f":"+VLOOKUP($A5,'Data Input'!$A$3:$AX$41,29,FALSE)","v":21},null,{"$f":"+VLOOKUP($A5,'Data Input'!$A$3:$AX$41,31,FALSE)","v":3}]
[368,{"$f":"+VLOOKUP(+$A6,'Data Input'!$A$3:$AX$41,2,FALSE)","v":"Wandering Rose"},{"$f":"+VLOOKUP(+$A6,'Data Input'!$A$3:$AX$41,3,FALSE)","v":"  Radley"},{"$f":"+VLOOKUP(+$A6,'Data Input'!$A$3:$AX$41,4,FALSE)","v":31},{"$f":"+VLOOKUP(+$A6,'Data Input'!$A$3:$AX$41,5,FALSE)","v":-2},{"$f":"+VLOOKUP(+$A6,'Data Input'!$A$3:$AX$41,6,FALSE)","v":0},{"$f":"+VLOOKUP(+$A6,'Data Input'!$A$3:$AX$41,7,FALSE)","v":"A"},{"$f":"+VLOOKUP($A6,'Data Input'!$A$3:$AX$41,27,FALSE)","v":4},{"$f":"+VLOOKUP($A6,'Data Input'!$A$3:$AX$41,28,FALSE)","v":32},{"$f":"+VLOOKUP($A6,'Data Input'!$A$3:$AX$41,29,FALSE)","v":53},null,{"$f":"+VLOOKUP($A6,'Data Input'!$A$3:$AX$41,31,FALSE)","v":4}]
{"$rows_left_out":37}
{"sheet":"Classes","index":3,"n_rows":42,"n_cols":15,"rows_kept":42,"cut":false,"hidden":false,"merged":[]}
[null,null,null,null,null,null,null,null,"Corrected",null,null,null,null,null,"Don’t use filters on this page"]
["No","Yacht","Skipper","Length","H/C","P","Class","H","M","S",null,"Pos"," ",null,"Sort will place into clases and then order.  You can then insert rows with Trophy Name before printing"]
[6,{"$f":"+VLOOKUP(+$A3,'Data Input'!$A$3:$AX$41,2,FALSE)","v":"Dragonfly"},{"$f":"+VLOOKUP(+$A3,'Data Input'!$A$3:$AX$41,3,FALSE)","v":"S Simpson"},{"$f":"+VLOOKUP(+$A3,'Data Input'!$A$3:$AX$41,4,FALSE)","v":38},{"$f":"+VLOOKUP(+$A3,'Data Input'!$A$3:$AX$41,5,FALSE)","v":-13},{"$f":"+VLOOKUP(+$A3,'Data Input'!$A$3:$AX$41,6,FALSE)","v":"W"},{"$f":"+VLOOKUP(+$A3,'Data Input'!$A$3:$AX$41,7,FALSE)","v":"A"},{"$f":"+VLOOKUP($A3,'Data Input'!$A$3:$AX$41,33,FALSE)","v":8},{"$f":"+VLOOKUP($A3,'Data Input'!$A$3:$AX$41,34,FALSE)","v":54},{"$f":"+VLOOKUP($A3,'Data Input'!$A$3:$AX$41,35,FALSE)","v":40.380000000001019},null,{"$f":"+VLOOKUP($A3,'Data Input'!$A$3:$AX$41,37,FALSE)","v":"W"},null,null,"Starlight Lady"]
[10,{"$f":"+VLOOKUP(+$A4,'Data Input'!$A$3:$AX$41,2,FALSE)","v":"Flight"},{"$f":"+VLOOKUP(+$A4,'Data Input'!$A$3:$AX$41,3,FALSE)","v":"J Farrow"},{"$f":"+VLOOKUP(+$A4,'Data Input'!$A$3:$AX$41,4,FALSE)","v":29.9},{"$f":"+VLOOKUP(+$A4,'Data Input'!$A$3:$AX$41,5,FALSE)","v":-8},{"$f":"+VLOOKUP(+$A4,'Data Input'!$A$3:$AX$41,6,FALSE)","v":0},{"$f":"+VLOOKUP(+$A4,'Data Input'!$A$3:$AX$41,7,FALSE)","v":"A"},{"$f":"+VLOOKUP($A4,'Data Input'!$A$3:$AX$41,33,FALSE)","v":4},{"$f":"+VLOOKUP($A4,'Data Input'!$A$3:$AX$41,34,FALSE)","v":45},{"$f":"+VLOOKUP($A4,'Data Input'!$A$3:$AX$41,35,FALSE)","v":28.56000000000131},null,{"$f":"+VLOOKUP($A4,'Data Input'!$A$3:$AX$41,37,FALSE)","v":14},null,null,"Jeckells"]
[22,{"$f":"+VLOOKUP(+$A5,'Data Input'!$A$3:$AX$41,2,FALSE)","v":"Moonraker"},{"$f":"+VLOOKUP(+$A5,'Data Input'!$A$3:$AX$41,3,FALSE)","v":"P Jeckells"},{"$f":"+VLOOKUP(+$A5,'Data Input'!$A$3:$AX$41,4,FALSE)","v":29.5},{"$f":"+VLOOKUP(+$A5,'Data Input'!$A$3:$AX$41,5,FALSE)","v":2},{"$f":"+VLOOKUP(+$A5,'Data Input'!$A$3:$AX$41,6,FALSE)","v":"DNS"},{"$f":"+VLOOKUP(+$A5,'Data Input'!$A$3:$AX$41,7,FALSE)","v":"A"},{"$f":"+VLOOKUP($A5,'Data Input'!$A$3:$AX$41,33,FALSE)","v":0},{"$f":"+VLOOKUP($A5,'Data Input'!$A$3:$AX$41,34,FALSE)","v":0},{"$f":"+VLOOKUP($A5,'Data Input'!$A$3:$AX$41,35,FALSE)","v":0},null,{"$f":"+VLOOKUP($A5,'Data Input'!$A$3:$AX$41,37,FALSE)","v":"DNS"},null,null,"Wilberforce Smith"]
[52,{"$f":"+VLOOKUP(+$A6,'Data Input'!$A$3:$AX$41,2,FALSE)","v":"Maidie"},{"$f":"+VLOOKUP(+$A6,'Data Input'!$A$3:$AX$41,3,FALSE)","v":"M Barnes"},{"$f":"+VLOOKUP(+$A6,'Data Input'!$A$3:$AX$41,4,FALSE)","v":43.2},{"$f":"+VLOOKUP(+$A6,'Data Input'!$A$3:$AX$41,5,FALSE)","v":13},{"$f":"+VLOOKUP(+$A6,'Data Input'!$A$3:$AX$41,6,FALSE)","v":"DNS"},{"$f":"+VLOOKUP(+$A6,'Data Input'!$A$3:$AX$41,7,FALSE)","v":"A"},{"$f":"+VLOOKUP($A6,'Data Input'!$A$3:$AX$41,33,FALSE)","v":0},{"$f":"+VLOOKUP($A6,'Data Input'!$A$3:$AX$41,34,FALSE)","v":0},{"$f":"+VLOOKUP($A6,'Data Input'!$A$3:$AX$41,35,FALSE)","v":0},null,{"$f":"+VLOOKUP($A6,'Data Input'!$A$3:$AX$41,37,FALSE)","v":"DNS"}]
{"$rows_left_out":37}
{"sheet":"Classes A","index":4,"n_rows":25,"n_cols":13,"rows_kept":25,"cut":false,"hidden":false,"merged":[]}
["Starlight Lady",null,null,null,null,null,null,null,"Corrected"]
["No","Yacht","Skipper","Length","H/C","P","Class","H","M","S",null,"Pos"," "]
[370,{"$f":"+VLOOKUP(+$A3,'Data Input'!$A$3:$AX$41,2,FALSE)","v":"Glory"},{"$f":"+VLOOKUP(+$A3,'Data Input'!$A$3:$AX$41,3,FALSE)","v":"C Brown"},{"$f":"+VLOOKUP(+$A3,'Data Input'!$A$3:$AX$41,4,FALSE)","v":35},{"$f":"+VLOOKUP(+$A3,'Data Input'!$A$3:$AX$41,5,FALSE)","v":-6},{"$f":"+VLOOKUP(+$A3,'Data Input'!$A$3:$AX$41,6,FALSE)","v":""},{"$f":"+VLOOKUP(+$A3,'Data Input'!$A$3:$AX$41,7,FALSE)","v":"A"},{"$f":"+VLOOKUP($A3,'Data Input'!$A$3:$AX$41,33,FALSE)","v":4},{"$f":"+VLOOKUP($A3,'Data Input'!$A$3:$AX$41,34,FALSE)","v":21},{"$f":"+VLOOKUP($A3,'Data Input'!$A$3:$AX$41,35,FALSE)","v":5.1000000000003638},null,{"$f":"+VLOOKUP($A3,'Data Input'!$A$3:$AX$41,37,FALSE)","v":1}]
[368,{"$f":"+VLOOKUP(+$A4,'Data Input'!$A$3:$AX$41,2,FALSE)","v":"Wandering Rose"},{"$f":"+VLOOKUP(+$A4,'Data Input'!$A$3:$AX$41,3,FALSE)","v":"  Radley"},{"$f":"+VLOOKUP(+$A4,'Data Input'!$A$3:$AX$41,4,FALSE)","v":31},{"$f":"+VLOOKUP(+$A4,'Data Input'!$A$3:$AX$41,5,FALSE)","v":-2},{"$f":"+VLOOKUP(+$A4,'Data Input'!$A$3:$AX$41,6,FALSE)","v":0},{"$f":"+VLOOKUP(+$A4,'Data Input'!$A$3:$AX$41,7,FALSE)","v":"A"},{"$f":"+VLOOKUP($A4,'Data Input'!$A$3:$AX$41,33,FALSE)","v":4},{"$f":"+VLOOKUP($A4,'Data Input'!$A$3:$AX$41,34,FALSE)","v":27},{"$f":"+VLOOKUP($A4,'Data Input'!$A$3:$AX$41,35,FALSE)","v":25.539999999999054},null,{"$f":"L3+1","v":2}]
[323,{"$f":"+VLOOKUP(+$A5,'Data Input'!$A$3:$AX$41,2,FALSE)","v":"Starlight Lady"},{"$f":"+VLOOKUP(+$A5,'Data Input'!$A$3:$AX$41,3,FALSE)","v":"N.Matthews"},{"$f":"+VLOOKUP(+$A5,'Data Input'!$A$3:$AX$41,4,FALSE)","v":30},{"$f":"+VLOOKUP(+$A5,'Data Input'!$A$3:$AX$41,5,FALSE)","v":13},{"$f":"+VLOOKUP(+$A5,'Data Input'!$A$3:$AX$41,6,FALSE)","v":0},{"$f":"+VLOOKUP(+$A5,'Data Input'!$A$3:$AX$41,7,FALSE)","v":"A"},{"$f":"+VLOOKUP($A5,'Data Input'!$A$3:$AX$41,33,FALSE)","v":4},{"$f":"+VLOOKUP($A5,'Data Input'!$A$3:$AX$41,34,FALSE)","v":36},{"$f":"+VLOOKUP($A5,'Data Input'!$A$3:$AX$41,35,FALSE)","v":52.130000000001019},null,{"$f":"L4+1","v":3}]
[152,{"$f":"+VLOOKUP(+$A6,'Data Input'!$A$3:$AX$41,2,FALSE)","v":"Sabrina 2"},{"$f":"+VLOOKUP(+$A6,'Data Input'!$A$3:$AX$41,3,FALSE)","v":"J Holmes"},{"$f":"+VLOOKUP(+$A6,'Data Input'!$A$3:$AX$41,4,FALSE)","v":29},{"$f":"+VLOOKUP(+$A6,'Data Input'!$A$3:$AX$41,5,FALSE)","v":-7},{"$f":"+VLOOKUP(+$A6,'Data Input'!$A$3:$AX$41,6,FALSE)","v":0},{"$f":"+VLOOKUP(+$A6,'Data Input'!$A$3:$AX$41,7,FALSE)","v":"A"},{"$f":"+VLOOKUP($A6,'Data Input'!$A$3:$AX$41,33,FALSE)","v":4},{"$f":"+VLOOKUP($A6,'Data Input'!$A$3:$AX$41,34,FALSE)","v":36},{"$f":"+VLOOKUP($A6,'Data Input'!$A$3:$AX$41,35,FALSE)","v":56.31000000000131},null,4]
{"$rows_left_out":20}
{"sheet":"Classes B","index":5,"n_rows":23,"n_cols":13,"rows_kept":23,"cut":false,"hidden":false,"merged":[]}
["Jeckells",null,null,null,null,null,null,null,"Corrected"]
["No","Yacht","Skipper","Length","H/C","P","Class","H","M","S",null,"Pos"," "]
[262,{"$f":"+VLOOKUP(+$A3,'Data Input'!$A$3:$AX$41,2,FALSE)","v":"Jessie May"},{"$f":"+VLOOKUP(+$A3,'Data Input'!$A$3:$AX$41,3,FALSE)","v":"S Dugdale"},{"$f":"+VLOOKUP(+$A3,'Data Input'!$A$3:$AX$41,4,FALSE)","v":28},{"$f":"+VLOOKUP(+$A3,'Data Input'!$A$3:$AX$41,5,FALSE)","v":-5},{"$f":"+VLOOKUP(+$A3,'Data Input'!$A$3:$AX$41,6,FALSE)","v":0},{"$f":"+VLOOKUP(+$A3,'Data Input'!$A$3:$AX$41,7,FALSE)","v":"B"},{"$f":"+VLOOKUP($A3,'Data Input'!$A$3:$AX$41,33,FALSE)","v":4},{"$f":"+VLOOKUP($A3,'Data Input'!$A$3:$AX$41,34,FALSE)","v":25},{"$f":"+VLOOKUP($A3,'Data Input'!$A$3:$AX$41,35,FALSE)","v":44.800000000001091},null,1]
[179,{"$f":"+VLOOKUP(+$A4,'Data Input'!$A$3:$AX$41,2,FALSE)","v":"Waxwing"},{"$f":"+VLOOKUP(+$A4,'Data Input'!$A$3:$AX$41,3,FALSE)","v":"S Clayton"},{"$f":"+VLOOKUP(+$A4,'Data Input'!$A$3:$AX$41,4,FALSE)","v":28},{"$f":"+VLOOKUP(+$A4,'Data Input'!$A$3:$AX$41,5,FALSE)","v":-8},{"$f":"+VLOOKUP(+$A4,'Data Input'!$A$3:$AX$41,6,FALSE)","v":0},{"$f":"+VLOOKUP(+$A4,'Data Input'!$A$3:$AX$41,7,FALSE)","v":"B"},{"$f":"+VLOOKUP($A4,'Data Input'!$A$3:$AX$41,33,FALSE)","v":4},{"$f":"+VLOOKUP($A4,'Data Input'!$A$3:$AX$41,34,FALSE)","v":34},{"$f":"+VLOOKUP($A4,'Data Input'!$A$3:$AX$41,35,FALSE)","v":17.880000000001019},null,{"$f":"L3+1","v":2}]
[418,{"$f":"+VLOOKUP(+$A5,'Data Input'!$A$3:$AX$41,2,FALSE)","v":"Tinkerbell"},{"$f":"+VLOOKUP(+$A5,'Data Input'!$A$3:$AX$41,3,FALSE)","v":"A Lincoln"},{"$f":"+VLOOKUP(+$A5,'Data Input'!$A$3:$AX$41,4,FALSE)","v":25.2},{"$f":"+VLOOKUP(+$A5,'Data Input'!$A$3:$AX$41,5,FALSE)","v":-7},{"$f":"+VLOOKUP(+$A5,'Data Input'!$A$3:$AX$41,6,FALSE)","v":""},{"$f":"+VLOOKUP(+$A5,'Data Input'!$A$3:$AX$41,7,FALSE)","v":"B"},{"$f":"+VLOOKUP($A5,'Data Input'!$A$3:$AX$41,33,FALSE)","v":4},{"$f":"+VLOOKUP($A5,'Data Input'!$A$3:$AX$41,34,FALSE)","v":38},{"$f":"+VLOOKUP($A5,'Data Input'!$A$3:$AX$41,35,FALSE)","v":6.9900000000016007},null,{"$f":"L4+1","v":3}]
[199,{"$f":"+VLOOKUP(+$A6,'Data Input'!$A$3:$AX$41,2,FALSE)","v":"Morning Calm"},{"$f":"+VLOOKUP(+$A6,'Data Input'!$A$3:$AX$41,3,FALSE)","v":"W Clark"},{"$f":"+VLOOKUP(+$A6,'Data Input'!$A$3:$AX$41,4,FALSE)","v":26},{"$f":"+VLOOKUP(+$A6,'Data Input'!$A$3:$AX$41,5,FALSE)","v":-9},{"$f":"+VLOOKUP(+$A6,'Data Input'!$A$3:$AX$41,6,FALSE)","v":0},{"$f":"+VLOOKUP(+$A6,'Data Input'!$A$3:$AX$41,7,FALSE)","v":"B"},{"$f":"+VLOOKUP($A6,'Data Input'!$A$3:$AX$41,33,FALSE)","v":4},{"$f":"+VLOOKUP($A6,'Data Input'!$A$3:$AX$41,34,FALSE)","v":39},{"$f":"+VLOOKUP($A6,'Data Input'!$A$3:$AX$41,35,FALSE)","v":26.75},null,4]
{"$rows_left_out":18}
{"sheet":"Classes C","index":6,"n_rows":15,"n_cols":13,"rows_kept":15,"cut":false,"hidden":false,"merged":[]}
["Wilberforce Smith",null,null,null,null,null,null,null,"Corrected"]
["No","Yacht","Skipper","Length","H/C","P","Class","H","M","S",null,"Pos"," "]
[87,{"$f":"+VLOOKUP(+$A3,'Data Input'!$A$3:$AX$41,2,FALSE)","v":"Modwena"},{"$f":"+VLOOKUP(+$A3,'Data Input'!$A$3:$AX$41,3,FALSE)","v":"M Cassidy"},{"$f":"+VLOOKUP(+$A3,'Data Input'!$A$3:$AX$41,4,FALSE)","v":24.8},{"$f":"+VLOOKUP(+$A3,'Data Input'!$A$3:$AX$41,5,FALSE)","v":-19},{"$f":"+VLOOKUP(+$A3,'Data Input'!$A$3:$AX$41,6,FALSE)","v":0},{"$f":"+VLOOKUP(+$A3,'Data Input'!$A$3:$AX$41,7,FALSE)","v":"C"},{"$f":"+VLOOKUP($A3,'Data Input'!$A$3:$AX$41,33,FALSE)","v":4},{"$f":"+VLOOKUP($A3,'Data Input'!$A$3:$AX$41,34,FALSE)","v":32},{"$f":"+VLOOKUP($A3,'Data Input'!$A$3:$AX$41,35,FALSE)","v":59.820000000001528},null,1]
[429,{"$f":"+VLOOKUP(+$A4,'Data Input'!$A$3:$AX$41,2,FALSE)","v":"Pickle"},{"$f":"+VLOOKUP(+$A4,'Data Input'!$A$3:$AX$41,3,FALSE)","v":"P Montague"},{"$f":"+VLOOKUP(+$A4,'Data Input'!$A$3:$AX$41,4,FALSE)","v":22.6},{"$f":"+VLOOKUP(+$A4,'Data Input'!$A$3:$AX$41,5,FALSE)","v":-17},{"$f":"+VLOOKUP(+$A4,'Data Input'!$A$3:$AX$41,6,FALSE)","v":0},{"$f":"+VLOOKUP(+$A4,'Data Input'!$A$3:$AX$41,7,FALSE)","v":"C"},{"$f":"+VLOOKUP($A4,'Data Input'!$A$3:$AX$41,33,FALSE)","v":4},{"$f":"+VLOOKUP($A4,'Data Input'!$A$3:$AX$41,34,FALSE)","v":52},{"$f":"+VLOOKUP($A4,'Data Input'!$A$3:$AX$41,35,FALSE)","v":4.6200000000026193},null,{"$f":"L3+1","v":2}]
[79,{"$f":"+VLOOKUP(+$A5,'Data Input'!$A$3:$AX$41,2,FALSE)","v":"Daisy"},{"$f":"+VLOOKUP(+$A5,'Data Input'!$A$3:$AX$41,3,FALSE)","v":"T Ford"},{"$f":"+VLOOKUP(+$A5,'Data Input'!$A$3:$AX$41,4,FALSE)","v":22},{"$f":"+VLOOKUP(+$A5,'Data Input'!$A$3:$AX$41,5,FALSE)","v":-21},{"$f":"+VLOOKUP(+$A5,'Data Input'!$A$3:$AX$41,6,FALSE)","v":0},{"$f":"+VLOOKUP(+$A5,'Data Input'!$A$3:$AX$41,7,FALSE)","v":"C"},{"$f":"+VLOOKUP($A5,'Data Input'!$A$3:$AX$41,33,FALSE)","v":5},{"$f":"+VLOOKUP($A5,'Data Input'!$A$3:$AX$41,34,FALSE)","v":31},{"$f":"+VLOOKUP($A5,'Data Input'!$A$3:$AX$41,35,FALSE)","v":29.040000000000873},null,{"$f":"L4+1","v":3}]
[274,{"$f":"+VLOOKUP(+$A6,'Data Input'!$A$3:$AX$41,2,FALSE)","v":"Elfin"},{"$f":"+VLOOKUP(+$A6,'Data Input'!$A$3:$AX$41,3,FALSE)","v":"A Bond"},{"$f":"+VLOOKUP(+$A6,'Data Input'!$A$3:$AX$41,4,FALSE)","v":21},{"$f":"+VLOOKUP(+$A6,'Data Input'!$A$3:$AX$41,5,FALSE)","v":-27},{"$f":"+VLOOKUP(+$A6,'Data Input'!$A$3:$AX$41,6,FALSE)","v":"DNS"},{"$f":"+VLOOKUP(+$A6,'Data Input'!$A$3:$AX$41,7,FALSE)","v":"C"},{"$f":"+VLOOKUP($A6,'Data Input'!$A$3:$AX$41,33,FALSE)","v":0},{"$f":"+VLOOKUP($A6,'Data Input'!$A$3:$AX$41,34,FALSE)","v":0},{"$f":"+VLOOKUP($A6,'Data Input'!$A$3:$AX$41,35,FALSE)","v":0},null,{"$f":"+VLOOKUP($A6,'Data Input'!$A$3:$AX$41,37,FALSE)","v":"DNS"}]
{"$rows_left_out":9}