{"text_format":"1","workbook":"xlsx","n_sheets":7,"sheets":["Data Input","YNR","Moonraker","Classes","Classes A","Classes B","Classes C"],"not_rendered":{"charts":0,"images":0,"macros":0,"external_links":0,"defined_names":16,"comments":0,"pivot_tables":0},"unopened":[],"bounds":{"document_bytes":16777216,"sheet_cells":100000,"rows_first":2000,"rows_last":500,"rows_between":2000,"halvings":0,"cell_chars":16384,"cell_head_chars":4096},"cells_cut":0,"cells_raw":0,"read":"whole","date_system":"1900"}

{"sheet":"Data Input","index":0,"n_rows":42,"n_cols":50,"rows_kept":42,"cut":false,"hidden":false,"merged":[]}
["No","Yacht","Skipper","Length","H/C","P","Class",null,"Start",null,null,"Out 1",null,null,"In 1",null,null,"Out 2",null,null,"In 2",null,null,"Finish",null,null,null,"Elapsed",null,null,"Pos",null,null,"Corrected",null,null,"Pos",null,"Bridge1","Bridge 2","Bridge T","T","T-B elapsed","Corr"]
[null,null,null,null,null,null,null,"H","M","S","H","M","S","H","M","S","H","M","S","H","M","S","H","M","S",null,"H","M","S",null,null," ","H","M","S",null,null," ","Seconds","Seconds","Seconds","Seconds","Seconds","Seconds"]
[10,"Flight","J Farrow",29.11,-9,null,{"$f":"IF(D3=\"\",\"\",IF(D3<25,\"C\",IF(D3<28.01,\"B\",\"A\")))","v":"A"},10,45,0,null,null,null,null,null,null,null,null,null,null,null,null,16,45,54,null,{"$f":"INT(AQ3/3600)","v":6},{"$f":"INT((AQ3-AA3*3600)/60)","v":0},{"$f":"AQ3-(AA3*3600+AB3*60)","v":54},null,{"$f":"+AT3","v":18},null,{"$f":"INT(AR3/3600)","v":5},{"$f":"INT((AR3-AG3*3600)/60)","v":28},{"$f":"AR3-(AG3*3600+AH3*60)","v":25.139999999999418},null,{"$f":"+AW3","v":20},null,{"$f":"(P3+O3*60+N3*3600)-(M3+L3*60+K3*3600)","v":0},{"$f":"(V3+U3*60+T3*3600)-(S3+R3*60+Q3*3600)","v":0},{"$f":"AM3+AN3","v":0},{"$f":"(Y3+X3*60+W3*3600)-(J3+I3*60+H3*3600)","v":21654},{"$f":"ABS(AP3-AO3)","v":21654},{"$f":"AQ3*(0.01*(100+E3))","v":19705.14},{"$f":"+IF(F3=\"\",AQ3,500000)","v":21654},{"$f":"IF(F3=\"\",+RANK(AS3,$AS$3:$AS$39,1),+F3)","v":18},{"$f":"+IF(AT3<4,\"Trophy\",\"\")","v":""},{"$f":"+IF(F3=\"\",AR3,500000)","v":19705.14},{"$f":"IF(F3=\"\",+RANK(AV3,$AV$3:$AV$39,1),+F3)","v":20},{"$f":"+IF(AW3<4,\"Trophy\",\"\")","v":""}]
[22,"Moonraker","P Jeckells",29.6,2,null,"A",11,30,0,null,null,null,null,null,null,null,null,null,null,null,null,16,37,35,null,5,7,35,null,6,null,5,13,44.099999999998545,null,9,null,0,0,0,18455,18455,18824.099999999999,18455,6,"",18824.099999999999,9,""]
[24,"Pippa","G Angel",27.1,-7,null,"B",12,45,0,null,null,null,null,null,null,null,null,null,null,null,null,18,36,40,null,{"$f":"INT(AQ5/3600)","v":5},{"$f":"INT((AQ5-AA5*3600)/60)","v":51},{"$f":"AQ5-(AA5*3600+AB5*60)","v":40},null,{"$f":"+AT5","v":16},null,{"$f":"INT(AR5/3600)","v":5},{"$f":"INT((AR5-AG5*3600)/60)","v":27},{"$f":"AR5-(AG5*3600+AH5*60)","v":3},null,{"$f":"+AW5","v":18},null,{"$f":"(P5+O5*60+N5*3600)-(M5+L5*60+K5*3600)","v":0},{"$f":"(V5+U5*60+T5*3600)-(S5+R5*60+Q5*3600)","v":0},{"$f":"AM5+AN5","v":0},{"$f":"(Y5+X5*60+W5*3600)-(J5+I5*60+H5*3600)","v":21100},{"$f":"ABS(AP5-AO5)","v":21100},{"$f":"AQ5*(0.01*(100+E5))","v":19623},{"$f":"+IF(F5=\"\",AQ5,500000)","v":21100},16,{"$f":"+IF(AT5<4,\"Trophy\",\"\")","v":""},{"$f":"+IF(F5=\"\",AR5,500000)","v":19623},18,{"$f":"+IF(AW5<4,\"Trophy\",\"\")","v":""}]
[25,"Melody","M Wells",26,-11,null,"B",11,15,0,null,null,null,null,null,null,null,null,null,null,null,null,17,26,10,null,6,11,10,null,20,null,5,30,20.299999999999272,null,22,null,0,0,0,22270,22270,19820.3,22270,20,"",19820.3,22,""]
[52,"Maidie","M Barnes",43,10,"DNF","A",14,30,0,null,null,null,null,null,null,null,null,null,null,null,null,null,null,null,null,14,30,0,null,"DNF",null,15,57,0,null,"DNF",null,0,0,0,-52200,52200,57420.000000000007,500000,"DNF","",500000,"DNF",""]
[79,"Daisy","T Ford",22,-25,null,"C",10,0,0,null,null,null,null,null,null,null,null,null,null,null,null,18,10,26,null,8,10,26,null,24,null,6,7,49.5,null,25,null,0,0,0,29426,29426,22069.5,29426,24,"",22069.5,25,""]
[87,"Modwena","M Cassidy",24.11,-19,null,"C",10,45,0,null,null,null,null,null,null,null,null,null,null,null,null,17,23,12,null,6,38,12,null,22,null,5,22,32.520000000000437,null,15,null,0,0,0,23892,23892,19352.52,23892,22,"",19352.52,15,""]
[141,"Nirvana"," M Claridge",20,-23,"DNS","C",null,null,null,null,null,null,null,null,null,null,null,null,null,null,null,null,null,null,null,0,0,0,null,"DNS",null,0,0,0,null,"DNS",null,0,0,0,0,0,0,500000,"DNS","",500000,"DNS",""]
[149,"Stella Genesta","M Burwood",30,-19,null,"A",11,0,0,null,null,null,null,null,null,null,null,null,null,null,null,17,47,44,null,{"$f":"INT(AQ11/3600)","v":6},{"$f":"INT((AQ11-AA11*3600)/60)","v":47},{"$f":"AQ11-(AA11*3600+AB11*60)","v":44},null,{"$f":"+AT11","v":23},null,{"$f":"INT(AR11/3600)","v":5},{"$f":"INT((AR11-AG11*3600)/60)","v":30},{"$f":"AR11-(AG11*3600+AH11*60)","v":15.840000000000146},null,{"$f":"+AW11","v":21},null,{"$f":"(P11+O11*60+N11*3600)-(M11+L11*60+K11*3600)","v":0},{"$f":"(V11+U11*60+T11*3600)-(S11+R11*60+Q11*3600)","v":0},{"$f":"AM11+AN11","v":0},{"$f":"(Y11+X11*60+W11*3600)-(J11+I11*60+H11*3600)","v":24464},{"$f":"ABS(AP11-AO11)","v":24464},{"$f":"AQ11*(0.01*(100+E11))","v":19815.84},{"$f":"+IF(F11=\"\",AQ11,500000)","v":24464},23,{"$f":"+IF(AT11<4,\"Trophy\",\"\")","v":""},{"$f":"+IF(F11=\"\",AR11,500000)","v":19815.84},21,{"$f":"+IF(AW11<4,\"Trophy\",\"\")","v":""}]
[179,"Waxwing","R & S Clayton",27,-8,null,"B",12,15,0,null,null,null,null,null,null,null,null,null,null,null,null,17,58,46,null,5,43,46,null,13,null,5,16,15.920000000001892,null,11,null,0,0,0,20626,20626,18975.920000000002,20626,{"$f":"IF(F12=\"\",+RANK(AS12,$AS$3:$AS$39,1),+F12)","v":13},"",18975.920000000002,{"$f":"IF(F12=\"\",+RANK(AV12,$AV$3:$AV$39,1),+F12)","v":11},""]
[199,"Morning Calm","W Clark",26,-9,null,"B",11,30,0,null,null,null,null,null,null,null,null,null,null,null,null,17,0,39,null,5,30,39,null,8,null,5,0,53.490000000001601,null,6,null,0,0,0,19839,19839,18053.490000000002,19839,8,"",18053.490000000002,6,""]
[216,"Tamara","N Heath",24.8,-16,"P","C",10,45,0,null,null,null,null,null,null,null,null,null,null,null,null,16,58,14,null,{"$f":"INT(AQ14/3600)","v":6},{"$f":"INT((AQ14-AA14*3600)/60)","v":13},{"$f":"AQ14-(AA14*3600+AB14*60)","v":14},null,{"$f":"+AT14","v":"P"},null,{"$f":"INT(AR14/3600)","v":5},{"$f":"INT((AR14-AG14*3600)/60)","v":13},{"$f":"AR14-(AG14*3600+AH14*60)","v":30.959999999999127},null,{"$f":"+AW14","v":"P"},null,{"$f":"(P14+O14*60+N14*3600)-(M14+L14*60+K14*3600)","v":0},{"$f":"(V14+U14*60+T14*3600)-(S14+R14*60+Q14*3600)","v":0},{"$f":"AM14+AN14","v":0},{"$f":"(Y14+X14*60+W14*3600)-(J14+I14*60+H14*3600)","v":22394},{"$f":"ABS(AP14-AO14)","v":22394},{"$f":"AQ14*(0.01*(100+E14))","v":18810.96},{"$f":"+IF(F14=\"\",AQ14,500000)","v":500000},{"$f":"IF(F14=\"\",+RANK(AS14,$AS$3:$AS$39,1),+F14)","v":"P"},{"$f":"+IF(AT14<4,\"Trophy\",\"\")","v":""},{"$f":"+IF(F14=\"\",AR14,500000)","v":500000},{"$f":"IF(F14=\"\",+RANK(AV14,$AV$3:$AV$39,1),+F14)","v":"P"},{"$f":"+IF(AW14<4,\"Trophy\",\"\")","v":""}]
[217,"Melinda","P Howes",27.11,1,null,"B",13,0,0,null,null,null,null,null,null,null,null,null,null,null,null,17,50,38,null,4,50,38,null,5,null,4,53,32.380000000001019,null,4,null,0,0,0,17438,17438,17612.38,17438,{"$f":"IF(F15=\"\",+RANK(AS15,$AS$3:$AS$39,1),+F15)","v":5},"",17612.38,{"$f":"IF(F15=\"\",+RANK(AV15,$AV$3:$AV$39,1),+F15)","v":4},""]
[218,"Mystery","M Ford",26,-7,"RTD","B",13,45,0,null,null,null,null,null,null,null,null,null,null,null,null,null,null,null,null,13,45,0,null,"RTD",null,12,47,15,null,"RTD",null,0,0,0,-49500,49500,46035,500000,"RTD","",500000,"RTD",""]
[224,"Anna","R Branscombe",25,-10,null,"B",12,30,0,null,null,null,null,null,null,null,null,null,null,null,null,18,34,5,null,6,4,5,null,19,null,5,27,40.5,null,19,null,0,0,0,21845,21845,19660.5,21845,19,"",19660.5,19,""]
[240,"Avocet","R  Branford",28,-16,null,"B",12,30,0,null,null,null,null,null,null,null,null,null,null,null,null,18,45,50,null,6,15,50,null,21,null,5,15,42,null,10,null,0,0,0,22550,22550,18942,22550,21,"",18942,10,""]
[250,"Storm","M Thwaites",35,16,null,"A",13,0,0,null,null,null,null,null,null,null,null,null,null,null,null,17,13,56,null,{"$f":"INT(AQ19/3600)","v":4},{"$f":"INT((AQ19-AA19*3600)/60)","v":13},{"$f":"AQ19-(AA19*3600+AB19*60)","v":56},null,{"$f":"+AT19","v":2},null,{"$f":"INT(AR19/3600)","v":4},{"$f":"INT((AR19-AG19*3600)/60)","v":54},{"$f":"AR19-(AG19*3600+AH19*60)","v":33.759999999998399},null,{"$f":"+AW19","v":5},null,{"$f":"(P19+O19*60+N19*3600)-(M19+L19*60+K19*3600)","v":0},{"$f":"(V19+U19*60+T19*3600)-(S19+R19*60+Q19*3600)","v":0},{"$f":"AM19+AN19","v":0},{"$f":"(Y19+X19*60+W19*3600)-(J19+I19*60+H19*3600)","v":15236},{"$f":"ABS(AP19-AO19)","v":15236},{"$f":"AQ19*(0.01*(100+E19))","v":17673.759999999998},{"$f":"+IF(F19=\"\",AQ19,500000)","v":15236},2,{"$f":"+IF(AT19<4,\"Trophy\",\"\")","v":"Trophy"},{"$f":"+IF(F19=\"\",AR19,500000)","v":17673.759999999998},5,{"$f":"+IF(AW19<4,\"Trophy\",\"\")","v":""}]
[262,"Jessie May","C Dugdale",27.11,-5,null,"B",12,30,0,null,null,null,null,null,null,null,null,null,null,null,null,18,5,24,null,5,35,24,null,10,null,5,18,37.80000000000291,null,13,null,0,0,0,20124,20124,19117.800000000003,20124,10,"",19117.800000000003,13,""]
[274,"Elfin","A Bond",20,-27,null,"C",10,0,0,null,null,null,null,null,null,null,null,null,null,null,null,18,16,55,null,8,16,55,null,25,null,6,2,44.950000000000728,null,24,null,0,0,0,29815,29815,21764.95,29815,25,"",21764.95,24,""]
[323,"Starlight Lady","N Matthews",30,13,null,"A",12,45,0,null,null,null,null,null,null,null,null,null,null,null,null,17,29,29,null,4,44,29,null,3,null,5,21,27.970000000001164,null,14,null,0,0,0,17069,17069,19287.97,17069,3,"Trophy",19287.97,14,""]
[368,"Wandering Rose"," D Radley",31.6,-2,null,"A",11,15,0,null,null,null,null,null,null,null,null,null,null,null,null,16,47,52,null,5,32,52,null,9,null,5,26,12.56000000000131,null,17,null,0,0,0,19972,19972,19572.560000000001,19972,9,"",19572.560000000001,17,""]
[369,"Moonshadow","N Hovey",31.6,5,"","A",12,45,0,null,null,null,null,null,null,null,null,null,null,null,null,17,31,36,null,4,46,36,null,4,null,5,0,55.799999999999272,null,7,null,0,0,0,17196,17196,18055.8,17196,4,"",18055.8,7,""]
[370,"Glory","C Brown",35,-6,"","A",13,0,0,null,null,null,null,null,null,null,null,null,null,null,null,18,45,46,null,5,45,46,null,14,null,5,25,1.2400000000016007,null,16,null,0,0,0,20746,20746,19501.240000000002,20746,14,"",19501.240000000002,16,""]
[375,"Amaryllis","C Tuckett",21.4,-10,null,"C",12,15,0,null,null,null,null,null,null,null,null,null,null,null,null,17,53,29,null,{"$f":"INT(AQ26/3600)","v":5},{"$f":"INT((AQ26-AA26*3600)/60)","v":38},{"$f":"AQ26-(AA26*3600+AB26*60)","v":29},null,{"$f":"+AT26","v":11},null,{"$f":"INT(AR26/3600)","v":5},{"$f":"INT((AR26-AG26*3600)/60)","v":4},{"$f":"AR26-(AG26*3600+AH26*60)","v":38.100000000002183},null,{"$f":"+AW26","v":8},null,{"$f":"(P26+O26*60+N26*3600)-(M26+L26*60+K26*3600)","v":0},{"$f":"(V26+U26*60+T26*3600)-(S26+R26*60+Q26*3600)","v":0},{"$f":"AM26+AN26","v":0},{"$f":"(Y26+X26*60+W26*3600)-(J26+I26*60+H26*3600)","v":20309},{"$f":"ABS(AP26-AO26)","v":20309},{"$f":"AQ26*(0.01*(100+E26))","v":18278.100000000002},{"$f":"+IF(F26=\"\",AQ26,500000)","v":20309},11,{"$f":"+IF(AT26<4,\"Trophy\",\"\")","v":""},{"$f":"+IF(F26=\"\",AR26,500000)","v":18278.100000000002},8,{"$f":"+IF(AW26<4,\"Trophy\",\"\")","v":""}]
[400,"Swallow","K Halifax",26,-7,"","B",12,15,0,null,null,null,null,null,null,null,null,null,null,null,null,18,14,53,null,5,59,53,null,17,null,5,34,41.490000000001601,null,23,null,0,0,0,21593,21593,20081.490000000002,21593,17,"",20081.490000000002,23,""]
[403,"May","K Rhead",30,-10,"DNF","A",12,45,0,null,null,null,null,null,null,null,null,null,null,null,null,null,null,null,null,{"$f":"INT(AQ28/3600)","v":12},{"$f":"INT((AQ28-AA28*3600)/60)","v":45},{"$f":"AQ28-(AA28*3600+AB28*60)","v":0},null,{"$f":"+AT28","v":"DNF"},null,{"$f":"INT(AR28/3600)","v":11},{"$f":"INT((AR28-AG28*3600)/60)","v":28},{"$f":"AR28-(AG28*3600+AH28*60)","v":30},null,{"$f":"+AW28","v":"DNF"},null,{"$f":"(P28+O28*60+N28*3600)-(M28+L28*60+K28*3600)","v":0},{"$f":"(V28+U28*60+T28*3600)-(S28+R28*60+Q28*3600)","v":0},{"$f":"AM28+AN28","v":0},{"$f":"(Y28+X28*60+W28*3600)-(J28+I28*60+H28*3600)","v":-45900},{"$f":"ABS(AP28-AO28)","v":45900},{"$f":"AQ28*(0.01*(100+E28))","v":41310},{"$f":"+IF(F28=\"\",AQ28,500000)","v":500000},"DNF",{"$f":"+IF(AT28<4,\"Trophy\",\"\")","v":""},{"$f":"+IF(F28=\"\",AR28,500000)","v":500000},"DNF",{"$f":"+IF(AW28<4,\"Trophy\",\"\")","v":""}]
[416,"Alice Rose","T Riches",28.6,-7,null,"A",11,0,0,null,null,null,null,null,null,null,null,null,null,null,null,16,41,22,null,5,41,22,null,12,null,5,17,28.260000000002037,null,12,null,0,0,0,20482,20482,19048.260000000002,20482,12,"",19048.260000000002,12,""]
[417,"Stellar","T Frary",31.4,17,null,"A",14,0,0,null,null,null,null,null,null,null,null,null,null,null,null,17,53,34,null,3,53,34,null,1,null,4,33,16.379999999997381,null,1,null,0,0,0,14014,14014,16396.379999999997,14014,1,"Trophy",16396.379999999997,1,"Trophy"]
[418,"Tinkerbell","A Lincoln",25.2,-8,"","B",11,45,0,null,null,null,null,null,null,null,null,null,null,null,null,17,1,18,null,5,16,18,null,7,null,4,50,59.760000000002037,null,3,null,0,0,0,18978,18978,17459.760000000002,18978,7,"",17459.760000000002,3,"Trophy"]
[420,"Lyra","P Carrington",30,16,"DNS","A",null,null,null,null,null,null,null,null,null,null,null,null,null,null,null,null,null,null,null,{"$f":"INT(AQ32/3600)","v":0},{"$f":"INT((AQ32-AA32*3600)/60)","v":0},{"$f":"AQ32-(AA32*3600+AB32*60)","v":0},null,{"$f":"+AT32","v":"DNS"},null,{"$f":"INT(AR32/3600)","v":0},{"$f":"INT((AR32-AG32*3600)/60)","v":0},{"$f":"AR32-(AG32*3600+AH32*60)","v":0},null,{"$f":"+AW32","v":"DNS"},null,{"$f":"(P32+O32*60+N32*3600)-(M32+L32*60+K32*3600)","v":0},{"$f":"(V32+U32*60+T32*3600)-(S32+R32*60+Q32*3600)","v":0},{"$f":"AM32+AN32","v":0},{"$f":"(Y32+X32*60+W32*3600)-(J32+I32*60+H32*3600)","v":0},{"$f":"ABS(AP32-AO32)","v":0},{"$f":"AQ32*(0.01*(100+E32))","v":0},{"$f":"+IF(F32=\"\",AQ32,500000)","v":500000},"DNS",{"$f":"+IF(AT32<4,\"Trophy\",\"\")","v":""},{"$f":"+IF(F32=\"\",AR32,500000)","v":500000},"DNS",{"$f":"+IF(AW32<4,\"Trophy\",\"\")","v":""}]
[429,"Pickle","P Montague",22.6,-16,null,"C",11,45,0,null,null,null,null,null,null,null,null,null,null,null,null,17,30,55,null,5,45,55,null,15,null,4,50,34.200000000000728,null,2,null,0,0,0,20755,20755,17434.2,20755,15,"",17434.2,2,"Trophy"]
[]
[]
[]
[]
[]
[]
["xx"]
[]
[{"$f":"COUNT(A3:A41)","v":31}]

{"sheet":"YNR","index":1,"n_rows":40,"n_cols":14,"rows_kept":40,"cut":false,"hidden":false,"merged":[]}
[null,null,null,null,null,null,null,null,"Corrected",null,null,null,null,"YNR POSITION"]
["No","Yacht","Skipper","Length","H/C","P","Class","H","M","S",null,"Pos"]
[10,{"$f":"+VLOOKUP(+$A3,'Data Input'!$A$3:$AX$39,2,FALSE)","v":"Flight"},{"$f":"+VLOOKUP(+$A3,'Data Input'!$A$3:$AX$39,3,FALSE)","v":"J Farrow"},{"$f":"+VLOOKUP(+$A3,'Data Input'!$A$3:$AX$39,4,FALSE)","v":29.11},{"$f":"+VLOOKUP(+$A3,'Data Input'!$A$3:$AX$39,5,FALSE)","v":-9},{"$f":"+VLOOKUP(+$A3,'Data Input'!$A$3:$AX$39,6,FALSE)","v":0},{"$f":"+VLOOKUP(+$A3,'Data Input'!$A$3:$AX$39,7,FALSE)","v":"A"},{"$f":"+VLOOKUP($A3,'Data Input'!$A$3:$AX$39,33,FALSE)","v":5},{"$f":"+VLOOKUP($A3,'Data Input'!$A$3:$AX$39,34,FALSE)","v":28},{"$f":"+VLOOKUP($A3,'Data Input'!$A$3:$AX$39,35,FALSE)","v":25.139999999999418},null,{"$f":"+VLOOKUP($A3,'Data Input'!$A$3:$AX$39,37,FALSE)","v":20}]
[22,{"$f":"+VLOOKUP(+$A4,'Data Input'!$A$3:$AX$39,2,FALSE)","v":"Moonraker"},{"$f":"+VLOOKUP(+$A4,'Data Input'!$A$3:$AX$39,3,FALSE)","v":"P Jeckells"},{"$f":"+VLOOKUP(+$A4,'Data Input'!$A$3:$AX$39,4,FALSE)","v":29.6},{"$f":"+VLOOKUP(+$A4,'Data Input'!$A$3:$AX$39,5,FALSE)","v":2},{"$f":"+VLOOKUP(+$A4,'Data Input'!$A$3:$AX$39,6,FALSE)","v":0},{"$f":"+VLOOKUP(+$A4,'Data Input'!$A$3:$AX$39,7,FALSE)","v":"A"},{"$f":"+VLOOKUP($A4,'Data Input'!$A$3:$AX$39,33,FALSE)","v":5},{"$f":"+VLOOKUP($A4,'Data Input'!$A$3:$AX$39,34,FALSE)","v":13},{"$f":"+VLOOKUP($A4,'Data Input'!$A$3:$AX$39,35,FALSE)","v":44.099999999998545},null,{"$f":"+VLOOKUP($A4,'Data Input'!$A$3:$AX$39,37,FALSE)","v":9}]
[24,{"$f":"+VLOOKUP(+$A5,'Data Input'!$A$3:$AX$39,2,FALSE)","v":"Pippa"},{"$f":"+VLOOKUP(+$A5,'Data Input'!$A$3:$AX$39,3,FALSE)","v":"G Angel"},{"$f":"+VLOOKUP(+$A5,'Data Input'!$A$3:$AX$39,4,FALSE)","v":27.1},{"$f":"+VLOOKUP(+$A5,'Data Input'!$A$3:$AX$39,5,FALSE)","v":-7},{"$f":"+VLOOKUP(+$A5,'Data Input'!$A$3:$AX$39,6,FALSE)","v":0},{"$f":"+VLOOKUP(+$A5,'Data Input'!$A$3:$AX$39,7,FALSE)","v":"B"},{"$f":"+VLOOKUP($A5,'Data Input'!$A$3:$AX$39,33,FALSE)","v":5},{"$f":"+VLOOKUP($A5,'Data Input'!$A$3:$AX$39,34,FALSE)","v":27},{"$f":"+VLOOKUP($A5,'Data Input'!$A$3:$AX$39,35,FALSE)","v":3},null,{"$f":"+VLOOKUP($A5,'Data Input'!$A$3:$AX$39,37,FALSE)","v":18}]
[25,{"$f":"+VLOOKUP(+$A6,'Data Input'!$A$3:$AX$39,2,FALSE)","v":"Melody"},{"$f":"+VLOOKUP(+$A6,'Data Input'!$A$3:$AX$39,3,FALSE)","v":"M Wells"},{"$f":"+VLOOKUP(+$A6,'Data Input'!$A$3:$AX$39,4,FALSE)","v":26},{"$f":"+VLOOKUP(+$A6,'Data Input'!$A$3:$AX$39,5,FALSE)","v":-11},{"$f":"+VLOOKUP(+$A6,'Data Input'!$A$3:$AX$39,6,FALSE)","v":0},{"$f":"+VLOOKUP(+$A6,'Data Input'!$A$3:$AX$39,7,FALSE)","v":"B"},{"$f":"+VLOOKUP($A6,'Data Input'!$A$3:$AX$39,33,FALSE)","v":5},{"$f":"+VLOOKUP($A6,'Data Input'!$A$3:$AX$39,34,FALSE)","v":30},{"$f":"+VLOOKUP($A6,'Data Input'!$A$3:$AX$39,35,FALSE)","v":20.299999999999272},null,{"$f":"+VLOOKUP($A6,'Data Input'!$A$3:$AX$39,37,FALSE)","v":22}]
[52,{"$f":"+VLOOKUP(+$A7,'Data Input'!$A$3:$AX$39,2,FALSE)","v":"Maidie"},{"$f":"+VLOOKUP(+$A7,'Data Input'!$A$3:$AX$39,3,FALSE)","v":"M Barnes"},{"$f":"+VLOOKUP(+$A7,'Data Input'!$A$3:$AX$39,4,FALSE)","v":43},{"$f":"+VLOOKUP(+$A7,'Data Input'!$A$3:$AX$39,5,FALSE)","v":10},{"$f":"+VLOOKUP(+$A7,'Data Input'!$A$3:$AX$39,6,FALSE)","v":"DNF"},{"$f":"+VLOOKUP(+$A7,'Data Input'!$A$3:$AX$39,7,FALSE)","v":"A"},{"$f":"+VLOOKUP($A7,'Data Input'!$A$3:$AX$39,33,FALSE)","v":15},{"$f":"+VLOOKUP($A7,'Data Input'!$A$3:$AX$39,34,FALSE)","v":57},{"$f":"+VLOOKUP($A7,'Data Input'!$A$3:$AX$39,35,FALSE)","v":0},null,{"$f":"+VLOOKUP($A7,'Data Input'!$A$3:$AX$39,37,FALSE)","v":"DNF"}]
[79,{"$f":"+VLOOKUP(+$A8,'Data Input'!$A$3:$AX$39,2,FALSE)","v":"Daisy"},{"$f":"+VLOOKUP(+$A8,'Data Input'!$A$3:$AX$39,3,FALSE)","v":"T Ford"},{"$f":"+VLOOKUP(+$A8,'Data Input'!$A$3:$AX$39,4,FALSE)","v":22},{"$f":"+VLOOKUP(+$A8,'Data Input'!$A$3:$AX$39,5,FALSE)","v":-25},{"$f":"+VLOOKUP(+$A8,'Data Input'!$A$3:$AX$39,6,FALSE)","v":0},{"$f":"+VLOOKUP(+$A8,'Data Input'!$A$3:$AX$39,7,FALSE)","v":"C"},{"$f":"+VLOOKUP($A8,'Data Input'!$A$3:$AX$39,33,FALSE)","v":6},{"$f":"+VLOOKUP($A8,'Data Input'!$A$3:$AX$39,34,FALSE)","v":7},{"$f":"+VLOOKUP($A8,'Data Input'!$A$3:$AX$39,35,FALSE)","v":49.5},null,{"$f":"+VLOOKUP($A8,'Data Input'!$A$3:$AX$39,37,FALSE)","v":25}]
[87,{"$f":"+VLOOKUP(+$A9,'Data Input'!$A$3:$AX$39,2,FALSE)","v":"Modwena"},{"$f":"+VLOOKUP(+$A9,'Data Input'!$A$3:$AX$39,3,FALSE)","v":"M Cassidy"},{"$f":"+VLOOKUP(+$A9,'Data Input'!$A$3:$AX$39,4,FALSE)","v":24.11},{"$f":"+VLOOKUP(+$A9,'Data Input'!$A$3:$AX$39,5,FALSE)","v":-19},{"$f":"+VLOOKUP(+$A9,'Data Input'!$A$3:$AX$39,6,FALSE)","v":0},{"$f":"+VLOOKUP(+$A9,'Data Input'!$A$3:$AX$39,7,FALSE)","v":"C"},{"$f":"+VLOOKUP($A9,'Data Input'!$A$3:$AX$39,33,FALSE)","v":5},{"$f":"+VLOOKUP($A9,'Data Input'!$A$3:$AX$39,34,FALSE)","v":22},{"$f":"+VLOOKUP($A9,'Data Input'!$A$3:$AX$39,35,FALSE)","v":32.520000000000437},null,{"$f":"+VLOOKUP($A9,'Data Input'!$A$3:$AX$39,37,FALSE)","v":15}]
[141,{"$f":"+VLOOKUP(+$A10,'Data Input'!$A$3:$AX$39,2,FALSE)","v":"Nirvana"},{"$f":"+VLOOKUP(+$A10,'Data Input'!$A$3:$AX$39,3,FALSE)","v":" M Claridge"},{"$f":"+VLOOKUP(+$A10,'Data Input'!$A$3:$AX$39,4,FALSE)","v":20},{"$f":"+VLOOKUP(+$A10,'Data Input'!$A$3:$AX$39,5,FALSE)","v":-23},{"$f":"+VLOOKUP(+$A10,'Data Input'!$A$3:$AX$39,6,FALSE)","v":"DNS"},{"$f":"+VLOOKUP(+$A10,'Data Input'!$A$3:$AX$39,7,FALSE)","v":"C"},{"$f":"+VLOOKUP($A10,'Data Input'!$A$3:$AX$39,33,FALSE)","v":0},{"$f":"+VLOOKUP($A10,'Data Input'!$A$3:$AX$39,34,FALSE)","v":0},{"$f":"+VLOOKUP($A10,'Data Input'!$A$3:$AX$39,35,FALSE)","v":0},null,{"$f":"+VLOOKUP($A10,'Data Input'!$A$3:$AX$39,37,FALSE)","v":"DNS"}]
[149,{"$f":"+VLOOKUP(+$A11,'Data Input'!$A$3:$AX$39,2,FALSE)","v":"Stella Genesta"},{"$f":"+VLOOKUP(+$A11,'Data Input'!$A$3:$AX$39,3,FALSE)","v":"M Burwood"},{"$f":"+VLOOKUP(+$A11,'Data Input'!$A$3:$AX$39,4,FALSE)","v":30},{"$f":"+VLOOKUP(+$A11,'Data Input'!$A$3:$AX$39,5,FALSE)","v":-19},{"$f":"+VLOOKUP(+$A11,'Data Input'!$A$3:$AX$39,6,FALSE)","v":0},{"$f":"+VLOOKUP(+$A11,'Data Input'!$A$3:$AX$39,7,FALSE)","v":"A"},{"$f":"+VLOOKUP($A11,'Data Input'!$A$3:$AX$39,33,FALSE)","v":5},{"$f":"+VLOOKUP($A11,'Data Input'!$A$3:$AX$39,34,FALSE)","v":30},{"$f":"+VLOOKUP($A11,'Data Input'!$A$3:$AX$39,35,FALSE)","v":15.840000000000146},null,{"$f":"+VLOOKUP($A11,'Data Input'!$A$3:$AX$39,37,FALSE)","v":21}]
[179,{"$f":"+VLOOKUP(+$A12,'Data Input'!$A$3:$AX$39,2,FALSE)","v":"Waxwing"},{"$f":"+VLOOKUP(+$A12,'Data Input'!$A$3:$AX$39,3,FALSE)","v":"R & S Clayton"},{"$f":"+VLOOKUP(+$A12,'Data Input'!$A$3:$AX$39,4,FALSE)","v":27},{"$f":"+VLOOKUP(+$A12,'Data Input'!$A$3:$AX$39,5,FALSE)","v":-8},{"$f":"+VLOOKUP(+$A12,'Data Input'!$A$3:$AX$39,6,FALSE)","v":0},{"$f":"+VLOOKUP(+$A12,'Data Input'!$A$3:$AX$39,7,FALSE)","v":"B"},{"$f":"+VLOOKUP($A12,'Data Input'!$A$3:$AX$39,33,FALSE)","v":5},{"$f":"+VLOOKUP($A12,'Data Input'!$A$3:$AX$39,34,FALSE)","v":16},{"$f":"+VLOOKUP($A12,'Data Input'!$A$3:$AX$39,35,FALSE)","v":15.920000000001892},null,{"$f":"+VLOOKUP($A12,'Data Input'!$A$3:$AX$39,37,FALSE)","v":11}]
[199,{"$f":"+VLOOKUP(+$A13,'Data Input'!$A$3:$AX$39,2,FALSE)","v":"Morning Calm"},{"$f":"+VLOOKUP(+$A13,'Data Input'!$A$3:$AX$39,3,FALSE)","v":"W Clark"},{"$f":"+VLOOKUP(+$A13,'Data Input'!$A$3:$AX$39,4,FALSE)","v":26},{"$f":"+VLOOKUP(+$A13,'Data Input'!$A$3:$AX$39,5,FALSE)","v":-9},{"$f":"+VLOOKUP(+$A13,'Data Input'!$A$3:$AX$39,6,FALSE)","v":0},{"$f":"+VLOOKUP(+$A13,'Data Input'!$A$3:$AX$39,7,FALSE)","v":"B"},{"$f":"+VLOOKUP($A13,'Data Input'!$A$3:$AX$39,33,FALSE)","v":5},{"$f":"+VLOOKUP($A13,'Data Input'!$A$3:$AX$39,34,FALSE)","v":0},{"$f":"+VLOOKUP($A13,'Data Input'!$A$3:$AX$39,35,FALSE)","v":53.490000000001601},null,{"$f":"+VLOOKUP($A13,'Data Input'!$A$3:$AX$39,37,FALSE)","v":6}]
[216,{"$f":"+VLOOKUP(+$A14,'Data Input'!$A$3:$AX$39,2,FALSE)","v":"Tamara"},{"$f":"+VLOOKUP(+$A14,'Data Input'!$A$3:$AX$39,3,FALSE)","v":"N Heath"},{"$f":"+VLOOKUP(+$A14,'Data Input'!$A$3:$AX$39,4,FALSE)","v":24.8},{"$f":"+VLOOKUP(+$A14,'Data Input'!$A$3:$AX$39,5,FALSE)","v":-16},{"$f":"+VLOOKUP(+$A14,'Data Input'!$A$3:$AX$39,6,FALSE)","v":"P"},{"$f":"+VLOOKUP(+$A14,'Data Input'!$A$3:$AX$39,7,FALSE)","v":"C"},{"$f":"+VLOOKUP($A14,'Data Input'!$A$3:$AX$39,33,FALSE)","v":5},{"$f":"+VLOOKUP($A14,'Data Input'!$A$3:$AX$39,34,FALSE)","v":13},{"$f":"+VLOOKUP($A14,'Data Input'!$A$3:$AX$39,35,FALSE)","v":30.959999999999127},null,{"$f":"+VLOOKUP($A14,'Data Input'!$A$3:$AX$39,37,FALSE)","v":"P"}]
[217,{"$f":"+VLOOKUP(+$A15,'Data Input'!$A$3:$AX$39,2,FALSE)","v":"Melinda"},{"$f":"+VLOOKUP(+$A15,'Data Input'!$A$3:$AX$39,3,FALSE)","v":"P Howes"},{"$f":"+VLOOKUP(+$A15,'Data Input'!$A$3:$AX$39,4,FALSE)","v":27.11},{"$f":"+VLOOKUP(+$A15,'Data Input'!$A$3:$AX$39,5,FALSE)","v":1},{"$f":"+VLOOKUP(+$A15,'Data Input'!$A$3:$AX$39,6,FALSE)","v":0},{"$f":"+VLOOKUP(+$A15,'Data Input'!$A$3:$AX$39,7,FALSE)","v":"B"},{"$f":"+VLOOKUP($A15,'Data Input'!$A$3:$AX$39,33,FALSE)","v":4},{"$f":"+VLOOKUP($A15,'Data Input'!$A$3:$AX$39,34,FALSE)","v":53},{"$f":"+VLOOKUP($A15,'Data Input'!$A$3:$AX$39,35,FALSE)","v":32.380000000001019},null,{"$f":"+VLOOKUP($A15,'Data Input'!$A$3:$AX$39,37,FALSE)","v":4}]
[218,{"$f":"+VLOOKUP(+$A16,'Data Input'!$A$3:$AX$39,2,FALSE)","v":"Mystery"},{"$f":"+VLOOKUP(+$A16,'Data Input'!$A$3:$AX$39,3,FALSE)","v":"M Ford"},{"$f":"+VLOOKUP(+$A16,'Data Input'!$A$3:$AX$39,4,FALSE)","v":26},{"$f":"+VLOOKUP(+$A16,'Data Input'!$A$3:$AX$39,5,FALSE)","v":-7},{"$f":"+VLOOKUP(+$A16,'Data Input'!$A$3:$AX$39,6,FALSE)","v":"RTD"},{"$f":"+VLOOKUP(+$A16,'Data Input'!$A$3:$AX$39,7,FALSE)","v":"B"},{"$f":"+VLOOKUP($A16,'Data Input'!$A$3:$AX$39,33,FALSE)","v":12},{"$f":"+VLOOKUP($A16,'Data Input'!$A$3:$AX$39,34,FALSE)","v":47},{"$f":"+VLOOKUP($A16,'Data Input'!$A$3:$AX$39,35,FALSE)","v":15},null,{"$f":"+VLOOKUP($A16,'Data Input'!$A$3:$AX$39,37,FALSE)","v":"RTD"}]
[224,{"$f":"+VLOOKUP(+$A17,'Data Input'!$A$3:$AX$39,2,FALSE)","v":"Anna"},{"$f":"+VLOOKUP(+$A17,'Data Input'!$A$3:$AX$39,3,FALSE)","v":"R Branscombe"},{"$f":"+VLOOKUP(+$A17,'Data Input'!$A$3:$AX$39,4,FALSE)","v":25},{"$f":"+VLOOKUP(+$A17,'Data Input'!$A$3:$AX$39,5,FALSE)","v":-10},{"$f":"+VLOOKUP(+$A17,'Data Input'!$A$3:$AX$39,6,FALSE)","v":0},{"$f":"+VLOOKUP(+$A17,'Data Input'!$A$3:$AX$39,7,FALSE)","v":"B"},{"$f":"+VLOOKUP($A17,'Data Input'!$A$3:$AX$39,33,FALSE)","v":5},{"$f":"+VLOOKUP($A17,'Data Input'!$A$3:$AX$39,34,FALSE)","v":27},{"$f":"+VLOOKUP($A17,'Data Input'!$A$3:$AX$39,35,FALSE)","v":40.5},null,{"$f":"+VLOOKUP($A17,'Data Input'!$A$3:$AX$39,37,FALSE)","v":19}]
[240,{"$f":"+VLOOKUP(+$A18,'Data Input'!$A$3:$AX$39,2,FALSE)","v":"Avocet"},{"$f":"+VLOOKUP(+$A18,'Data Input'!$A$3:$AX$39,3,FALSE)","v":"R  Branford"},{"$f":"+VLOOKUP(+$A18,'Data Input'!$A$3:$AX$39,4,FALSE)","v":28},{"$f":"+VLOOKUP(+$A18,'Data Input'!$A$3:$AX$39,5,FALSE)","v":-16},{"$f":"+VLOOKUP(+$A18,'Data Input'!$A$3:$AX$39,6,FALSE)","v":0},{"$f":"+VLOOKUP(+$A18,'Data Input'!$A$3:$AX$39,7,FALSE)","v":"B"},{"$f":"+VLOOKUP($A18,'Data Input'!$A$3:$AX$39,33,FALSE)","v":5},{"$f":"+VLOOKUP($A18,'Data Input'!$A$3:$AX$39,34,FALSE)","v":15},{"$f":"+VLOOKUP($A18,'Data Input'!$A$3:$AX$39,35,FALSE)","v":42},null,{"$f":"+VLOOKUP($A18,'Data Input'!$A$3:$AX$39,37,FALSE)","v":10}]
[250,{"$f":"+VLOOKUP(+$A19,'Data Input'!$A$3:$AX$39,2,FALSE)","v":"Storm"},{"$f":"+VLOOKUP(+$A19,'Data Input'!$A$3:$AX$39,3,FALSE)","v":"M Thwaites"},{"$f":"+VLOOKUP(+$A19,'Data Input'!$A$3:$AX$39,4,FALSE)","v":35},{"$f":"+VLOOKUP(+$A19,'Data Input'!$A$3:$AX$39,5,FALSE)","v":16},{"$f":"+VLOOKUP(+$A19,'Data Input'!$A$3:$AX$39,6,FALSE)","v":0},{"$f":"+VLOOKUP(+$A19,'Data Input'!$A$3:$AX$39,7,FALSE)","v":"A"},{"$f":"+VLOOKUP($A19,'Data Input'!$A$3:$AX$39,33,FALSE)","v":4},{"$f":"+VLOOKUP($A19,'Data Input'!$A$3:$AX$39,34,FALSE)","v":54},{"$f":"+VLOOKUP($A19,'Data Input'!$A$3:$AX$39,35,FALSE)","v":33.759999999998399},null,{"$f":"+VLOOKUP($A19,'Data Input'!$A$3:$AX$39,37,FALSE)","v":5}]
[262,{"$f":"+VLOOKUP(+$A20,'Data Input'!$A$3:$AX$39,2,FALSE)","v":"Jessie May"},{"$f":"+VLOOKUP(+$A20,'Data Input'!$A$3:$AX$39,3,FALSE)","v":"C Dugdale"},{"$f":"+VLOOKUP(+$A20,'Data Input'!$A$3:$AX$39,4,FALSE)","v":27.11},{"$f":"+VLOOKUP(+$A20,'Data Input'!$A$3:$AX$39,5,FALSE)","v":-5},{"$f":"+VLOOKUP(+$A20,'Data Input'!$A$3:$AX$39,6,FALSE)","v":0},{"$f":"+VLOOKUP(+$A20,'Data Input'!$A$3:$AX$39,7,FALSE)","v":"B"},{"$f":"+VLOOKUP($A20,'Data Input'!$A$3:$AX$39,33,FALSE)","v":5},{"$f":"+VLOOKUP($A20,'Data Input'!$A$3:$AX$39,34,FALSE)","v":18},{"$f":"+VLOOKUP($A20,'Data Input'!$A$3:$AX$39,35,FALSE)","v":37.80000000000291},null,{"$f":"+VLOOKUP($A20,'Data Input'!$A$3:$AX$39,37,FALSE)","v":13}]
[274,{"$f":"+VLOOKUP(+$A21,'Data Input'!$A$3:$AX$39,2,FALSE)","v":"Elfin"},{"$f":"+VLOOKUP(+$A21,'Data Input'!$A$3:$AX$39,3,FALSE)","v":"A Bond"},{"$f":"+VLOOKUP(+$A21,'Data Input'!$A$3:$AX$39,4,FALSE)","v":20},{"$f":"+VLOOKUP(+$A21,'Data Input'!$A$3:$AX$39,5,FALSE)","v":-27},{"$f":"+VLOOKUP(+$A21,'Data Input'!$A$3:$AX$39,6,FALSE)","v":0},{"$f":"+VLOOKUP(+$A21,'Data Input'!$A$3:$AX$39,7,FALSE)","v":"C"},{"$f":"+VLOOKUP($A21,'Data Input'!$A$3:$AX$39,33,FALSE)","v":6},{"$f":"+VLOOKUP($A21,'Data Input'!$A$3:$AX$39,34,FALSE)","v":2},{"$f":"+VLOOKUP($A21,'Data Input'!$A$3:$AX$39,35,FALSE)","v":44.950000000000728},null,{"$f":"+VLOOKUP($A21,'Data Input'!$A$3:$AX$39,37,FALSE)","v":24}]
[323,{"$f":"+VLOOKUP(+$A22,'Data Input'!$A$3:$AX$39,2,FALSE)","v":"Starlight Lady"},{"$f":"+VLOOKUP(+$A22,'Data Input'!$A$3:$AX$39,3,FALSE)","v":"N Matthews"},{"$f":"+VLOOKUP(+$A22,'Data Input'!$A$3:$AX$39,4,FALSE)","v":30},{"$f":"+VLOOKUP(+$A22,'Data Input'!$A$3:$AX$39,5,FALSE)","v":13},{"$f":"+VLOOKUP(+$A22,'Data Input'!$A$3:$AX$39,6,FALSE)","v":0},{"$f":"+VLOOKUP(+$A22,'Data Input'!$A$3:$AX$39,7,FALSE)","v":"A"},{"$f":"+VLOOKUP($A22,'Data Input'!$A$3:$AX$39,33,FALSE)","v":5},{"$f":"+VLOOKUP($A22,'Data Input'!$A$3:$AX$39,34,FALSE)","v":21},{"$f":"+VLOOKUP($A22,'Data Input'!$A$3:$AX$39,35,FALSE)","v":27.970000000001164},null,{"$f":"+VLOOKUP($A22,'Data Input'!$A$3:$AX$39,37,FALSE)","v":14}]
[368,{"$f":"+VLOOKUP(+$A23,'Data Input'!$A$3:$AX$39,2,FALSE)","v":"Wandering Rose"},{"$f":"+VLOOKUP(+$A23,'Data Input'!$A$3:$AX$39,3,FALSE)","v":" D Radley"},{"$f":"+VLOOKUP(+$A23,'Data Input'!$A$3:$AX$39,4,FALSE)","v":31.6},{"$f":"+VLOOKUP(+$A23,'Data Input'!$A$3:$AX$39,5,FALSE)","v":-2},{"$f":"+VLOOKUP(+$A23,'Data Input'!$A$3:$AX$39,6,FALSE)","v":0},{"$f":"+VLOOKUP(+$A23,'Data Input'!$A$3:$AX$39,7,FALSE)","v":"A"},{"$f":"+VLOOKUP($A23,'Data Input'!$A$3:$AX$39,33,FALSE)","v":5},{"$f":"+VLOOKUP($A23,'Data Input'!$A$3:$AX$39,34,FALSE)","v":26},{"$f":"+VLOOKUP($A23,'Data Input'!$A$3:$AX$39,35,FALSE)","v":12.56000000000131},null,{"$f":"+VLOOKUP($A23,'Data Input'!$A$3:$AX$39,37,FALSE)","v":17}]
[369,{"$f":"+VLOOKUP(+$A24,'Data Input'!$A$3:$AX$39,2,FALSE)","v":"Moonshadow"},{"$f":"+VLOOKUP(+$A24,'Data Input'!$A$3:$AX$39,3,FALSE)","v":"N Hovey"},{"$f":"+VLOOKUP(+$A24,'Data Input'!$A$3:$AX$39,4,FALSE)","v":31.6},{"$f":"+VLOOKUP(+$A24,'Data Input'!$A$3:$AX$39,5,FALSE)","v":5},{"$f":"+VLOOKUP(+$A24,'Data Input'!$A$3:$AX$39,6,FALSE)","v":""},{"$f":"+VLOOKUP(+$A24,'Data Input'!$A$3:$AX$39,7,FALSE)","v":"A"},{"$f":"+VLOOKUP($A24,'Data Input'!$A$3:$AX$39,33,FALSE)","v":5},{"$f":"+VLOOKUP($A24,'Data Input'!$A$3:$AX$39,34,FALSE)","v":0},{"$f":"+VLOOKUP($A24,'Data Input'!$A$3:$AX$39,35,FALSE)","v":55.799999999999272},null,{"$f":"+VLOOKUP($A24,'Data Input'!$A$3:$AX$39,37,FALSE)","v":7}]
[370,{"$f":"+VLOOKUP(+$A25,'Data Input'!$A$3:$AX$39,2,FALSE)","v":"Glory"},{"$f":"+VLOOKUP(+$A25,'Data Input'!$A$3:$AX$39,3,FALSE)","v":"C Brown"},{"$f":"+VLOOKUP(+$A25,'Data Input'!$A$3:$AX$39,4,FALSE)","v":35},{"$f":"+VLOOKUP(+$A25,'Data Input'!$A$3:$AX$39,5,FALSE)","v":-6},{"$f":"+VLOOKUP(+$A25,'Data Input'!$A$3:$AX$39,6,FALSE)","v":""},{"$f":"+VLOOKUP(+$A25,'Data Input'!$A$3:$AX$39,7,FALSE)","v":"A"},{"$f":"+VLOOKUP($A25,'Data Input'!$A$3:$AX$39,33,FALSE)","v":5},{"$f":"+VLOOKUP($A25,'Data Input'!$A$3:$AX$39,34,FALSE)","v":25},{"$f":"+VLOOKUP($A25,'Data Input'!$A$3:$AX$39,35,FALSE)","v":1.2400000000016007},null,{"$f":"+VLOOKUP($A25,'Data Input'!$A$3:$AX$39,37,FALSE)","v":16}]
[375,{"$f":"+VLOOKUP(+$A26,'Data Input'!$A$3:$AX$39,2,FALSE)","v":"Amaryllis"},{"$f":"+VLOOKUP(+$A26,'Data Input'!$A$3:$AX$39,3,FALSE)","v":"C Tuckett"},{"$f":"+VLOOKUP(+$A26,'Data Input'!$A$3:$AX$39,4,FALSE)","v":21.4},{"$f":"+VLOOKUP(+$A26,'Data Input'!$A$3:$AX$39,5,FALSE)","v":-10},{"$f":"+VLOOKUP(+$A26,'Data Input'!$A$3:$AX$39,6,FALSE)","v":0},{"$f":"+VLOOKUP(+$A26,'Data Input'!$A$3:$AX$39,7,FALSE)","v":"C"},{"$f":"+VLOOKUP($A26,'Data Input'!$A$3:$AX$39,33,FALSE)","v":5},{"$f":"+VLOOKUP($A26,'Data Input'!$A$3:$AX$39,34,FALSE)","v":4},{"$f":"+VLOOKUP($A26,'Data Input'!$A$3:$AX$39,35,FALSE)","v":38.100000000002183},null,{"$f":"+VLOOKUP($A26,'Data Input'!$A$3:$AX$39,37,FALSE)","v":8}]
[400,{"$f":"+VLOOKUP(+$A27,'Data Input'!$A$3:$AX$39,2,FALSE)","v":"Swallow"},{"$f":"+VLOOKUP(+$A27,'Data Input'!$A$3:$AX$39,3,FALSE)","v":"K Halifax"},{"$f":"+VLOOKUP(+$A27,'Data Input'!$A$3:$AX$39,4,FALSE)","v":26},{"$f":"+VLOOKUP(+$A27,'Data Input'!$A$3:$AX$39,5,FALSE)","v":-7},{"$f":"+VLOOKUP(+$A27,'Data Input'!$A$3:$AX$39,6,FALSE)","v":""},{"$f":"+VLOOKUP(+$A27,'Data Input'!$A$3:$AX$39,7,FALSE)","v":"B"},{"$f":"+VLOOKUP($A27,'Data Input'!$A$3:$AX$39,33,FALSE)","v":5},{"$f":"+VLOOKUP($A27,'Data Input'!$A$3:$AX$39,34,FALSE)","v":34},{"$f":"+VLOOKUP($A27,'Data Input'!$A$3:$AX$39,35,FALSE)","v":41.490000000001601},null,{"$f":"+VLOOKUP($A27,'Data Input'!$A$3:$AX$39,37,FALSE)","v":23}]
[403,{"$f":"+VLOOKUP(+$A28,'Data Input'!$A$3:$AX$39,2,FALSE)","v":"May"},{"$f":"+VLOOKUP(+$A28,'Data Input'!$A$3:$AX$39,3,FALSE)","v":"K Rhead"},{"$f":"+VLOOKUP(+$A28,'Data Input'!$A$3:$AX$39,4,FALSE)","v":30},{"$f":"+VLOOKUP(+$A28,'Data Input'!$A$3:$AX$39,5,FALSE)","v":-10},{"$f":"+VLOOKUP(+$A28,'Data Input'!$A$3:$AX$39,6,FALSE)","v":"DNF"},{"$f":"+VLOOKUP(+$A28,'Data Input'!$A$3:$AX$39,7,FALSE)","v":"A"},{"$f":"+VLOOKUP($A28,'Data Input'!$A$3:$AX$39,33,FALSE)","v":11},{"$f":"+VLOOKUP($A28,'Data Input'!$A$3:$AX$39,34,FALSE)","v":28},{"$f":"+VLOOKUP($A28,'Data Input'!$A$3:$AX$39,35,FALSE)","v":30},null,{"$f":"+VLOOKUP($A28,'Data Input'!$A$3:$AX$39,37,FALSE)","v":"DNF"}]
[416,{"$f":"+VLOOKUP(+$A29,'Data Input'!$A$3:$AX$39,2,FALSE)","v":"Alice Rose"},{"$f":"+VLOOKUP(+$A29,'Data Input'!$A$3:$AX$39,3,FALSE)","v":"T Riches"},{"$f":"+VLOOKUP(+$A29,'Data Input'!$A$3:$AX$39,4,FALSE)","v":28.6},{"$f":"+VLOOKUP(+$A29,'Data Input'!$A$3:$AX$39,5,FALSE)","v":-7},{"$f":"+VLOOKUP(+$A29,'Data Input'!$A$3:$AX$39,6,FALSE)","v":0},{"$f":"+VLOOKUP(+$A29,'Data Input'!$A$3:$AX$39,7,FALSE)","v":"A"},{"$f":"+VLOOKUP($A29,'Data Input'!$A$3:$AX$39,33,FALSE)","v":5},{"$f":"+VLOOKUP($A29,'Data Input'!$A$3:$AX$39,34,FALSE)","v":17},{"$f":"+VLOOKUP($A29,'Data Input'!$A$3:$AX$39,35,FALSE)","v":28.260000000002037},null,{"$f":"+VLOOKUP($A29,'Data Input'!$A$3:$AX$39,37,FALSE)","v":12}]
[417,{"$f":"+VLOOKUP(+$A30,'Data Input'!$A$3:$AX$39,2,FALSE)","v":"Stellar"},{"$f":"+VLOOKUP(+$A30,'Data Input'!$A$3:$AX$39,3,FALSE)","v":"T Frary"},{"$f":"+VLOOKUP(+$A30,'Data Input'!$A$3:$AX$39,4,FALSE)","v":31.4},{"$f":"+VLOOKUP(+$A30,'Data Input'!$A$3:$AX$39,5,FALSE)","v":17},{"$f":"+VLOOKUP(+$A30,'Data Input'!$A$3:$AX$39,6,FALSE)","v":0},{"$f":"+VLOOKUP(+$A30,'Data Input'!$A$3:$AX$39,7,FALSE)","v":"A"},{"$f":"+VLOOKUP($A30,'Data Input'!$A$3:$AX$39,33,FALSE)","v":4},{"$f":"+VLOOKUP($A30,'Data Input'!$A$3:$AX$39,34,FALSE)","v":33},{"$f":"+VLOOKUP($A30,'Data Input'!$A$3:$AX$39,35,FALSE)","v":16.379999999997381},null,{"$f":"+VLOOKUP($A30,'Data Input'!$A$3:$AX$39,37,FALSE)","v":1},null,"FIRST"]
[418,{"$f":"+VLOOKUP(+$A31,'Data Input'!$A$3:$AX$39,2,FALSE)","v":"Tinkerbell"},{"$f":"+VLOOKUP(+$A31,'Data Input'!$A$3:$AX$39,3,FALSE)","v":"A Lincoln"},{"$f":"+VLOOKUP(+$A31,'Data Input'!$A$3:$AX$39,4,FALSE)","v":25.2},{"$f":"+VLOOKUP(+$A31,'Data Input'!$A$3:$AX$39,5,FALSE)","v":-8},{"$f":"+VLOOKUP(+$A31,'Data Input'!$A$3:$AX$39,6,FALSE)","v":""},{"$f":"+VLOOKUP(+$A31,'Data Input'!$A$3:$AX$39,7,FALSE)","v":"B"},{"$f":"+VLOOKUP($A31,'Data Input'!$A$3:$AX$39,33,FALSE)","v":4},{"$f":"+VLOOKUP($A31,'Data Input'!$A$3:$AX$39,34,FALSE)","v":50},{"$f":"+VLOOKUP($A31,'Data Input'!$A$3:$AX$39,35,FALSE)","v":59.760000000002037},null,{"$f":"+VLOOKUP($A31,'Data Input'!$A$3:$AX$39,37,FALSE)","v":3},null,"THIRD"]
[420,{"$f":"+VLOOKUP(+$A32,'Data Input'!$A$3:$AX$39,2,FALSE)","v":"Lyra"},{"$f":"+VLOOKUP(+$A32,'Data Input'!$A$3:$AX$39,3,FALSE)","v":"P Carrington"},{"$f":"+VLOOKUP(+$A32,'Data Input'!$A$3:$AX$39,4,FALSE)","v":30},{"$f":"+VLOOKUP(+$A32,'Data Input'!$A$3:$AX$39,5,FALSE)","v":16},{"$f":"+VLOOKUP(+$A32,'Data Input'!$A$3:$AX$39,6,FALSE)","v":"DNS"},{"$f":"+VLOOKUP(+$A32,'Data Input'!$A$3:$AX$39,7,FALSE)","v":"A"},{"$f":"+VLOOKUP($A32,'Data Input'!$A$3:$AX$39,33,FALSE)","v":0},{"$f":"+VLOOKUP($A32,'Data Input'!$A$3:$AX$39,34,FALSE)","v":0},{"$f":"+VLOOKUP($A32,'Data Input'!$A$3:$AX$39,35,FALSE)","v":0},null,{"$f":"+VLOOKUP($A32,'Data Input'!$A$3:$AX$39,37,FALSE)","v":"DNS"}]
[429,{"$f":"+VLOOKUP(+$A33,'Data Input'!$A$3:$AX$39,2,FALSE)","v":"Pickle"},{"$f":"+VLOOKUP(+$A33,'Data Input'!$A$3:$AX$39,3,FALSE)","v":"P Montague"},{"$f":"+VLOOKUP(+$A33,'Data Input'!$A$3:$AX$39,4,FALSE)","v":22.6},{"$f":"+VLOOKUP(+$A33,'Data Input'!$A$3:$AX$39,5,FALSE)","v":-16},{"$f":"+VLOOKUP(+$A33,'Data Input'!$A$3:$AX$39,6,FALSE)","v":0},{"$f":"+VLOOKUP(+$A33,'Data Input'!$A$3:$AX$39,7,FALSE)","v":"C"},{"$f":"+VLOOKUP($A33,'Data Input'!$A$3:$AX$39,33,FALSE)","v":4},{"$f":"+VLOOKUP($A33,'Data Input'!$A$3:$AX$39,34,FALSE)","v":50},{"$f":"+VLOOKUP($A33,'Data Input'!$A$3:$AX$39,35,FALSE)","v":34.200000000000728},null,{"$f":"+VLOOKUP($A33,'Data Input'!$A$3:$AX$39,37,FALSE)","v":2},null,"SECOND"]
[]
[]
[]
[]
[]
[]
[{"$f":"COUNT(A3:A39)","v":31}]

{"sheet":"Moonraker","index":2,"n_rows":41,"n_cols":14,"rows_kept":41,"cut":false,"hidden":false,"merged":[]}
[null,null,null,null,null,null,null,null,"Elapsed",null,null,null,null,"MOONRAKER POSITION"]
["No","Yacht","Skipper","Length","H/C","P","Class","H","M","S",null,"Pos"," "]
[10,{"$f":"+VLOOKUP(+$A3,'Data Input'!$A$3:$AX$39,2,FALSE)","v":"Flight"},{"$f":"+VLOOKUP(+$A3,'Data Input'!$A$3:$AX$39,3,FALSE)","v":"J Farrow"},{"$f":"+VLOOKUP(+$A3,'Data Input'!$A$3:$AX$39,4,FALSE)","v":29.11},{"$f":"+VLOOKUP(+$A3,'Data Input'!$A$3:$AX$39,5,FALSE)","v":-9},{"$f":"+VLOOKUP(+$A3,'Data Input'!$A$3:$AX$39,6,FALSE)","v":0},{"$f":"+VLOOKUP(+$A3,'Data Input'!$A$3:$AX$39,7,FALSE)","v":"A"},{"$f":"+VLOOKUP($A3,'Data Input'!$A$3:$AX$39,27,FALSE)","v":6},{"$f":"+VLOOKUP($A3,'Data Input'!$A$3:$AX$39,28,FALSE)","v":0},{"$f":"+VLOOKUP($A3,'Data Input'!$A$3:$AX$39,29,FALSE)","v":54},null,{"$f":"+VLOOKUP($A3,'Data Input'!$A$3:$AX$39,31,FALSE)","v":18}]
[22,{"$f":"+VLOOKUP(+$A4,'Data Input'!$A$3:$AX$39,2,FALSE)","v":"Moonraker"},{"$f":"+VLOOKUP(+$A4,'Data Input'!$A$3:$AX$39,3,FALSE)","v":"P Jeckells"},{"$f":"+VLOOKUP(+$A4,'Data Input'!$A$3:$AX$39,4,FALSE)","v":29.6},{"$f":"+VLOOKUP(+$A4,'Data Input'!$A$3:$AX$39,5,FALSE)","v":2},{"$f":"+VLOOKUP(+$A4,'Data Input'!$A$3:$AX$39,6,FALSE)","v":0},{"$f":"+VLOOKUP(+$A4,'Data Input'!$A$3:$AX$39,7,FALSE)","v":"A"},{"$f":"+VLOOKUP($A4,'Data Input'!$A$3:$AX$39,27,FALSE)","v":5},{"$f":"+VLOOKUP($A4,'Data Input'!$A$3:$AX$39,28,FALSE)","v":7},{"$f":"+VLOOKUP($A4,'Data Input'!$A$3:$AX$39,29,FALSE)","v":35},null,{"$f":"+VLOOKUP($A4,'Data Input'!$A$3:$AX$39,31,FALSE)","v":6}]
[24,{"$f":"+VLOOKUP(+$A5,'Data Input'!$A$3:$AX$39,2,FALSE)","v":"Pippa"},{"$f":"+VLOOKUP(+$A5,'Data Input'!$A$3:$AX$39,3,FALSE)","v":"G Angel"},{"$f":"+VLOOKUP(+$A5,'Data Input'!$A$3:$AX$39,4,FALSE)","v":27.1},{"$f":"+VLOOKUP(+$A5,'Data Input'!$A$3:$AX$39,5,FALSE)","v":-7},{"$f":"+VLOOKUP(+$A5,'Data Input'!$A$3:$AX$39,6,FALSE)","v":0},{"$f":"+VLOOKUP(+$A5,'Data Input'!$A$3:$AX$39,7,FALSE)","v":"B"},{"$f":"+VLOOKUP($A5,'Data Input'!$A$3:$AX$39,27,FALSE)","v":5},{"$f":"+VLOOKUP($A5,'Data Input'!$A$3:$AX$39,28,FALSE)","v":51},{"$f":"+VLOOKUP($A5,'Data Input'!$A$3:$AX$39,29,FALSE)","v":40},null,{"$f":"+VLOOKUP($A5,'Data Input'!$A$3:$AX$39,31,FALSE)","v":16}]
[25,{"$f":"+VLOOKUP(+$A6,'Data Input'!$A$3:$AX$39,2,FALSE)","v":"Melody"},{"$f":"+VLOOKUP(+$A6,'Data Input'!$A$3:$AX$39,3,FALSE)","v":"M Wells"},{"$f":"+VLOOKUP(+$A6,'Data Input'!$A$3:$AX$39,4,FALSE)","v":26},{"$f":"+VLOOKUP(+$A6,'Data Input'!$A$3:$AX$39,5,FALSE)","v":-11},{"$f":"+VLOOKUP(+$A6,'Data Input'!$A$3:$AX$39,6,FALSE)","v":0},{"$f":"+VLOOKUP(+$A6,'Data Input'!$A$3:$AX$39,7,FALSE)","v":"B"},{"$f":"+VLOOKUP($A6,'Data Input'!$A$3:$AX$39,27,FALSE)","v":6},{"$f":"+VLOOKUP($A6,'Data Input'!$A$3:$AX$39,28,FALSE)","v":11},{"$f":"+VLOOKUP($A6,'Data Input'!$A$3:$AX$39,29,FALSE)","v":10},null,{"$f":"+VLOOKUP($A6,'Data Input'!$A$3:$AX$39,31,FALSE)","v":20}]
[52,{"$f":"+VLOOKUP(+$A7,'Data Input'!$A$3:$AX$39,2,FALSE)","v":"Maidie"},{"$f":"+VLOOKUP(+$A7,'Data Input'!$A$3:$AX$39,3,FALSE)","v":"M Barnes"},{"$f":"+VLOOKUP(+$A7,'Data Input'!$A$3:$AX$39,4,FALSE)","v":43},{"$f":"+VLOOKUP(+$A7,'Data Input'!$A$3:$AX$39,5,FALSE)","v":10},{"$f":"+VLOOKUP(+$A7,'Data Input'!$A$3:$AX$39,6,FALSE)","v":"DNF"},{"$f":"+VLOOKUP(+$A7,'Data Input'!$A$3:$AX$39,7,FALSE)","v":"A"},{"$f":"+VLOOKUP($A7,'Data Input'!$A$3:$AX$39,27,FALSE)","v":14},{"$f":"+VLOOKUP($A7,'Data Input'!$A$3:$AX$39,28,FALSE)","v":30},{"$f":"+VLOOKUP($A7,'Data Input'!$A$3:$AX$39,29,FALSE)","v":0},null,{"$f":"+VLOOKUP($A7,'Data Input'!$A$3:$AX$39,31,FALSE)","v":"DNF"}]
[79,{"$f":"+VLOOKUP(+$A8,'Data Input'!$A$3:$AX$39,2,FALSE)","v":"Daisy"},{"$f":"+VLOOKUP(+$A8,'Data Input'!$A$3:$AX$39,3,FALSE)","v":"T Ford"},{"$f":"+VLOOKUP(+$A8,'Data Input'!$A$3:$AX$39,4,FALSE)","v":22},{"$f":"+VLOOKUP(+$A8,'Data Input'!$A$3:$AX$39,5,FALSE)","v":-25},{"$f":"+VLOOKUP(+$A8,'Data Input'!$A$3:$AX$39,6,FALSE)","v":0},{"$f":"+VLOOKUP(+$A8,'Data Input'!$A$3:$AX$39,7,FALSE)","v":"C"},{"$f":"+VLOOKUP($A8,'Data Input'!$A$3:$AX$39,27,FALSE)","v":8},{"$f":"+VLOOKUP($A8,'Data Input'!$A$3:$AX$39,28,FALSE)","v":10},{"$f":"+VLOOKUP($A8,'Data Input'!$A$3:$AX$39,29,FALSE)","v":26},null,{"$f":"+VLOOKUP($A8,'Data Input'!$A$3:$AX$39,31,FALSE)","v":24}]
[87,{"$f":"+VLOOKUP(+$A9,'Data Input'!$A$3:$AX$39,2,FALSE)","v":"Modwena"},{"$f":"+VLOOKUP(+$A9,'Data Input'!$A$3:$AX$39,3,FALSE)","v":"M Cassidy"},{"$f":"+VLOOKUP(+$A9,'Data Input'!$A$3:$AX$39,4,FALSE)","v":24.11},{"$f":"+VLOOKUP(+$A9,'Data Input'!$A$3:$AX$39,5,FALSE)","v":-19},{"$f":"+VLOOKUP(+$A9,'Data Input'!$A$3:$AX$39,6,FALSE)","v":0},{"$f":"+VLOOKUP(+$A9,'Data Input'!$A$3:$AX$39,7,FALSE)","v":"C"},{"$f":"+VLOOKUP($A9,'Data Input'!$A$3:$AX$39,27,FALSE)","v":6},{"$f":"+VLOOKUP($A9,'Data Input'!$A$3:$AX$39,28,FALSE)","v":38},{"$f":"+VLOOKUP($A9,'Data Input'!$A$3:$AX$39,29,FALSE)","v":12},null,{"$f":"+VLOOKUP($A9,'Data Input'!$A$3:$AX$39,31,FALSE)","v":22}]
[141,{"$f":"+VLOOKUP(+$A10,'Data Input'!$A$3:$AX$39,2,FALSE)","v":"Nirvana"},{"$f":"+VLOOKUP(+$A10,'Data Input'!$A$3:$AX$39,3,FALSE)","v":" M Claridge"},{"$f":"+VLOOKUP(+$A10,'Data Input'!$A$3:$AX$39,4,FALSE)","v":20},{"$f":"+VLOOKUP(+$A10,'Data Input'!$A$3:$AX$39,5,FALSE)","v":-23},{"$f":"+VLOOKUP(+$A10,'Data Input'!$A$3:$AX$39,6,FALSE)","v":"DNS"},{"$f":"+VLOOKUP(+$A10,'Data Input'!$A$3:$AX$39,7,FALSE)","v":"C"},{"$f":"+VLOOKUP($A10,'Data Input'!$A$3:$AX$39,27,FALSE)","v":0},{"$f":"+VLOOKUP($A10,'Data Input'!$A$3:$AX$39,28,FALSE)","v":0},{"$f":"+VLOOKUP($A10,'Data Input'!$A$3:$AX$39,29,FALSE)","v":0},null,{"$f":"+VLOOKUP($A10,'Data Input'!$A$3:$AX$39,31,FALSE)","v":"DNS"}]
[149,{"$f":"+VLOOKUP(+$A11,'Data Input'!$A$3:$AX$39,2,FALSE)","v":"Stella Genesta"},{"$f":"+VLOOKUP(+$A11,'Data Input'!$A$3:$AX$39,3,FALSE)","v":"M Burwood"},{"$f":"+VLOOKUP(+$A11,'Data Input'!$A$3:$AX$39,4,FALSE)","v":30},{"$f":"+VLOOKUP(+$A11,'Data Input'!$A$3:$AX$39,5,FALSE)","v":-19},{"$f":"+VLOOKUP(+$A11,'Data Input'!$A$3:$AX$39,6,FALSE)","v":0},{"$f":"+VLOOKUP(+$A11,'Data Input'!$A$3:$AX$39,7,FALSE)","v":"A"},{"$f":"+VLOOKUP($A11,'Data Input'!$A$3:$AX$39,27,FALSE)","v":6},{"$f":"+VLOOKUP($A11,'Data Input'!$A$3:$AX$39,28,FALSE)","v":47},{"$f":"+VLOOKUP($A11,'Data Input'!$A$3:$AX$39,29,FALSE)","v":44},null,{"$f":"+VLOOKUP($A11,'Data Input'!$A$3:$AX$39,31,FALSE)","v":23}]
[179,{"$f":"+VLOOKUP(+$A12,'Data Input'!$A$3:$AX$39,2,FALSE)","v":"Waxwing"},{"$f":"+VLOOKUP(+$A12,'Data Input'!$A$3:$AX$39,3,FALSE)","v":"R & S Clayton"},{"$f":"+VLOOKUP(+$A12,'Data Input'!$A$3:$AX$39,4,FALSE)","v":27},{"$f":"+VLOOKUP(+$A12,'Data Input'!$A$3:$AX$39,5,FALSE)","v":-8},{"$f":"+VLOOKUP(+$A12,'Data Input'!$A$3:$AX$39,6,FALSE)","v":0},{"$f":"+VLOOKUP(+$A12,'Data Input'!$A$3:$AX$39,7,FALSE)","v":"B"},{"$f":"+VLOOKUP($A12,'Data Input'!$A$3:$AX$39,27,FALSE)","v":5},{"$f":"+VLOOKUP($A12,'Data Input'!$A$3:$AX$39,28,FALSE)","v":43},{"$f":"+VLOOKUP($A12,'Data Input'!$A$3:$AX$39,29,FALSE)","v":46},null,{"$f":"+VLOOKUP($A12,'Data Input'!$A$3:$AX$39,31,FALSE)","v":13}]
[199,{"$f":"+VLOOKUP(+$A13,'Data Input'!$A$3:$AX$39,2,FALSE)","v":"Morning Calm"},{"$f":"+VLOOKUP(+$A13,'Data Input'!$A$3:$AX$39,3,FALSE)","v":"W Clark"},{"$f":"+VLOOKUP(+$A13,'Data Input'!$A$3:$AX$39,4,FALSE)","v":26},{"$f":"+VLOOKUP(+$A13,'Data Input'!$A$3:$AX$39,5,FALSE)","v":-9},{"$f":"+VLOOKUP(+$A13,'Data Input'!$A$3:$AX$39,6,FALSE)","v":0},{"$f":"+VLOOKUP(+$A13,'Data Input'!$A$3:$AX$39,7,FALSE)","v":"B"},{"$f":"+VLOOKUP($A13,'Data Input'!$A$3:$AX$39,27,FALSE)","v":5},{"$f":"+VLOOKUP($A13,'Data Input'!$A$3:$AX$39,28,FALSE)","v":30},{"$f":"+VLOOKUP($A13,'Data Input'!$A$3:$AX$39,29,FALSE)","v":39},null,{"$f":"+VLOOKUP($A13,'Data Input'!$A$3:$AX$39,31,FALSE)","v":8}]
[216,{"$f":"+VLOOKUP(+$A14,'Data Input'!$A$3:$AX$39,2,FALSE)","v":"Tamara"},{"$f":"+VLOOKUP(+$A14,'Data Input'!$A$3:$AX$39,3,FALSE)","v":"N Heath"},{"$f":"+VLOOKUP(+$A14,'Data Input'!$A$3:$AX$39,4,FALSE)","v":24.8},{"$f":"+VLOOKUP(+$A14,'Data Input'!$A$3:$AX$39,5,FALSE)","v":-16},{"$f":"+VLOOKUP(+$A14,'Data Input'!$A$3:$AX$39,6,FALSE)","v":"P"},{"$f":"+VLOOKUP(+$A14,'Data Input'!$A$3:$AX$39,7,FALSE)","v":"C"},{"$f":"+VLOOKUP($A14,'Data Input'!$A$3:$AX$39,27,FALSE)","v":6},{"$f":"+VLOOKUP($A14,'Data Input'!$A$3:$AX$39,28,FALSE)","v":13},{"$f":"+VLOOKUP($A14,'Data Input'!$A$3:$AX$39,29,FALSE)","v":14},null,{"$f":"+VLOOKUP($A14,'Data Input'!$A$3:$AX$39,31,FALSE)","v":"P"}]
[217,{"$f":"+VLOOKUP(+$A15,'Data Input'!$A$3:$AX$39,2,FALSE)","v":"Melinda"},{"$f":"+VLOOKUP(+$A15,'Data Input'!$A$3:$AX$39,3,FALSE)","v":"P Howes"},{"$f":"+VLOOKUP(+$A15,'Data Input'!$A$3:$AX$39,4,FALSE)","v":27.11},{"$f":"+VLOOKUP(+$A15,'Data Input'!$A$3:$AX$39,5,FALSE)","v":1},{"$f":"+VLOOKUP(+$A15,'Data Input'!$A$3:$AX$39,6,FALSE)","v":0},{"$f":"+VLOOKUP(+$A15,'Data Input'!$A$3:$AX$39,7,FALSE)","v":"B"},{"$f":"+VLOOKUP($A15,'Data Input'!$A$3:$AX$39,27,FALSE)","v":4},{"$f":"+VLOOKUP($A15,'Data Input'!$A$3:$AX$39,28,FALSE)","v":50},{"$f":"+VLOOKUP($A15,'Data Input'!$A$3:$AX$39,29,FALSE)","v":38},null,{"$f":"+VLOOKUP($A15,'Data Input'!$A$3:$AX$39,31,FALSE)","v":5}]
[218,{"$f":"+VLOOKUP(+$A16,'Data Input'!$A$3:$AX$39,2,FALSE)","v":"Mystery"},{"$f":"+VLOOKUP(+$A16,'Data Input'!$A$3:$AX$39,3,FALSE)","v":"M Ford"},{"$f":"+VLOOKUP(+$A16,'Data Input'!$A$3:$AX$39,4,FALSE)","v":26},{"$f":"+VLOOKUP(+$A16,'Data Input'!$A$3:$AX$39,5,FALSE)","v":-7},{"$f":"+VLOOKUP(+$A16,'Data Input'!$A$3:$AX$39,6,FALSE)","v":"RTD"},{"$f":"+VLOOKUP(+$A16,'Data Input'!$A$3:$AX$39,7,FALSE)","v":"B"},{"$f":"+VLOOKUP($A16,'Data Input'!$A$3:$AX$39,27,FALSE)","v":13},{"$f":"+VLOOKUP($A16,'Data Input'!$A$3:$AX$39,28,FALSE)","v":45},{"$f":"+VLOOKUP($A16,'Data Input'!$A$3:$AX$39,29,FALSE)","v":0},null,{"$f":"+VLOOKUP($A16,'Data Input'!$A$3:$AX$39,31,FALSE)","v":"RTD"}]
[224,{"$f":"+VLOOKUP(+$A17,'Data Input'!$A$3:$AX$39,2,FALSE)","v":"Anna"},{"$f":"+VLOOKUP(+$A17,'Data Input'!$A$3:$AX$39,3,FALSE)","v":"R Branscombe"},{"$f":"+VLOOKUP(+$A17,'Data Input'!$A$3:$AX$39,4,FALSE)","v":25},{"$f":"+VLOOKUP(+$A17,'Data Input'!$A$3:$AX$39,5,FALSE)","v":-10},{"$f":"+VLOOKUP(+$A17,'Data Input'!$A$3:$AX$39,6,FALSE)","v":0},{"$f":"+VLOOKUP(+$A17,'Data Input'!$A$3:$AX$39,7,FALSE)","v":"B"},{"$f":"+VLOOKUP($A17,'Data Input'!$A$3:$AX$39,27,FALSE)","v":6},{"$f":"+VLOOKUP($A17,'Data Input'!$A$3:$AX$39,28,FALSE)","v":4},{"$f":"+VLOOKUP($A17,'Data Input'!$A$3:$AX$39,29,FALSE)","v":5},null,{"$f":"+VLOOKUP($A17,'Data Input'!$A$3:$AX$39,31,FALSE)","v":19}]
[240,{"$f":"+VLOOKUP(+$A18,'Data Input'!$A$3:$AX$39,2,FALSE)","v":"Avocet"},{"$f":"+VLOOKUP(+$A18,'Data Input'!$A$3:$AX$39,3,FALSE)","v":"R  Branford"},{"$f":"+VLOOKUP(+$A18,'Data Input'!$A$3:$AX$39,4,FALSE)","v":28},{"$f":"+VLOOKUP(+$A18,'Data Input'!$A$3:$AX$39,5,FALSE)","v":-16},{"$f":"+VLOOKUP(+$A18,'Data Input'!$A$3:$AX$39,6,FALSE)","v":0},{"$f":"+VLOOKUP(+$A18,'Data Input'!$A$3:$AX$39,7,FALSE)","v":"B"},{"$f":"+VLOOKUP($A18,'Data Input'!$A$3:$AX$39,27,FALSE)","v":6},{"$f":"+VLOOKUP($A18,'Data Input'!$A$3:$AX$39,28,FALSE)","v":15},{"$f":"+VLOOKUP($A18,'Data Input'!$A$3:$AX$39,29,FALSE)","v":50},null,{"$f":"+VLOOKUP($A18,'Data Input'!$A$3:$AX$39,31,FALSE)","v":21}]
[250,{"$f":"+VLOOKUP(+$A19,'Data Input'!$A$3:$AX$39,2,FALSE)","v":"Storm"},{"$f":"+VLOOKUP(+$A19,'Data Input'!$A$3:$AX$39,3,FALSE)","v":"M Thwaites"},{"$f":"+VLOOKUP(+$A19,'Data Input'!$A$3:$AX$39,4,FALSE)","v":35},{"$f":"+VLOOKUP(+$A19,'Data Input'!$A$3:$AX$39,5,FALSE)","v":16},{"$f":"+VLOOKUP(+$A19,'Data Input'!$A$3:$AX$39,6,FALSE)","v":0},{"$f":"+VLOOKUP(+$A19,'Data Input'!$A$3:$AX$39,7,FALSE)","v":"A"},{"$f":"+VLOOKUP($A19,'Data Input'!$A$3:$AX$39,27,FALSE)","v":4},{"$f":"+VLOOKUP($A19,'Data Input'!$A$3:$AX$39,28,FALSE)","v":13},{"$f":"+VLOOKUP($A19,'Data Input'!$A$3:$AX$39,29,FALSE)","v":56},null,{"$f":"+VLOOKUP($A19,'Data Input'!$A$3:$AX$39,31,FALSE)","v":2},null,"SECOND"]
[262,{"$f":"+VLOOKUP(+$A20,'Data Input'!$A$3:$AX$39,2,FALSE)","v":"Jessie May"},{"$f":"+VLOOKUP(+$A20,'Data Input'!$A$3:$AX$39,3,FALSE)","v":"C Dugdale"},{"$f":"+VLOOKUP(+$A20,'Data Input'!$A$3:$AX$39,4,FALSE)","v":27.11},{"$f":"+VLOOKUP(+$A20,'Data Input'!$A$3:$AX$39,5,FALSE)","v":-5},{"$f":"+VLOOKUP(+$A20,'Data Input'!$A$3:$AX$39,6,FALSE)","v":0},{"$f":"+VLOOKUP(+$A20,'Data Input'!$A$3:$AX$39,7,FALSE)","v":"B"},{"$f":"+VLOOKUP($A20,'Data Input'!$A$3:$AX$39,27,FALSE)","v":5},{"$f":"+VLOOKUP($A20,'Data Input'!$A$3:$AX$39,28,FALSE)","v":35},{"$f":"+VLOOKUP($A20,'Data Input'!$A$3:$AX$39,29,FALSE)","v":24},null,{"$f":"+VLOOKUP($A20,'Data Input'!$A$3:$AX$39,31,FALSE)","v":10}]
[274,{"$f":"+VLOOKUP(+$A21,'Data Input'!$A$3:$AX$39,2,FALSE)","v":"Elfin"},{"$f":"+VLOOKUP(+$A21,'Data Input'!$A$3:$AX$39,3,FALSE)","v":"A Bond"},{"$f":"+VLOOKUP(+$A21,'Data Input'!$A$3:$AX$39,4,FALSE)","v":20},{"$f":"+VLOOKUP(+$A21,'Data Input'!$A$3:$AX$39,5,FALSE)","v":-27},{"$f":"+VLOOKUP(+$A21,'Data Input'!$A$3:$AX$39,6,FALSE)","v":0},{"$f":"+VLOOKUP(+$A21,'Data Input'!$A$3:$AX$39,7,FALSE)","v":"C"},{"$f":"+VLOOKUP($A21,'Data Input'!$A$3:$AX$39,27,FALSE)","v":8},{"$f":"+VLOOKUP($A21,'Data Input'!$A$3:$AX$39,28,FALSE)","v":16},{"$f":"+VLOOKUP($A21,'Data Input'!$A$3:$AX$39,29,FALSE)","v":55},null,{"$f":"+VLOOKUP($A21,'Data Input'!$A$3:$AX$39,31,FALSE)","v":25}]
[323,{"$f":"+VLOOKUP(+$A22,'Data Input'!$A$3:$AX$39,2,FALSE)","v":"Starlight Lady"},{"$f":"+VLOOKUP(+$A22,'Data Input'!$A$3:$AX$39,3,FALSE)","v":"N Matthews"},{"$f":"+VLOOKUP(+$A22,'Data Input'!$A$3:$AX$39,4,FALSE)","v":30},{"$f":"+VLOOKUP(+$A22,'Data Input'!$A$3:$AX$39,5,FALSE)","v":13},{"$f":"+VLOOKUP(+$A22,'Data Input'!$A$3:$AX$39,6,FALSE)","v":0},{"$f":"+VLOOKUP(+$A22,'Data Input'!$A$3:$AX$39,7,FALSE)","v":"A"},{"$f":"+VLOOKUP($A22,'Data Input'!$A$3:$AX$39,27,FALSE)","v":4},{"$f":"+VLOOKUP($A22,'Data Input'!$A$3:$AX$39,28,FALSE)","v":44},{"$f":"+VLOOKUP($A22,'Data Input'!$A$3:$AX$39,29,FALSE)","v":29},null,{"$f":"+VLOOKUP($A22,'Data Input'!$A$3:$AX$39,31,FALSE)","v":3},null,"THIRD"]
[368,{"$f":"+VLOOKUP(+$A23,'Data Input'!$A$3:$AX$39,2,FALSE)","v":"Wandering Rose"},{"$f":"+VLOOKUP(+$A23,'Data Input'!$A$3:$AX$39,3,FALSE)","v":" D Radley"},{"$f":"+VLOOKUP(+$A23,'Data Input'!$A$3:$AX$39,4,FALSE)","v":31.6},{"$f":"+VLOOKUP(+$A23,'Data Input'!$A$3:$AX$39,5,FALSE)","v":-2},{"$f":"+VLOOKUP(+$A23,'Data Input'!$A$3:$AX$39,6,FALSE)","v":0},{"$f":"+VLOOKUP(+$A23,'Data Input'!$A$3:$AX$39,7,FALSE)","v":"A"},{"$f":"+VLOOKUP($A23,'Data Input'!$A$3:$AX$39,27,FALSE)","v":5},{"$f":"+VLOOKUP($A23,'Data Input'!$A$3:$AX$39,28,FALSE)","v":32},{"$f":"+VLOOKUP($A23,'Data Input'!$A$3:$AX$39,29,FALSE)","v":52},null,{"$f":"+VLOOKUP($A23,'Data Input'!$A$3:$AX$39,31,FALSE)","v":9}]
[369,{"$f":"+VLOOKUP(+$A24,'Data Input'!$A$3:$AX$39,2,FALSE)","v":"Moonshadow"},{"$f":"+VLOOKUP(+$A24,'Data Input'!$A$3:$AX$39,3,FALSE)","v":"N Hovey"},{"$f":"+VLOOKUP(+$A24,'Data Input'!$A$3:$AX$39,4,FALSE)","v":31.6},{"$f":"+VLOOKUP(+$A24,'Data Input'!$A$3:$AX$39,5,FALSE)","v":5},{"$f":"+VLOOKUP(+$A24,'Data Input'!$A$3:$AX$39,6,FALSE)","v":""},{"$f":"+VLOOKUP(+$A24,'Data Input'!$A$3:$AX$39,7,FALSE)","v":"A"},{"$f":"+VLOOKUP($A24,'Data Input'!$A$3:$AX$39,27,FALSE)","v":4},{"$f":"+VLOOKUP($A24,'Data Input'!$A$3:$AX$39,28,FALSE)","v":46},{"$f":"+VLOOKUP($A24,'Data Input'!$A$3:$AX$39,29,FALSE)","v":36},null,{"$f":"+VLOOKUP($A24,'Data Input'!$A$3:$AX$39,31,FALSE)","v":4}]
[370,{"$f":"+VLOOKUP(+$A25,'Data Input'!$A$3:$AX$39,2,FALSE)","v":"Glory"},{"$f":"+VLOOKUP(+$A25,'Data Input'!$A$3:$AX$39,3,FALSE)","v":"C Brown"},{"$f":"+VLOOKUP(+$A25,'Data Input'!$A$3:$AX$39,4,FALSE)","v":35},{"$f":"+VLOOKUP(+$A25,'Data Input'!$A$3:$AX$39,5,FALSE)","v":-6},{"$f":"+VLOOKUP(+$A25,'Data Input'!$A$3:$AX$39,6,FALSE)","v":""},{"$f":"+VLOOKUP(+$A25,'Data Input'!$A$3:$AX$39,7,FALSE)","v":"A"},{"$f":"+VLOOKUP($A25,'Data Input'!$A$3:$AX$39,27,FALSE)","v":5},{"$f":"+VLOOKUP($A25,'Data Input'!$A$3:$AX$39,28,FALSE)","v":45},{"$f":"+VLOOKUP($A25,'Data Input'!$A$3:$AX$39,29,FALSE)","v":46},null,{"$f":"+VLOOKUP($A25,'Data Input'!$A$3:$AX$39,31,FALSE)","v":14}]
[375,{"$f":"+VLOOKUP(+$A26,'Data Input'!$A$3:$AX$39,2,FALSE)","v":"Amaryllis"},{"$f":"+VLOOKUP(+$A26,'Data Input'!$A$3:$AX$39,3,FALSE)","v":"C Tuckett"},{"$f":"+VLOOKUP(+$A26,'Data Input'!$A$3:$AX$39,4,FALSE)","v":21.4},{"$f":"+VLOOKUP(+$A26,'Data Input'!$A$3:$AX$39,5,FALSE)","v":-10},{"$f":"+VLOOKUP(+$A26,'Data Input'!$A$3:$AX$39,6,FALSE)","v":0},{"$f":"+VLOOKUP(+$A26,'Data Input'!$A$3:$AX$39,7,FALSE)","v":"C"},{"$f":"+VLOOKUP($A26,'Data Input'!$A$3:$AX$39,27,FALSE)","v":5},{"$f":"+VLOOKUP($A26,'Data Input'!$A$3:$AX$39,28,FALSE)","v":38},{"$f":"+VLOOKUP($A26,'Data Input'!$A$3:$AX$39,29,FALSE)","v":29},null,{"$f":"+VLOOKUP($A26,'Data Input'!$A$3:$AX$39,31,FALSE)","v":11}]
[400,{"$f":"+VLOOKUP(+$A27,'Data Input'!$A$3:$AX$39,2,FALSE)","v":"Swallow"},{"$f":"+VLOOKUP(+$A27,'Data Input'!$A$3:$AX$39,3,FALSE)","v":"K Halifax"},{"$f":"+VLOOKUP(+$A27,'Data Input'!$A$3:$AX$39,4,FALSE)","v":26},{"$f":"+VLOOKUP(+$A27,'Data Input'!$A$3:$AX$39,5,FALSE)","v":-7},{"$f":"+VLOOKUP(+$A27,'Data Input'!$A$3:$AX$39,6,FALSE)","v":""},{"$f":"+VLOOKUP(+$A27,'Data Input'!$A$3:$AX$39,7,FALSE)","v":"B"},{"$f":"+VLOOKUP($A27,'Data Input'!$A$3:$AX$39,27,FALSE)","v":5},{"$f":"+VLOOKUP($A27,'Data Input'!$A$3:$AX$39,28,FALSE)","v":59},{"$f":"+VLOOKUP($A27,'Data Input'!$A$3:$AX$39,29,FALSE)","v":53},null,{"$f":"+VLOOKUP($A27,'Data Input'!$A$3:$AX$39,31,FALSE)","v":17}]
[403,{"$f":"+VLOOKUP(+$A28,'Data Input'!$A$3:$AX$39,2,FALSE)","v":"May"},{"$f":"+VLOOKUP(+$A28,'Data Input'!$A$3:$AX$39,3,FALSE)","v":"K Rhead"},{"$f":"+VLOOKUP(+$A28,'Data Input'!$A$3:$AX$39,4,FALSE)","v":30},{"$f":"+VLOOKUP(+$A28,'Data Input'!$A$3:$AX$39,5,FALSE)","v":-10},{"$f":"+VLOOKUP(+$A28,'Data Input'!$A$3:$AX$39,6,FALSE)","v":"DNF"},{"$f":"+VLOOKUP(+$A28,'Data Input'!$A$3:$AX$39,7,FALSE)","v":"A"},{"$f":"+VLOOKUP($A28,'Data Input'!$A$3:$AX$39,27,FALSE)","v":12},{"$f":"+VLOOKUP($A28,'Data Input'!$A$3:$AX$39,28,FALSE)","v":45},{"$f":"+VLOOKUP($A28,'Data Input'!$A$3:$AX$39,29,FALSE)","v":0},null,{"$f":"+VLOOKUP($A28,'Data Input'!$A$3:$AX$39,31,FALSE)","v":"DNF"}]
[416,{"$f":"+VLOOKUP(+$A29,'Data Input'!$A$3:$AX$39,2,FALSE)","v":"Alice Rose"},{"$f":"+VLOOKUP(+$A29,'Data Input'!$A$3:$AX$39,3,FALSE)","v":"T Riches"},{"$f":"+VLOOKUP(+$A29,'Data Input'!$A$3:$AX$39,4,FALSE)","v":28.6},{"$f":"+VLOOKUP(+$A29,'Data Input'!$A$3:$AX$39,5,FALSE)","v":-7},{"$f":"+VLOOKUP(+$A29,'Data Input'!$A$3:$AX$39,6,FALSE)","v":0},{"$f":"+VLOOKUP(+$A29,'Data Input'!$A$3:$AX$39,7,FALSE)","v":"A"},{"$f":"+VLOOKUP($A29,'Data Input'!$A$3:$AX$39,27,FALSE)","v":5},{"$f":"+VLOOKUP($A29,'Data Input'!$A$3:$AX$39,28,FALSE)","v":41},{"$f":"+VLOOKUP($A29,'Data Input'!$A$3:$AX$39,29,FALSE)","v":22},null,{"$f":"+VLOOKUP($A29,'Data Input'!$A$3:$AX$39,31,FALSE)","v":12}]
[417,{"$f":"+VLOOKUP(+$A30,'Data Input'!$A$3:$AX$39,2,FALSE)","v":"Stellar"},{"$f":"+VLOOKUP(+$A30,'Data Input'!$A$3:$AX$39,3,FALSE)","v":"T Frary"},{"$f":"+VLOOKUP(+$A30,'Data Input'!$A$3:$AX$39,4,FALSE)","v":31.4},{"$f":"+VLOOKUP(+$A30,'Data Input'!$A$3:$AX$39,5,FALSE)","v":17},{"$f":"+VLOOKUP(+$A30,'Data Input'!$A$3:$AX$39,6,FALSE)","v":0},{"$f":"+VLOOKUP(+$A30,'Data Input'!$A$3:$AX$39,7,FALSE)","v":"A"},{"$f":"+VLOOKUP($A30,'Data Input'!$A$3:$AX$39,27,FALSE)","v":3},{"$f":"+VLOOKUP($A30,'Data Input'!$A$3:$AX$39,28,FALSE)","v":53},{"$f":"+VLOOKUP($A30,'Data Input'!$A$3:$AX$39,29,FALSE)","v":34},null,{"$f":"+VLOOKUP($A30,'Data Input'!$A$3:$AX$39,31,FALSE)","v":1},null,"FIRST"]
[418,{"$f":"+VLOOKUP(+$A31,'Data Input'!$A$3:$AX$39,2,FALSE)","v":"Tinkerbell"},{"$f":"+VLOOKUP(+$A31,'Data Input'!$A$3:$AX$39,3,FALSE)","v":"A Lincoln"},{"$f":"+VLOOKUP(+$A31,'Data Input'!$A$3:$AX$39,4,FALSE)","v":25.2},{"$f":"+VLOOKUP(+$A31,'Data Input'!$A$3:$AX$39,5,FALSE)","v":-8},{"$f":"+VLOOKUP(+$A31,'Data Input'!$A$3:$AX$39,6,FALSE)","v":""},{"$f":"+VLOOKUP(+$A31,'Data Input'!$A$3:$AX$39,7,FALSE)","v":"B"},{"$f":"+VLOOKUP($A31,'Data Input'!$A$3:$AX$39,27,FALSE)","v":5},{"$f":"+VLOOKUP($A31,'Data Input'!$A$3:$AX$39,28,FALSE)","v":16},{"$f":"+VLOOKUP($A31,'Data Input'!$A$3:$AX$39,29,FALSE)","v":18},null,{"$f":"+VLOOKUP($A31,'Data Input'!$A$3:$AX$39,31,FALSE)","v":7}]
[420,{"$f":"+VLOOKUP(+$A32,'Data Input'!$A$3:$AX$39,2,FALSE)","v":"Lyra"},{"$f":"+VLOOKUP(+$A32,'Data Input'!$A$3:$AX$39,3,FALSE)","v":"P Carrington"},{"$f":"+VLOOKUP(+$A32,'Data Input'!$A$3:$AX$39,4,FALSE)","v":30},{"$f":"+VLOOKUP(+$A32,'Data Input'!$A$3:$AX$39,5,FALSE)","v":16},{"$f":"+VLOOKUP(+$A32,'Data Input'!$A$3:$AX$39,6,FALSE)","v":"DNS"},{"$f":"+VLOOKUP(+$A32,'Data Input'!$A$3:$AX$39,7,FALSE)","v":"A"},{"$f":"+VLOOKUP($A32,'Data Input'!$A$3:$AX$39,27,FALSE)","v":0},{"$f":"+VLOOKUP($A32,'Data Input'!$A$3:$AX$39,28,FALSE)","v":0},{"$f":"+VLOOKUP($A32,'Data Input'!$A$3:$AX$39,29,FALSE)","v":0},null,{"$f":"+VLOOKUP($A32,'Data Input'!$A$3:$AX$39,31,FALSE)","v":"DNS"}]
[429,{"$f":"+VLOOKUP(+$A33,'Data Input'!$A$3:$AX$39,2,FALSE)","v":"Pickle"},{"$f":"+VLOOKUP(+$A33,'Data Input'!$A$3:$AX$39,3,FALSE)","v":"P Montague"},{"$f":"+VLOOKUP(+$A33,'Data Input'!$A$3:$AX$39,4,FALSE)","v":22.6},{"$f":"+VLOOKUP(+$A33,'Data Input'!$A$3:$AX$39,5,FALSE)","v":-16},{"$f":"+VLOOKUP(+$A33,'Data Input'!$A$3:$AX$39,6,FALSE)","v":0},{"$f":"+VLOOKUP(+$A33,'Data Input'!$A$3:$AX$39,7,FALSE)","v":"C"},{"$f":"+VLOOKUP($A33,'Data Input'!$A$3:$AX$39,27,FALSE)","v":5},{"$f":"+VLOOKUP($A33,'Data Input'!$A$3:$AX$39,28,FALSE)","v":45},{"$f":"+VLOOKUP($A33,'Data Input'!$A$3:$AX$39,29,FALSE)","v":55},null,{"$f":"+VLOOKUP($A33,'Data Input'!$A$3:$AX$39,31,FALSE)","v":15}]
[]
[]
[]
[]
[]
[]
[]
[{"$f":"COUNT(A3:A40)","v":31}]

{"sheet":"Classes","index":3,"n_rows":53,"n_cols":15,"rows_kept":53,"cut":false,"hidden":false,"merged":[]}
[null,null,null,null,null,null,null,null,"Corrected",null,null,null,null,null,"Don’t use filters on this page"]
["No","Yacht","Skipper","Length","H/C","P","Class","H","M","S",null,"Pos"," ",null,"Sort will place into clases and then order.  You can then insert rows with Trophy Name before printing"]
[10,{"$f":"+VLOOKUP(+$A3,'Data Input'!$A$3:$AX$39,2,FALSE)","v":"Flight"},{"$f":"+VLOOKUP(+$A3,'Data Input'!$A$3:$AX$39,3,FALSE)","v":"J Farrow"},{"$f":"+VLOOKUP(+$A3,'Data Input'!$A$3:$AX$39,4,FALSE)","v":29.11},{"$f":"+VLOOKUP(+$A3,'Data Input'!$A$3:$AX$39,5,FALSE)","v":-9},{"$f":"+VLOOKUP(+$A3,'Data Input'!$A$3:$AX$39,6,FALSE)","v":0},{"$f":"+VLOOKUP(+$A3,'Data Input'!$A$3:$AX$39,7,FALSE)","v":"A"},{"$f":"+VLOOKUP($A3,'Data Input'!$A$3:$AX$39,33,FALSE)","v":5},{"$f":"+VLOOKUP($A3,'Data Input'!$A$3:$AX$39,34,FALSE)","v":28},{"$f":"+VLOOKUP($A3,'Data Input'!$A$3:$AX$39,35,FALSE)","v":25.139999999999418},null,{"$f":"+VLOOKUP($A3,'Data Input'!$A$3:$AX$39,37,FALSE)","v":20},null,null,"Starlight Lady"]
[22,{"$f":"+VLOOKUP(+$A4,'Data Input'!$A$3:$AX$39,2,FALSE)","v":"Moonraker"},{"$f":"+VLOOKUP(+$A4,'Data Input'!$A$3:$AX$39,3,FALSE)","v":"P Jeckells"},{"$f":"+VLOOKUP(+$A4,'Data Input'!$A$3:$AX$39,4,FALSE)","v":29.6},{"$f":"+VLOOKUP(+$A4,'Data Input'!$A$3:$AX$39,5,FALSE)","v":2},{"$f":"+VLOOKUP(+$A4,'Data Input'!$A$3:$AX$39,6,FALSE)","v":0},{"$f":"+VLOOKUP(+$A4,'Data Input'!$A$3:$AX$39,7,FALSE)","v":"A"},{"$f":"+VLOOKUP($A4,'Data Input'!$A$3:$AX$39,33,FALSE)","v":5},{"$f":"+VLOOKUP($A4,'Data Input'!$A$3:$AX$39,34,FALSE)","v":13},{"$f":"+VLOOKUP($A4,'Data Input'!$A$3:$AX$39,35,FALSE)","v":44.099999999998545},null,{"$f":"+VLOOKUP($A4,'Data Input'!$A$3:$AX$39,37,FALSE)","v":9},null,null,"Jeckells"]
[24,{"$f":"+VLOOKUP(+$A5,'Data Input'!$A$3:$AX$39,2,FALSE)","v":"Pippa"},{"$f":"+VLOOKUP(+$A5,'Data Input'!$A$3:$AX$39,3,FALSE)","v":"G Angel"},{"$f":"+VLOOKUP(+$A5,'Data Input'!$A$3:$AX$39,4,FALSE)","v":27.1},{"$f":"+VLOOKUP(+$A5,'Data Input'!$A$3:$AX$39,5,FALSE)","v":-7},{"$f":"+VLOOKUP(+$A5,'Data Input'!$A$3:$AX$39,6,FALSE)","v":0},{"$f":"+VLOOKUP(+$A5,'Data Input'!$A$3:$AX$39,7,FALSE)","v":"B"},{"$f":"+VLOOKUP($A5,'Data Input'!$A$3:$AX$39,33,FALSE)","v":5},{"$f":"+VLOOKUP($A5,'Data Input'!$A$3:$AX$39,34,FALSE)","v":27},{"$f":"+VLOOKUP($A5,'Data Input'!$A$3:$AX$39,35,FALSE)","v":3},null,{"$f":"+VLOOKUP($A5,'Data Input'!$A$3:$AX$39,37,FALSE)","v":18},null,null,"Wilberforce Smith"]
[25,{"$f":"+VLOOKUP(+$A6,'Data Input'!$A$3:$AX$39,2,FALSE)","v":"Melody"},{"$f":"+VLOOKUP(+$A6,'Data Input'!$A$3:$AX$39,3,FALSE)","v":"M Wells"},{"$f":"+VLOOKUP(+$A6,'Data Input'!$A$3:$AX$39,4,FALSE)","v":26},{"$f":"+VLOOKUP(+$A6,'Data Input'!$A$3:$AX$39,5,FALSE)","v":-11},{"$f":"+VLOOKUP(+$A6,'Data Input'!$A$3:$AX$39,6,FALSE)","v":0},{"$f":"+VLOOKUP(+$A6,'Data Input'!$A$3:$AX$39,7,FALSE)","v":"B"},{"$f":"+VLOOKUP($A6,'Data Input'!$A$3:$AX$39,33,FALSE)","v":5},{"$f":"+VLOOKUP($A6,'Data Input'!$A$3:$AX$39,34,FALSE)","v":30},{"$f":"+VLOOKUP($A6,'Data Input'!$A$3:$AX$39,35,FALSE)","v":20.299999999999272},null,{"$f":"+VLOOKUP($A6,'Data Input'!$A$3:$AX$39,37,FALSE)","v":22}]
[52,{"$f":"+VLOOKUP(+$A7,'Data Input'!$A$3:$AX$39,2,FALSE)","v":"Maidie"},{"$f":"+VLOOKUP(+$A7,'Data Input'!$A$3:$AX$39,3,FALSE)","v":"M Barnes"},{"$f":"+VLOOKUP(+$A7,'Data Input'!$A$3:$AX$39,4,FALSE)","v":43},{"$f":"+VLOOKUP(+$A7,'Data Input'!$A$3:$AX$39,5,FALSE)","v":10},{"$f":"+VLOOKUP(+$A7,'Data Input'!$A$3:$AX$39,6,FALSE)","v":"DNF"},{"$f":"+VLOOKUP(+$A7,'Data Input'!$A$3:$AX$39,7,FALSE)","v":"A"},{"$f":"+VLOOKUP($A7,'Data Input'!$A$3:$AX$39,33,FALSE)","v":15},{"$f":"+VLOOKUP($A7,'Data Input'!$A$3:$AX$39,34,FALSE)","v":57},{"$f":"+VLOOKUP($A7,'Data Input'!$A$3:$AX$39,35,FALSE)","v":0},null,{"$f":"+VLOOKUP($A7,'Data Input'!$A$3:$AX$39,37,FALSE)","v":"DNF"}]
[79,{"$f":"+VLOOKUP(+$A8,'Data Input'!$A$3:$AX$39,2,FALSE)","v":"Daisy"},{"$f":"+VLOOKUP(+$A8,'Data Input'!$A$3:$AX$39,3,FALSE)","v":"T Ford"},{"$f":"+VLOOKUP(+$A8,'Data Input'!$A$3:$AX$39,4,FALSE)","v":22},{"$f":"+VLOOKUP(+$A8,'Data Input'!$A$3:$AX$39,5,FALSE)","v":-25},{"$f":"+VLOOKUP(+$A8,'Data Input'!$A$3:$AX$39,6,FALSE)","v":0},{"$f":"+VLOOKUP(+$A8,'Data Input'!$A$3:$AX$39,7,FALSE)","v":"C"},{"$f":"+VLOOKUP($A8,'Data Input'!$A$3:$AX$39,33,FALSE)","v":6},{"$f":"+VLOOKUP($A8,'Data Input'!$A$3:$AX$39,34,FALSE)","v":7},{"$f":"+VLOOKUP($A8,'Data Input'!$A$3:$AX$39,35,FALSE)","v":49.5},null,{"$f":"+VLOOKUP($A8,'Data Input'!$A$3:$AX$39,37,FALSE)","v":25}]
[87,{"$f":"+VLOOKUP(+$A9,'Data Input'!$A$3:$AX$39,2,FALSE)","v":"Modwena"},{"$f":"+VLOOKUP(+$A9,'Data Input'!$A$3:$AX$39,3,FALSE)","v":"M Cassidy"},{"$f":"+VLOOKUP(+$A9,'Data Input'!$A$3:$AX$39,4,FALSE)","v":24.11},{"$f":"+VLOOKUP(+$A9,'Data Input'!$A$3:$AX$39,5,FALSE)","v":-19},{"$f":"+VLOOKUP(+$A9,'Data Input'!$A$3:$AX$39,6,FALSE)","v":0},{"$f":"+VLOOKUP(+$A9,'Data Input'!$A$3:$AX$39,7,FALSE)","v":"C"},{"$f":"+VLOOKUP($A9,'Data Input'!$A$3:$AX$39,33,FALSE)","v":5},{"$f":"+VLOOKUP($A9,'Data Input'!$A$3:$AX$39,34,FALSE)","v":22},{"$f":"+VLOOKUP($A9,'Data Input'!$A$3:$AX$39,35,FALSE)","v":32.520000000000437},null,{"$f":"+VLOOKUP($A9,'Data Input'!$A$3:$AX$39,37,FALSE)","v":15}]
[141,{"$f":"+VLOOKUP(+$A10,'Data Input'!$A$3:$AX$39,2,FALSE)","v":"Nirvana"},{"$f":"+VLOOKUP(+$A10,'Data Input'!$A$3:$AX$39,3,FALSE)","v":" M Claridge"},{"$f":"+VLOOKUP(+$A10,'Data Input'!$A$3:$AX$39,4,FALSE)","v":20},{"$f":"+VLOOKUP(+$A10,'Data Input'!$A$3:$AX$39,5,FALSE)","v":-23},{"$f":"+VLOOKUP(+$A10,'Data Input'!$A$3:$AX$39,6,FALSE)","v":"DNS"},{"$f":"+VLOOKUP(+$A10,'Data Input'!$A$3:$AX$39,7,FALSE)","v":"C"},{"$f":"+VLOOKUP($A10,'Data Input'!$A$3:$AX$39,33,FALSE)","v":0},{"$f":"+VLOOKUP($A10,'Data Input'!$A$3:$AX$39,34,FALSE)","v":0},{"$f":"+VLOOKUP($A10,'Data Input'!$A$3:$AX$39,35,FALSE)","v":0},null,{"$f":"+VLOOKUP($A10,'Data Input'!$A$3:$AX$39,37,FALSE)","v":"DNS"}]
[149,{"$f":"+VLOOKUP(+$A11,'Data Input'!$A$3:$AX$39,2,FALSE)","v":"Stella Genesta"},{"$f":"+VLOOKUP(+$A11,'Data Input'!$A$3:$AX$39,3,FALSE)","v":"M Burwood"},{"$f":"+VLOOKUP(+$A11,'Data Input'!$A$3:$AX$39,4,FALSE)","v":30},{"$f":"+VLOOKUP(+$A11,'Data Input'!$A$3:$AX$39,5,FALSE)","v":-19},{"$f":"+VLOOKUP(+$A11,'Data Input'!$A$3:$AX$39,6,FALSE)","v":0},{"$f":"+VLOOKUP(+$A11,'Data Input'!$A$3:$AX$39,7,FALSE)","v":"A"},{"$f":"+VLOOKUP($A11,'Data Input'!$A$3:$AX$39,33,FALSE)","v":5},{"$f":"+VLOOKUP($A11,'Data Input'!$A$3:$AX$39,34,FALSE)","v":30},{"$f":"+VLOOKUP($A11,'Data Input'!$A$3:$AX$39,35,FALSE)","v":15.840000000000146},null,{"$f":"+VLOOKUP($A11,'Data Input'!$A$3:$AX$39,37,FALSE)","v":21}]
[179,{"$f":"+VLOOKUP(+$A12,'Data Input'!$A$3:$AX$39,2,FALSE)","v":"Waxwing"},{"$f":"+VLOOKUP(+$A12,'Data Input'!$A$3:$AX$39,3,FALSE)","v":"R & S Clayton"},{"$f":"+VLOOKUP(+$A12,'Data Input'!$A$3:$AX$39,4,FALSE)","v":27},{"$f":"+VLOOKUP(+$A12,'Data Input'!$A$3:$AX$39,5,FALSE)","v":-8},{"$f":"+VLOOKUP(+$A12,'Data Input'!$A$3:$AX$39,6,FALSE)","v":0},{"$f":"+VLOOKUP(+$A12,'Data Input'!$A$3:$AX$39,7,FALSE)","v":"B"},{"$f":"+VLOOKUP($A12,'Data Input'!$A$3:$AX$39,33,FALSE)","v":5},{"$f":"+VLOOKUP($A12,'Data Input'!$A$3:$AX$39,34,FALSE)","v":16},{"$f":"+VLOOKUP($A12,'Data Input'!$A$3:$AX$39,35,FALSE)","v":15.920000000001892},null,{"$f":"+VLOOKUP($A12,'Data Input'!$A$3:$AX$39,37,FALSE)","v":11}]
[199,{"$f":"+VLOOKUP(+$A13,'Data Input'!$A$3:$AX$39,2,FALSE)","v":"Morning Calm"},{"$f":"+VLOOKUP(+$A13,'Data Input'!$A$3:$AX$39,3,FALSE)","v":"W Clark"},{"$f":"+VLOOKUP(+$A13,'Data Input'!$A$3:$AX$39,4,FALSE)","v":26},{"$f":"+VLOOKUP(+$A13,'Data Input'!$A$3:$AX$39,5,FALSE)","v":-9},{"$f":"+VLOOKUP(+$A13,'Data Input'!$A$3:$AX$39,6,FALSE)","v":0},{"$f":"+VLOOKUP(+$A13,'Data Input'!$A$3:$AX$39,7,FALSE)","v":"B"},{"$f":"+VLOOKUP($A13,'Data Input'!$A$3:$AX$39,33,FALSE)","v":5},{"$f":"+VLOOKUP($A13,'Data Input'!$A$3:$AX$39,34,FALSE)","v":0},{"$f":"+VLOOKUP($A13,'Data Input'!$A$3:$AX$39,35,FALSE)","v":53.490000000001601},null,{"$f":"+VLOOKUP($A13,'Data Input'!$A$3:$AX$39,37,FALSE)","v":6}]
[216,{"$f":"+VLOOKUP(+$A14,'Data Input'!$A$3:$AX$39,2,FALSE)","v":"Tamara"},{"$f":"+VLOOKUP(+$A14,'Data Input'!$A$3:$AX$39,3,FALSE)","v":"N Heath"},{"$f":"+VLOOKUP(+$A14,'Data Input'!$A$3:$AX$39,4,FALSE)","v":24.8},{"$f":"+VLOOKUP(+$A14,'Data Input'!$A$3:$AX$39,5,FALSE)","v":-16},{"$f":"+VLOOKUP(+$A14,'Data Input'!$A$3:$AX$39,6,FALSE)","v":"P"},{"$f":"+VLOOKUP(+$A14,'Data Input'!$A$3:$AX$39,7,FALSE)","v":"C"},{"$f":"+VLOOKUP($A14,'Data Input'!$A$3:$AX$39,33,FALSE)","v":5},{"$f":"+VLOOKUP($A14,'Data Input'!$A$3:$AX$39,34,FALSE)","v":13},{"$f":"+VLOOKUP($A14,'Data Input'!$A$3:$AX$39,35,FALSE)","v":30.959999999999127},null,{"$f":"+VLOOKUP($A14,'Data Input'!$A$3:$AX$39,37,FALSE)","v":"P"}]
[217,{"$f":"+VLOOKUP(+$A15,'Data Input'!$A$3:$AX$39,2,FALSE)","v":"Melinda"},{"$f":"+VLOOKUP(+$A15,'Data Input'!$A$3:$AX$39,3,FALSE)","v":"P Howes"},{"$f":"+VLOOKUP(+$A15,'Data Input'!$A$3:$AX$39,4,FALSE)","v":27.11},{"$f":"+VLOOKUP(+$A15,'Data Input'!$A$3:$AX$39,5,FALSE)","v":1},{"$f":"+VLOOKUP(+$A15,'Data Input'!$A$3:$AX$39,6,FALSE)","v":0},{"$f":"+VLOOKUP(+$A15,'Data Input'!$A$3:$AX$39,7,FALSE)","v":"B"},{"$f":"+VLOOKUP($A15,'Data Input'!$A$3:$AX$39,33,FALSE)","v":4},{"$f":"+VLOOKUP($A15,'Data Input'!$A$3:$AX$39,34,FALSE)","v":53},{"$f":"+VLOOKUP($A15,'Data Input'!$A$3:$AX$39,35,FALSE)","v":32.380000000001019},null,{"$f":"+VLOOKUP($A15,'Data Input'!$A$3:$AX$39,37,FALSE)","v":4}]
[218,{"$f":"+VLOOKUP(+$A16,'Data Input'!$A$3:$AX$39,2,FALSE)","v":"Mystery"},{"$f":"+VLOOKUP(+$A16,'Data Input'!$A$3:$AX$39,3,FALSE)","v":"M Ford"},{"$f":"+VLOOKUP(+$A16,'Data Input'!$A$3:$AX$39,4,FALSE)","v":26},{"$f":"+VLOOKUP(+$A16,'Data Input'!$A$3:$AX$39,5,FALSE)","v":-7},{"$f":"+VLOOKUP(+$A16,'Data Input'!$A$3:$AX$39,6,FALSE)","v":"RTD"},{"$f":"+VLOOKUP(+$A16,'Data Input'!$A$3:$AX$39,7,FALSE)","v":"B"},{"$f":"+VLOOKUP($A16,'Data Input'!$A$3:$AX$39,33,FALSE)","v":12},{"$f":"+VLOOKUP($A16,'Data Input'!$A$3:$AX$39,34,FALSE)","v":47},{"$f":"+VLOOKUP($A16,'Data Input'!$A$3:$AX$39,35,FALSE)","v":15},null,{"$f":"+VLOOKUP($A16,'Data Input'!$A$3:$AX$39,37,FALSE)","v":"RTD"}]
[224,{"$f":"+VLOOKUP(+$A17,'Data Input'!$A$3:$AX$39,2,FALSE)","v":"Anna"},{"$f":"+VLOOKUP(+$A17,'Data Input'!$A$3:$AX$39,3,FALSE)","v":"R Branscombe"},{"$f":"+VLOOKUP(+$A17,'Data Input'!$A$3:$AX$39,4,FALSE)","v":25},{"$f":"+VLOOKUP(+$A17,'Data Input'!$A$3:$AX$39,5,FALSE)","v":-10},{"$f":"+VLOOKUP(+$A17,'Data Input'!$A$3:$AX$39,6,FALSE)","v":0},{"$f":"+VLOOKUP(+$A17,'Data Input'!$A$3:$AX$39,7,FALSE)","v":"B"},{"$f":"+VLOOKUP($A17,'Data Input'!$A$3:$AX$39,33,FALSE)","v":5},{"$f":"+VLOOKUP($A17,'Data Input'!$A$3:$AX$39,34,FALSE)","v":27},{"$f":"+VLOOKUP($A17,'Data Input'!$A$3:$AX$39,35,FALSE)","v":40.5},null,{"$f":"+VLOOKUP($A17,'Data Input'!$A$3:$AX$39,37,FALSE)","v":19}]
[240,{"$f":"+VLOOKUP(+$A18,'Data Input'!$A$3:$AX$39,2,FALSE)","v":"Avocet"},{"$f":"+VLOOKUP(+$A18,'Data Input'!$A$3:$AX$39,3,FALSE)","v":"R  Branford"},{"$f":"+VLOOKUP(+$A18,'Data Input'!$A$3:$AX$39,4,FALSE)","v":28},{"$f":"+VLOOKUP(+$A18,'Data Input'!$A$3:$AX$39,5,FALSE)","v":-16},{"$f":"+VLOOKUP(+$A18,'Data Input'!$A$3:$AX$39,6,FALSE)","v":0},{"$f":"+VLOOKUP(+$A18,'Data Input'!$A$3:$AX$39,7,FALSE)","v":"B"},{"$f":"+VLOOKUP($A18,'Data Input'!$A$3:$AX$39,33,FALSE)","v":5},{"$f":"+VLOOKUP($A18,'Data Input'!$A$3:$AX$39,34,FALSE)","v":15},{"$f":"+VLOOKUP($A18,'Data Input'!$A$3:$AX$39,35,FALSE)","v":42},null,{"$f":"+VLOOKUP($A18,'Data Input'!$A$3:$AX$39,37,FALSE)","v":10}]
[250,{"$f":"+VLOOKUP(+$A19,'Data Input'!$A$3:$AX$39,2,FALSE)","v":"Storm"},{"$f":"+VLOOKUP(+$A19,'Data Input'!$A$3:$AX$39,3,FALSE)","v":"M Thwaites"},{"$f":"+VLOOKUP(+$A19,'Data Input'!$A$3:$AX$39,4,FALSE)","v":35},{"$f":"+VLOOKUP(+$A19,'Data Input'!$A$3:$AX$39,5,FALSE)","v":16},{"$f":"+VLOOKUP(+$A19,'Data Input'!$A$3:$AX$39,6,FALSE)","v":0},{"$f":"+VLOOKUP(+$A19,'Data Input'!$A$3:$AX$39,7,FALSE)","v":"A"},{"$f":"+VLOOKUP($A19,'Data Input'!$A$3:$AX$39,33,FALSE)","v":4},{"$f":"+VLOOKUP($A19,'Data Input'!$A$3:$AX$39,34,FALSE)","v":54},{"$f":"+VLOOKUP($A19,'Data Input'!$A$3:$AX$39,35,FALSE)","v":33.759999999998399},null,{"$f":"+VLOOKUP($A19,'Data Input'!$A$3:$AX$39,37,FALSE)","v":5}]
[262,{"$f":"+VLOOKUP(+$A20,'Data Input'!$A$3:$AX$39,2,FALSE)","v":"Jessie May"},{"$f":"+VLOOKUP(+$A20,'Data Input'!$A$3:$AX$39,3,FALSE)","v":"C Dugdale"},{"$f":"+VLOOKUP(+$A20,'Data Input'!$A$3:$AX$39,4,FALSE)","v":27.11},{"$f":"+VLOOKUP(+$A20,'Data Input'!$A$3:$AX$39,5,FALSE)","v":-5},{"$f":"+VLOOKUP(+$A20,'Data Input'!$A$3:$AX$39,6,FALSE)","v":0},{"$f":"+VLOOKUP(+$A20,'Data Input'!$A$3:$AX$39,7,FALSE)","v":"B"},{"$f":"+VLOOKUP($A20,'Data Input'!$A$3:$AX$39,33,FALSE)","v":5},{"$f":"+VLOOKUP($A20,'Data Input'!$A$3:$AX$39,34,FALSE)","v":18},{"$f":"+VLOOKUP($A20,'Data Input'!$A$3:$AX$39,35,FALSE)","v":37.80000000000291},null,{"$f":"+VLOOKUP($A20,'Data Input'!$A$3:$AX$39,37,FALSE)","v":13}]
[274,{"$f":"+VLOOKUP(+$A21,'Data Input'!$A$3:$AX$39,2,FALSE)","v":"Elfin"},{"$f":"+VLOOKUP(+$A21,'Data Input'!$A$3:$AX$39,3,FALSE)","v":"A Bond"},{"$f":"+VLOOKUP(+$A21,'Data Input'!$A$3:$AX$39,4,FALSE)","v":20},{"$f":"+VLOOKUP(+$A21,'Data Input'!$A$3:$AX$39,5,FALSE)","v":-27},{"$f":"+VLOOKUP(+$A21,'Data Input'!$A$3:$AX$39,6,FALSE)","v":0},{"$f":"+VLOOKUP(+$A21,'Data Input'!$A$3:$AX$39,7,FALSE)","v":"C"},{"$f":"+VLOOKUP($A21,'Data Input'!$A$3:$AX$39,33,FALSE)","v":6},{"$f":"+VLOOKUP($A21,'Data Input'!$A$3:$AX$39,34,FALSE)","v":2},{"$f":"+VLOOKUP($A21,'Data Input'!$A$3:$AX$39,35,FALSE)","v":44.950000000000728},null,{"$f":"+VLOOKUP($A21,'Data Input'!$A$3:$AX$39,37,FALSE)","v":24}]
[323,{"$f":"+VLOOKUP(+$A22,'Data Input'!$A$3:$AX$39,2,FALSE)","v":"Starlight Lady"},{"$f":"+VLOOKUP(+$A22,'Data Input'!$A$3:$AX$39,3,FALSE)","v":"N Matthews"},{"$f":"+VLOOKUP(+$A22,'Data Input'!$A$3:$AX$39,4,FALSE)","v":30},{"$f":"+VLOOKUP(+$A22,'Data Input'!$A$3:$AX$39,5,FALSE)","v":13},{"$f":"+VLOOKUP(+$A22,'Data Input'!$A$3:$AX$39,6,FALSE)","v":0},{"$f":"+VLOOKUP(+$A22,'Data Input'!$A$3:$AX$39,7,FALSE)","v":"A"},{"$f":"+VLOOKUP($A22,'Data Input'!$A$3:$AX$39,33,FALSE)","v":5},{"$f":"+VLOOKUP($A22,'Data Input'!$A$3:$AX$39,34,FALSE)","v":21},{"$f":"+VLOOKUP($A22,'Data Input'!$A$3:$AX$39,35,FALSE)","v":27.970000000001164},null,{"$f":"+VLOOKUP($A22,'Data Input'!$A$3:$AX$39,37,FALSE)","v":14}]
[368,{"$f":"+VLOOKUP(+$A23,'Data Input'!$A$3:$AX$39,2,FALSE)","v":"Wandering Rose"},{"$f":"+VLOOKUP(+$A23,'Data Input'!$A$3:$AX$39,3,FALSE)","v":" D Radley"},{"$f":"+VLOOKUP(+$A23,'Data Input'!$A$3:$AX$39,4,FALSE)","v":31.6},{"$f":"+VLOOKUP(+$A23,'Data Input'!$A$3:$AX$39,5,FALSE)","v":-2},{"$f":"+VLOOKUP(+$A23,'Data Input'!$A$3:$AX$39,6,FALSE)","v":0},{"$f":"+VLOOKUP(+$A23,'Data Input'!$A$3:$AX$39,7,FALSE)","v":"A"},{"$f":"+VLOOKUP($A23,'Data Input'!$A$3:$AX$39,33,FALSE)","v":5},{"$f":"+VLOOKUP($A23,'Data Input'!$A$3:$AX$39,34,FALSE)","v":26},{"$f":"+VLOOKUP($A23,'Data Input'!$A$3:$AX$39,35,FALSE)","v":12.56000000000131},null,{"$f":"+VLOOKUP($A23,'Data Input'!$A$3:$AX$39,37,FALSE)","v":17}]
[369,{"$f":"+VLOOKUP(+$A24,'Data Input'!$A$3:$AX$39,2,FALSE)","v":"Moonshadow"},{"$f":"+VLOOKUP(+$A24,'Data Input'!$A$3:$AX$39,3,FALSE)","v":"N Hovey"},{"$f":"+VLOOKUP(+$A24,'Data Input'!$A$3:$AX$39,4,FALSE)","v":31.6},{"$f":"+VLOOKUP(+$A24,'Data Input'!$A$3:$AX$39,5,FALSE)","v":5},{"$f":"+VLOOKUP(+$A24,'Data Input'!$A$3:$AX$39,6,FALSE)","v":""},{"$f":"+VLOOKUP(+$A24,'Data Input'!$A$3:$AX$39,7,FALSE)","v":"A"},{"$f":"+VLOOKUP($A24,'Data Input'!$A$3:$AX$39,33,FALSE)","v":5},{"$f":"+VLOOKUP($A24,'Data Input'!$A$3:$AX$39,34,FALSE)","v":0},{"$f":"+VLOOKUP($A24,'Data Input'!$A$3:$AX$39,35,FALSE)","v":55.799999999999272},null,{"$f":"+VLOOKUP($A24,'Data Input'!$A$3:$AX$39,37,FALSE)","v":7}]
[370,{"$f":"+VLOOKUP(+$A25,'Data Input'!$A$3:$AX$39,2,FALSE)","v":"Glory"},{"$f":"+VLOOKUP(+$A25,'Data Input'!$A$3:$AX$39,3,FALSE)","v":"C Brown"},{"$f":"+VLOOKUP(+$A25,'Data Input'!$A$3:$AX$39,4,FALSE)","v":35},{"$f":"+VLOOKUP(+$A25,'Data Input'!$A$3:$AX$39,5,FALSE)","v":-6},{"$f":"+VLOOKUP(+$A25,'Data Input'!$A$3:$AX$39,6,FALSE)","v":""},{"$f":"+VLOOKUP(+$A25,'Data Input'!$A$3:$AX$39,7,FALSE)","v":"A"},{"$f":"+VLOOKUP($A25,'Data Input'!$A$3:$AX$39,33,FALSE)","v":5},{"$f":"+VLOOKUP($A25,'Data Input'!$A$3:$AX$39,34,FALSE)","v":25},{"$f":"+VLOOKUP($A25,'Data Input'!$A$3:$AX$39,35,FALSE)","v":1.2400000000016007},null,{"$f":"+VLOOKUP($A25,'Data Input'!$A$3:$AX$39,37,FALSE)","v":16}]
[375,{"$f":"+VLOOKUP(+$A26,'Data Input'!$A$3:$AX$39,2,FALSE)","v":"Amaryllis"},{"$f":"+VLOOKUP(+$A26,'Data Input'!$A$3:$AX$39,3,FALSE)","v":"C Tuckett"},{"$f":"+VLOOKUP(+$A26,'Data Input'!$A$3:$AX$39,4,FALSE)","v":21.4},{"$f":"+VLOOKUP(+$A26,'Data Input'!$A$3:$AX$39,5,FALSE)","v":-10},{"$f":"+VLOOKUP(+$A26,'Data Input'!$A$3:$AX$39,6,FALSE)","v":0},{"$f":"+VLOOKUP(+$A26,'Data Input'!$A$3:$AX$39,7,FALSE)","v":"C"},{"$f":"+VLOOKUP($A26,'Data Input'!$A$3:$AX$39,33,FALSE)","v":5},{"$f":"+VLOOKUP($A26,'Data Input'!$A$3:$AX$39,34,FALSE)","v":4},{"$f":"+VLOOKUP($A26,'Data Input'!$A$3:$AX$39,35,FALSE)","v":38.100000000002183},null,{"$f":"+VLOOKUP($A26,'Data Input'!$A$3:$AX$39,37,FALSE)","v":8}]
[400,{"$f":"+VLOOKUP(+$A27,'Data Input'!$A$3:$AX$39,2,FALSE)","v":"Swallow"},{"$f":"+VLOOKUP(+$A27,'Data Input'!$A$3:$AX$39,3,FALSE)","v":"K Halifax"},{"$f":"+VLOOKUP(+$A27,'Data Input'!$A$3:$AX$39,4,FALSE)","v":26},{"$f":"+VLOOKUP(+$A27,'Data Input'!$A$3:$AX$39,5,FALSE)","v":-7},{"$f":"+VLOOKUP(+$A27,'Data Input'!$A$3:$AX$39,6,FALSE)","v":""},{"$f":"+VLOOKUP(+$A27,'Data Input'!$A$3:$AX$39,7,FALSE)","v":"B"},{"$f":"+VLOOKUP($A27,'Data Input'!$A$3:$AX$39,33,FALSE)","v":5},{"$f":"+VLOOKUP($A27,'Data Input'!$A$3:$AX$39,34,FALSE)","v":34},{"$f":"+VLOOKUP($A27,'Data Input'!$A$3:$AX$39,35,FALSE)","v":41.490000000001601},null,{"$f":"+VLOOKUP($A27,'Data Input'!$A$3:$AX$39,37,FALSE)","v":23}]
[403,{"$f":"+VLOOKUP(+$A28,'Data Input'!$A$3:$AX$39,2,FALSE)","v":"May"},{"$f":"+VLOOKUP(+$A28,'Data Input'!$A$3:$AX$39,3,FALSE)","v":"K Rhead"},{"$f":"+VLOOKUP(+$A28,'Data Input'!$A$3:$AX$39,4,FALSE)","v":30},{"$f":"+VLOOKUP(+$A28,'Data Input'!$A$3:$AX$39,5,FALSE)","v":-10},{"$f":"+VLOOKUP(+$A28,'Data Input'!$A$3:$AX$39,6,FALSE)","v":"DNF"},{"$f":"+VLOOKUP(+$A28,'Data Input'!$A$3:$AX$39,7,FALSE)","v":"A"},{"$f":"+VLOOKUP($A28,'Data Input'!$A$3:$AX$39,33,FALSE)","v":11},{"$f":"+VLOOKUP($A28,'Data Input'!$A$3:$AX$39,34,FALSE)","v":28},{"$f":"+VLOOKUP($A28,'Data Input'!$A$3:$AX$39,35,FALSE)","v":30},null,{"$f":"+VLOOKUP($A28,'Data Input'!$A$3:$AX$39,37,FALSE)","v":"DNF"}]
[416,{"$f":"+VLOOKUP(+$A29,'Data Input'!$A$3:$AX$39,2,FALSE)","v":"Alice Rose"},{"$f":"+VLOOKUP(+$A29,'Data Input'!$A$3:$AX$39,3,FALSE)","v":"T Riches"},{"$f":"+VLOOKUP(+$A29,'Data Input'!$A$3:$AX$39,4,FALSE)","v":28.6},{"$f":"+VLOOKUP(+$A29,'Data Input'!$A$3:$AX$39,5,FALSE)","v":-7},{"$f":"+VLOOKUP(+$A29,'Data Input'!$A$3:$AX$39,6,FALSE)","v":0},{"$f":"+VLOOKUP(+$A29,'Data Input'!$A$3:$AX$39,7,FALSE)","v":"A"},{"$f":"+VLOOKUP($A29,'Data Input'!$A$3:$AX$39,33,FALSE)","v":5},{"$f":"+VLOOKUP($A29,'Data Input'!$A$3:$AX$39,34,FALSE)","v":17},{"$f":"+VLOOKUP($A29,'Data Input'!$A$3:$AX$39,35,FALSE)","v":28.260000000002037},null,{"$f":"+VLOOKUP($A29,'Data Input'!$A$3:$AX$39,37,FALSE)","v":12}]
[417,{"$f":"+VLOOKUP(+$A30,'Data Input'!$A$3:$AX$39,2,FALSE)","v":"Stellar"},{"$f":"+VLOOKUP(+$A30,'Data Input'!$A$3:$AX$39,3,FALSE)","v":"T Frary"},{"$f":"+VLOOKUP(+$A30,'Data Input'!$A$3:$AX$39,4,FALSE)","v":31.4},{"$f":"+VLOOKUP(+$A30,'Data Input'!$A$3:$AX$39,5,FALSE)","v":17},{"$f":"+VLOOKUP(+$A30,'Data Input'!$A$3:$AX$39,6,FALSE)","v":0},{"$f":"+VLOOKUP(+$A30,'Data Input'!$A$3:$AX$39,7,FALSE)","v":"A"},{"$f":"+VLOOKUP($A30,'Data Input'!$A$3:$AX$39,33,FALSE)","v":4},{"$f":"+VLOOKUP($A30,'Data Input'!$A$3:$AX$39,34,FALSE)","v":33},{"$f":"+VLOOKUP($A30,'Data Input'!$A$3:$AX$39,35,FALSE)","v":16.379999999997381},null,{"$f":"+VLOOKUP($A30,'Data Input'!$A$3:$AX$39,37,FALSE)","v":1}]
[418,{"$f":"+VLOOKUP(+$A31,'Data Input'!$A$3:$AX$39,2,FALSE)","v":"Tinkerbell"},{"$f":"+VLOOKUP(+$A31,'Data Input'!$A$3:$AX$39,3,FALSE)","v":"A Lincoln"},{"$f":"+VLOOKUP(+$A31,'Data Input'!$A$3:$AX$39,4,FALSE)","v":25.2},{"$f":"+VLOOKUP(+$A31,'Data Input'!$A$3:$AX$39,5,FALSE)","v":-8},{"$f":"+VLOOKUP(+$A31,'Data Input'!$A$3:$AX$39,6,FALSE)","v":""},{"$f":"+VLOOKUP(+$A31,'Data Input'!$A$3:$AX$39,7,FALSE)","v":"B"},{"$f":"+VLOOKUP($A31,'Data Input'!$A$3:$AX$39,33,FALSE)","v":4},{"$f":"+VLOOKUP($A31,'Data Input'!$A$3:$AX$39,34,FALSE)","v":50},{"$f":"+VLOOKUP($A31,'Data Input'!$A$3:$AX$39,35,FALSE)","v":59.760000000002037},null,{"$f":"+VLOOKUP($A31,'Data Input'!$A$3:$AX$39,37,FALSE)","v":3}]
[420,{"$f":"+VLOOKUP(+$A32,'Data Input'!$A$3:$AX$39,2,FALSE)","v":"Lyra"},{"$f":"+VLOOKUP(+$A32,'Data Input'!$A$3:$AX$39,3,FALSE)","v":"P Carrington"},{"$f":"+VLOOKUP(+$A32,'Data Input'!$A$3:$AX$39,4,FALSE)","v":30},{"$f":"+VLOOKUP(+$A32,'Data Input'!$A$3:$AX$39,5,FALSE)","v":16},{"$f":"+VLOOKUP(+$A32,'Data Input'!$A$3:$AX$39,6,FALSE)","v":"DNS"},{"$f":"+VLOOKUP(+$A32,'Data Input'!$A$3:$AX$39,7,FALSE)","v":"A"},{"$f":"+VLOOKUP($A32,'Data Input'!$A$3:$AX$39,33,FALSE)","v":0},{"$f":"+VLOOKUP($A32,'Data Input'!$A$3:$AX$39,34,FALSE)","v":0},{"$f":"+VLOOKUP($A32,'Data Input'!$A$3:$AX$39,35,FALSE)","v":0},null,{"$f":"+VLOOKUP($A32,'Data Input'!$A$3:$AX$39,37,FALSE)","v":"DNS"}]
[429,{"$f":"+VLOOKUP(+$A33,'Data Input'!$A$3:$AX$39,2,FALSE)","v":"Pickle"},{"$f":"+VLOOKUP(+$A33,'Data Input'!$A$3:$AX$39,3,FALSE)","v":"P Montague"},{"$f":"+VLOOKUP(+$A33,'Data Input'!$A$3:$AX$39,4,FALSE)","v":22.6},{"$f":"+VLOOKUP(+$A33,'Data Input'!$A$3:$AX$39,5,FALSE)","v":-16},{"$f":"+VLOOKUP(+$A33,'Data Input'!$A$3:$AX$39,6,FALSE)","v":0},{"$f":"+VLOOKUP(+$A33,'Data Input'!$A$3:$AX$39,7,FALSE)","v":"C"},{"$f":"+VLOOKUP($A33,'Data Input'!$A$3:$AX$39,33,FALSE)","v":4},{"$f":"+VLOOKUP($A33,'Data Input'!$A$3:$AX$39,34,FALSE)","v":50},{"$f":"+VLOOKUP($A33,'Data Input'!$A$3:$AX$39,35,FALSE)","v":34.200000000000728},null,{"$f":"+VLOOKUP($A33,'Data Input'!$A$3:$AX$39,37,FALSE)","v":2}]
[]
[]
[]
[]
[]
[]
[]
[]
[]
[]
[]
[]
[]
[]
[]
[]
[]
[]
[]
[{"$f":"+COUNT(A3:A52)","v":31}]

{"sheet":"Classes A","index":4,"n_rows":23,"n_cols":14,"rows_kept":23,"cut":false,"hidden":false,"merged":[]}
["Starlight Lady",null,null,null,null,null,null,null,"Corrected",null,null,null,null,"CLASS POSITION"]
["No","Yacht","Skipper","Length","H/C","P","Class","H","M","S",null,"Pos"," "]
[10,{"$f":"+VLOOKUP(+$A3,'Data Input'!$A$3:$AX$39,2,FALSE)","v":"Flight"},{"$f":"+VLOOKUP(+$A3,'Data Input'!$A$3:$AX$39,3,FALSE)","v":"J Farrow"},{"$f":"+VLOOKUP(+$A3,'Data Input'!$A$3:$AX$39,4,FALSE)","v":29.11},{"$f":"+VLOOKUP(+$A3,'Data Input'!$A$3:$AX$39,5,FALSE)","v":-9},{"$f":"+VLOOKUP(+$A3,'Data Input'!$A$3:$AX$39,6,FALSE)","v":0},{"$f":"+VLOOKUP(+$A3,'Data Input'!$A$3:$AX$39,7,FALSE)","v":"A"},{"$f":"+VLOOKUP($A3,'Data Input'!$A$3:$AX$39,33,FALSE)","v":5},{"$f":"+VLOOKUP($A3,'Data Input'!$A$3:$AX$39,34,FALSE)","v":28},{"$f":"+VLOOKUP($A3,'Data Input'!$A$3:$AX$39,35,FALSE)","v":25.139999999999418},null,{"$f":"+VLOOKUP($A3,'Data Input'!$A$3:$AX$39,37,FALSE)","v":20},null,"9th"]
[22,{"$f":"+VLOOKUP(+$A4,'Data Input'!$A$3:$AX$39,2,FALSE)","v":"Moonraker"},{"$f":"+VLOOKUP(+$A4,'Data Input'!$A$3:$AX$39,3,FALSE)","v":"P Jeckells"},{"$f":"+VLOOKUP(+$A4,'Data Input'!$A$3:$AX$39,4,FALSE)","v":29.6},{"$f":"+VLOOKUP(+$A4,'Data Input'!$A$3:$AX$39,5,FALSE)","v":2},{"$f":"+VLOOKUP(+$A4,'Data Input'!$A$3:$AX$39,6,FALSE)","v":0},{"$f":"+VLOOKUP(+$A4,'Data Input'!$A$3:$AX$39,7,FALSE)","v":"A"},{"$f":"+VLOOKUP($A4,'Data Input'!$A$3:$AX$39,33,FALSE)","v":5},{"$f":"+VLOOKUP($A4,'Data Input'!$A$3:$AX$39,34,FALSE)","v":13},{"$f":"+VLOOKUP($A4,'Data Input'!$A$3:$AX$39,35,FALSE)","v":44.099999999998545},null,{"$f":"+VLOOKUP($A4,'Data Input'!$A$3:$AX$39,37,FALSE)","v":9},null,"4th"]
[52,{"$f":"+VLOOKUP(+$A5,'Data Input'!$A$3:$AX$39,2,FALSE)","v":"Maidie"},{"$f":"+VLOOKUP(+$A5,'Data Input'!$A$3:$AX$39,3,FALSE)","v":"M Barnes"},{"$f":"+VLOOKUP(+$A5,'Data Input'!$A$3:$AX$39,4,FALSE)","v":43},{"$f":"+VLOOKUP(+$A5,'Data Input'!$A$3:$AX$39,5,FALSE)","v":10},{"$f":"+VLOOKUP(+$A5,'Data Input'!$A$3:$AX$39,6,FALSE)","v":"DNF"},{"$f":"+VLOOKUP(+$A5,'Data Input'!$A$3:$AX$39,7,FALSE)","v":"A"},{"$f":"+VLOOKUP($A5,'Data Input'!$A$3:$AX$39,33,FALSE)","v":15},{"$f":"+VLOOKUP($A5,'Data Input'!$A$3:$AX$39,34,FALSE)","v":57},{"$f":"+VLOOKUP($A5,'Data Input'!$A$3:$AX$39,35,FALSE)","v":0},null,{"$f":"+VLOOKUP($A5,'Data Input'!$A$3:$AX$39,37,FALSE)","v":"DNF"}]
[149,{"$f":"+VLOOKUP(+$A6,'Data Input'!$A$3:$AX$39,2,FALSE)","v":"Stella Genesta"},{"$f":"+VLOOKUP(+$A6,'Data Input'!$A$3:$AX$39,3,FALSE)","v":"M Burwood"},{"$f":"+VLOOKUP(+$A6,'Data Input'!$A$3:$AX$39,4,FALSE)","v":30},{"$f":"+VLOOKUP(+$A6,'Data Input'!$A$3:$AX$39,5,FALSE)","v":-19},{"$f":"+VLOOKUP(+$A6,'Data Input'!$A$3:$AX$39,6,FALSE)","v":0},{"$f":"+VLOOKUP(+$A6,'Data Input'!$A$3:$AX$39,7,FALSE)","v":"A"},{"$f":"+VLOOKUP($A6,'Data Input'!$A$3:$AX$39,33,FALSE)","v":5},{"$f":"+VLOOKUP($A6,'Data Input'!$A$3:$AX$39,34,FALSE)","v":30},{"$f":"+VLOOKUP($A6,'Data Input'!$A$3:$AX$39,35,FALSE)","v":15.840000000000146},null,{"$f":"+VLOOKUP($A6,'Data Input'!$A$3:$AX$39,37,FALSE)","v":21},null,"10th"]
[250,{"$f":"+VLOOKUP(+$A7,'Data Input'!$A$3:$AX$39,2,FALSE)","v":"Storm"},{"$f":"+VLOOKUP(+$A7,'Data Input'!$A$3:$AX$39,3,FALSE)","v":"M Thwaites"},{"$f":"+VLOOKUP(+$A7,'Data Input'!$A$3:$AX$39,4,FALSE)","v":35},{"$f":"+VLOOKUP(+$A7,'Data Input'!$A$3:$AX$39,5,FALSE)","v":16},{"$f":"+VLOOKUP(+$A7,'Data Input'!$A$3:$AX$39,6,FALSE)","v":0},{"$f":"+VLOOKUP(+$A7,'Data Input'!$A$3:$AX$39,7,FALSE)","v":"A"},{"$f":"+VLOOKUP($A7,'Data Input'!$A$3:$AX$39,33,FALSE)","v":4},{"$f":"+VLOOKUP($A7,'Data Input'!$A$3:$AX$39,34,FALSE)","v":54},{"$f":"+VLOOKUP($A7,'Data Input'!$A$3:$AX$39,35,FALSE)","v":33.759999999998399},null,{"$f":"+VLOOKUP($A7,'Data Input'!$A$3:$AX$39,37,FALSE)","v":5},null,"SECOND"]
[323,{"$f":"+VLOOKUP(+$A8,'Data Input'!$A$3:$AX$39,2,FALSE)","v":"Starlight Lady"},{"$f":"+VLOOKUP(+$A8,'Data Input'!$A$3:$AX$39,3,FALSE)","v":"N Matthews"},{"$f":"+VLOOKUP(+$A8,'Data Input'!$A$3:$AX$39,4,FALSE)","v":30},{"$f":"+VLOOKUP(+$A8,'Data Input'!$A$3:$AX$39,5,FALSE)","v":13},{"$f":"+VLOOKUP(+$A8,'Data Input'!$A$3:$AX$39,6,FALSE)","v":0},{"$f":"+VLOOKUP(+$A8,'Data Input'!$A$3:$AX$39,7,FALSE)","v":"A"},{"$f":"+VLOOKUP($A8,'Data Input'!$A$3:$AX$39,33,FALSE)","v":5},{"$f":"+VLOOKUP($A8,'Data Input'!$A$3:$AX$39,34,FALSE)","v":21},{"$f":"+VLOOKUP($A8,'Data Input'!$A$3:$AX$39,35,FALSE)","v":27.970000000001164},null,{"$f":"+VLOOKUP($A8,'Data Input'!$A$3:$AX$39,37,FALSE)","v":14},null,"6th"]
[368,{"$f":"+VLOOKUP(+$A9,'Data Input'!$A$3:$AX$39,2,FALSE)","v":"Wandering Rose"},{"$f":"+VLOOKUP(+$A9,'Data Input'!$A$3:$AX$39,3,FALSE)","v":" D Radley"},{"$f":"+VLOOKUP(+$A9,'Data Input'!$A$3:$AX$39,4,FALSE)","v":31.6},{"$f":"+VLOOKUP(+$A9,'Data Input'!$A$3:$AX$39,5,FALSE)","v":-2},{"$f":"+VLOOKUP(+$A9,'Data Input'!$A$3:$AX$39,6,FALSE)","v":0},{"$f":"+VLOOKUP(+$A9,'Data Input'!$A$3:$AX$39,7,FALSE)","v":"A"},{"$f":"+VLOOKUP($A9,'Data Input'!$A$3:$AX$39,33,FALSE)","v":5},{"$f":"+VLOOKUP($A9,'Data Input'!$A$3:$AX$39,34,FALSE)","v":26},{"$f":"+VLOOKUP($A9,'Data Input'!$A$3:$AX$39,35,FALSE)","v":12.56000000000131},null,{"$f":"+VLOOKUP($A9,'Data Input'!$A$3:$AX$39,37,FALSE)","v":17},null,"8th"]
[369,{"$f":"+VLOOKUP(+$A10,'Data Input'!$A$3:$AX$39,2,FALSE)","v":"Moonshadow"},{"$f":"+VLOOKUP(+$A10,'Data Input'!$A$3:$AX$39,3,FALSE)","v":"N Hovey"},{"$f":"+VLOOKUP(+$A10,'Data Input'!$A$3:$AX$39,4,FALSE)","v":31.6},{"$f":"+VLOOKUP(+$A10,'Data Input'!$A$3:$AX$39,5,FALSE)","v":5},{"$f":"+VLOOKUP(+$A10,'Data Input'!$A$3:$AX$39,6,FALSE)","v":""},{"$f":"+VLOOKUP(+$A10,'Data Input'!$A$3:$AX$39,7,FALSE)","v":"A"},{"$f":"+VLOOKUP($A10,'Data Input'!$A$3:$AX$39,33,FALSE)","v":5},{"$f":"+VLOOKUP($A10,'Data Input'!$A$3:$AX$39,34,FALSE)","v":0},{"$f":"+VLOOKUP($A10,'Data Input'!$A$3:$AX$39,35,FALSE)","v":55.799999999999272},null,{"$f":"+VLOOKUP($A10,'Data Input'!$A$3:$AX$39,37,FALSE)","v":7},null,"THIRD"]
[370,{"$f":"+VLOOKUP(+$A11,'Data Input'!$A$3:$AX$39,2,FALSE)","v":"Glory"},{"$f":"+VLOOKUP(+$A11,'Data Input'!$A$3:$AX$39,3,FALSE)","v":"C Brown"},{"$f":"+VLOOKUP(+$A11,'Data Input'!$A$3:$AX$39,4,FALSE)","v":35},{"$f":"+VLOOKUP(+$A11,'Data Input'!$A$3:$AX$39,5,FALSE)","v":-6},{"$f":"+VLOOKUP(+$A11,'Data Input'!$A$3:$AX$39,6,FALSE)","v":""},{"$f":"+VLOOKUP(+$A11,'Data Input'!$A$3:$AX$39,7,FALSE)","v":"A"},{"$f":"+VLOOKUP($A11,'Data Input'!$A$3:$AX$39,33,FALSE)","v":5},{"$f":"+VLOOKUP($A11,'Data Input'!$A$3:$AX$39,34,FALSE)","v":25},{"$f":"+VLOOKUP($A11,'Data Input'!$A$3:$AX$39,35,FALSE)","v":1.2400000000016007},null,{"$f":"+VLOOKUP($A11,'Data Input'!$A$3:$AX$39,37,FALSE)","v":16},null,"7th"]
[403,{"$f":"+VLOOKUP(+$A12,'Data Input'!$A$3:$AX$39,2,FALSE)","v":"May"},{"$f":"+VLOOKUP(+$A12,'Data Input'!$A$3:$AX$39,3,FALSE)","v":"K Rhead"},{"$f":"+VLOOKUP(+$A12,'Data Input'!$A$3:$AX$39,4,FALSE)","v":30},{"$f":"+VLOOKUP(+$A12,'Data Input'!$A$3:$AX$39,5,FALSE)","v":-10},{"$f":"+VLOOKUP(+$A12,'Data Input'!$A$3:$AX$39,6,FALSE)","v":"DNF"},{"$f":"+VLOOKUP(+$A12,'Data Input'!$A$3:$AX$39,7,FALSE)","v":"A"},{"$f":"+VLOOKUP($A12,'Data Input'!$A$3:$AX$39,33,FALSE)","v":11},{"$f":"+VLOOKUP($A12,'Data Input'!$A$3:$AX$39,34,FALSE)","v":28},{"$f":"+VLOOKUP($A12,'Data Input'!$A$3:$AX$39,35,FALSE)","v":30},null,{"$f":"+VLOOKUP($A12,'Data Input'!$A$3:$AX$39,37,FALSE)","v":"DNF"}]
[416,{"$f":"+VLOOKUP(+$A13,'Data Input'!$A$3:$AX$39,2,FALSE)","v":"Alice Rose"},{"$f":"+VLOOKUP(+$A13,'Data Input'!$A$3:$AX$39,3,FALSE)","v":"T Riches"},{"$f":"+VLOOKUP(+$A13,'Data Input'!$A$3:$AX$39,4,FALSE)","v":28.6},{"$f":"+VLOOKUP(+$A13,'Data Input'!$A$3:$AX$39,5,FALSE)","v":-7},{"$f":"+VLOOKUP(+$A13,'Data Input'!$A$3:$AX$39,6,FALSE)","v":0},{"$f":"+VLOOKUP(+$A13,'Data Input'!$A$3:$AX$39,7,FALSE)","v":"A"},{"$f":"+VLOOKUP($A13,'Data Input'!$A$3:$AX$39,33,FALSE)","v":5},{"$f":"+VLOOKUP($A13,'Data Input'!$A$3:$AX$39,34,FALSE)","v":17},{"$f":"+VLOOKUP($A13,'Data Input'!$A$3:$AX$39,35,FALSE)","v":28.260000000002037},null,{"$f":"+VLOOKUP($A13,'Data Input'!$A$3:$AX$39,37,FALSE)","v":12},null,"5th"]
[417,{"$f":"+VLOOKUP(+$A14,'Data Input'!$A$3:$AX$39,2,FALSE)","v":"Stellar"},{"$f":"+VLOOKUP(+$A14,'Data Input'!$A$3:$AX$39,3,FALSE)","v":"T Frary"},{"$f":"+VLOOKUP(+$A14,'Data Input'!$A$3:$AX$39,4,FALSE)","v":31.4},{"$f":"+VLOOKUP(+$A14,'Data Input'!$A$3:$AX$39,5,FALSE)","v":17},{"$f":"+VLOOKUP(+$A14,'Data Input'!$A$3:$AX$39,6,FALSE)","v":0},{"$f":"+VLOOKUP(+$A14,'Data Input'!$A$3:$AX$39,7,FALSE)","v":"A"},{"$f":"+VLOOKUP($A14,'Data Input'!$A$3:$AX$39,33,FALSE)","v":4},{"$f":"+VLOOKUP($A14,'Data Input'!$A$3:$AX$39,34,FALSE)","v":33},{"$f":"+VLOOKUP($A14,'Data Input'!$A$3:$AX$39,35,FALSE)","v":16.379999999997381},null,{"$f":"+VLOOKUP($A14,'Data Input'!$A$3:$AX$39,37,FALSE)","v":1},null,"FIRST"]
[420,{"$f":"+VLOOKUP(+$A15,'Data Input'!$A$3:$AX$39,2,FALSE)","v":"Lyra"},{"$f":"+VLOOKUP(+$A15,'Data Input'!$A$3:$AX$39,3,FALSE)","v":"P Carrington"},{"$f":"+VLOOKUP(+$A15,'Data Input'!$A$3:$AX$39,4,FALSE)","v":30},{"$f":"+VLOOKUP(+$A15,'Data Input'!$A$3:$AX$39,5,FALSE)","v":16},{"$f":"+VLOOKUP(+$A15,'Data Input'!$A$3:$AX$39,6,FALSE)","v":"DNS"},{"$f":"+VLOOKUP(+$A15,'Data Input'!$A$3:$AX$39,7,FALSE)","v":"A"},{"$f":"+VLOOKUP($A15,'Data Input'!$A$3:$AX$39,33,FALSE)","v":0},{"$f":"+VLOOKUP($A15,'Data Input'!$A$3:$AX$39,34,FALSE)","v":0},{"$f":"+VLOOKUP($A15,'Data Input'!$A$3:$AX$39,35,FALSE)","v":0},null,{"$f":"+VLOOKUP($A15,'Data Input'!$A$3:$AX$39,37,FALSE)","v":"DNS"}]
[]
[]
[]
[]
[]
[]
[]
[{"$f":"+COUNT(A3:A22)","v":13}]

{"sheet":"Classes B","index":5,"n_rows":22,"n_cols":14,"rows_kept":22,"cut":false,"hidden":false,"merged":[]}
["Jeckells",null,null,null,null,null,null,null,"Corrected",null,null,null,null,"CLASS POSITION"]
["No","Yacht","Skipper","Length","H/C","P","Class","H","M","S",null,"Pos"," "]
[24,{"$f":"+VLOOKUP(+$A3,'Data Input'!$A$3:$AX$39,2,FALSE)","v":"Pippa"},{"$f":"+VLOOKUP(+$A3,'Data Input'!$A$3:$AX$39,3,FALSE)","v":"G Angel"},{"$f":"+VLOOKUP(+$A3,'Data Input'!$A$3:$AX$39,4,FALSE)","v":27.1},{"$f":"+VLOOKUP(+$A3,'Data Input'!$A$3:$AX$39,5,FALSE)","v":-7},{"$f":"+VLOOKUP(+$A3,'Data Input'!$A$3:$AX$39,6,FALSE)","v":0},{"$f":"+VLOOKUP(+$A3,'Data Input'!$A$3:$AX$39,7,FALSE)","v":"B"},{"$f":"+VLOOKUP($A3,'Data Input'!$A$3:$AX$39,33,FALSE)","v":5},{"$f":"+VLOOKUP($A3,'Data Input'!$A$3:$AX$39,34,FALSE)","v":27},{"$f":"+VLOOKUP($A3,'Data Input'!$A$3:$AX$39,35,FALSE)","v":3},null,{"$f":"+VLOOKUP($A3,'Data Input'!$A$3:$AX$39,37,FALSE)","v":18},null,"7th"]
[25,{"$f":"+VLOOKUP(+$A4,'Data Input'!$A$3:$AX$39,2,FALSE)","v":"Melody"},{"$f":"+VLOOKUP(+$A4,'Data Input'!$A$3:$AX$39,3,FALSE)","v":"M Wells"},{"$f":"+VLOOKUP(+$A4,'Data Input'!$A$3:$AX$39,4,FALSE)","v":26},{"$f":"+VLOOKUP(+$A4,'Data Input'!$A$3:$AX$39,5,FALSE)","v":-11},{"$f":"+VLOOKUP(+$A4,'Data Input'!$A$3:$AX$39,6,FALSE)","v":0},{"$f":"+VLOOKUP(+$A4,'Data Input'!$A$3:$AX$39,7,FALSE)","v":"B"},{"$f":"+VLOOKUP($A4,'Data Input'!$A$3:$AX$39,33,FALSE)","v":5},{"$f":"+VLOOKUP($A4,'Data Input'!$A$3:$AX$39,34,FALSE)","v":30},{"$f":"+VLOOKUP($A4,'Data Input'!$A$3:$AX$39,35,FALSE)","v":20.299999999999272},null,{"$f":"+VLOOKUP($A4,'Data Input'!$A$3:$AX$39,37,FALSE)","v":22},null,"9th"]
[179,{"$f":"+VLOOKUP(+$A5,'Data Input'!$A$3:$AX$39,2,FALSE)","v":"Waxwing"},{"$f":"+VLOOKUP(+$A5,'Data Input'!$A$3:$AX$39,3,FALSE)","v":"R & S Clayton"},{"$f":"+VLOOKUP(+$A5,'Data Input'!$A$3:$AX$39,4,FALSE)","v":27},{"$f":"+VLOOKUP(+$A5,'Data Input'!$A$3:$AX$39,5,FALSE)","v":-8},{"$f":"+VLOOKUP(+$A5,'Data Input'!$A$3:$AX$39,6,FALSE)","v":0},{"$f":"+VLOOKUP(+$A5,'Data Input'!$A$3:$AX$39,7,FALSE)","v":"B"},{"$f":"+VLOOKUP($A5,'Data Input'!$A$3:$AX$39,33,FALSE)","v":5},{"$f":"+VLOOKUP($A5,'Data Input'!$A$3:$AX$39,34,FALSE)","v":16},{"$f":"+VLOOKUP($A5,'Data Input'!$A$3:$AX$39,35,FALSE)","v":15.920000000001892},null,{"$f":"+VLOOKUP($A5,'Data Input'!$A$3:$AX$39,37,FALSE)","v":11},null,"5th"]
[199,{"$f":"+VLOOKUP(+$A6,'Data Input'!$A$3:$AX$39,2,FALSE)","v":"Morning Calm"},{"$f":"+VLOOKUP(+$A6,'Data Input'!$A$3:$AX$39,3,FALSE)","v":"W Clark"},{"$f":"+VLOOKUP(+$A6,'Data Input'!$A$3:$AX$39,4,FALSE)","v":26},{"$f":"+VLOOKUP(+$A6,'Data Input'!$A$3:$AX$39,5,FALSE)","v":-9},{"$f":"+VLOOKUP(+$A6,'Data Input'!$A$3:$AX$39,6,FALSE)","v":0},{"$f":"+VLOOKUP(+$A6,'Data Input'!$A$3:$AX$39,7,FALSE)","v":"B"},{"$f":"+VLOOKUP($A6,'Data Input'!$A$3:$AX$39,33,FALSE)","v":5},{"$f":"+VLOOKUP($A6,'Data Input'!$A$3:$AX$39,34,FALSE)","v":0},{"$f":"+VLOOKUP($A6,'Data Input'!$A$3:$AX$39,35,FALSE)","v":53.490000000001601},null,{"$f":"+VLOOKUP($A6,'Data Input'!$A$3:$AX$39,37,FALSE)","v":6},null,"THIRD"]
[217,{"$f":"+VLOOKUP(+$A7,'Data Input'!$A$3:$AX$39,2,FALSE)","v":"Melinda"},{"$f":"+VLOOKUP(+$A7,'Data Input'!$A$3:$AX$39,3,FALSE)","v":"P Howes"},{"$f":"+VLOOKUP(+$A7,'Data Input'!$A$3:$AX$39,4,FALSE)","v":27.11},{"$f":"+VLOOKUP(+$A7,'Data Input'!$A$3:$AX$39,5,FALSE)","v":1},{"$f":"+VLOOKUP(+$A7,'Data Input'!$A$3:$AX$39,6,FALSE)","v":0},{"$f":"+VLOOKUP(+$A7,'Data Input'!$A$3:$AX$39,7,FALSE)","v":"B"},{"$f":"+VLOOKUP($A7,'Data Input'!$A$3:$AX$39,33,FALSE)","v":4},{"$f":"+VLOOKUP($A7,'Data Input'!$A$3:$AX$39,34,FALSE)","v":53},{"$f":"+VLOOKUP($A7,'Data Input'!$A$3:$AX$39,35,FALSE)","v":32.380000000001019},null,{"$f":"+VLOOKUP($A7,'Data Input'!$A$3:$AX$39,37,FALSE)","v":4},null,"SECOND"]
[218,{"$f":"+VLOOKUP(+$A8,'Data Input'!$A$3:$AX$39,2,FALSE)","v":"Mystery"},{"$f":"+VLOOKUP(+$A8,'Data Input'!$A$3:$AX$39,3,FALSE)","v":"M Ford"},{"$f":"+VLOOKUP(+$A8,'Data Input'!$A$3:$AX$39,4,FALSE)","v":26},{"$f":"+VLOOKUP(+$A8,'Data Input'!$A$3:$AX$39,5,FALSE)","v":-7},{"$f":"+VLOOKUP(+$A8,'Data Input'!$A$3:$AX$39,6,FALSE)","v":"RTD"},{"$f":"+VLOOKUP(+$A8,'Data Input'!$A$3:$AX$39,7,FALSE)","v":"B"},{"$f":"+VLOOKUP($A8,'Data Input'!$A$3:$AX$39,33,FALSE)","v":12},{"$f":"+VLOOKUP($A8,'Data Input'!$A$3:$AX$39,34,FALSE)","v":47},{"$f":"+VLOOKUP($A8,'Data Input'!$A$3:$AX$39,35,FALSE)","v":15},null,{"$f":"+VLOOKUP($A8,'Data Input'!$A$3:$AX$39,37,FALSE)","v":"RTD"}]
[224,{"$f":"+VLOOKUP(+$A9,'Data Input'!$A$3:$AX$39,2,FALSE)","v":"Anna"},{"$f":"+VLOOKUP(+$A9,'Data Input'!$A$3:$AX$39,3,FALSE)","v":"R Branscombe"},{"$f":"+VLOOKUP(+$A9,'Data Input'!$A$3:$AX$39,4,FALSE)","v":25},{"$f":"+VLOOKUP(+$A9,'Data Input'!$A$3:$AX$39,5,FALSE)","v":-10},{"$f":"+VLOOKUP(+$A9,'Data Input'!$A$3:$AX$39,6,FALSE)","v":0},{"$f":"+VLOOKUP(+$A9,'Data Input'!$A$3:$AX$39,7,FALSE)","v":"B"},{"$f":"+VLOOKUP($A9,'Data Input'!$A$3:$AX$39,33,FALSE)","v":5},{"$f":"+VLOOKUP($A9,'Data Input'!$A$3:$AX$39,34,FALSE)","v":27},{"$f":"+VLOOKUP($A9,'Data Input'!$A$3:$AX$39,35,FALSE)","v":40.5},null,{"$f":"+VLOOKUP($A9,'Data Input'!$A$3:$AX$39,37,FALSE)","v":19},null,"8th"]
[240,{"$f":"+VLOOKUP(+$A10,'Data Input'!$A$3:$AX$39,2,FALSE)","v":"Avocet"},{"$f":"+VLOOKUP(+$A10,'Data Input'!$A$3:$AX$39,3,FALSE)","v":"R  Branford"},{"$f":"+VLOOKUP(+$A10,'Data Input'!$A$3:$AX$39,4,FALSE)","v":28},{"$f":"+VLOOKUP(+$A10,'Data Input'!$A$3:$AX$39,5,FALSE)","v":-16},{"$f":"+VLOOKUP(+$A10,'Data Input'!$A$3:$AX$39,6,FALSE)","v":0},{"$f":"+VLOOKUP(+$A10,'Data Input'!$A$3:$AX$39,7,FALSE)","v":"B"},{"$f":"+VLOOKUP($A10,'Data Input'!$A$3:$AX$39,33,FALSE)","v":5},{"$f":"+VLOOKUP($A10,'Data Input'!$A$3:$AX$39,34,FALSE)","v":15},{"$f":"+VLOOKUP($A10,'Data Input'!$A$3:$AX$39,35,FALSE)","v":42},null,{"$f":"+VLOOKUP($A10,'Data Input'!$A$3:$AX$39,37,FALSE)","v":10},null,"4th"]
[262,{"$f":"+VLOOKUP(+$A11,'Data Input'!$A$3:$AX$39,2,FALSE)","v":"Jessie May"},{"$f":"+VLOOKUP(+$A11,'Data Input'!$A$3:$AX$39,3,FALSE)","v":"C Dugdale"},{"$f":"+VLOOKUP(+$A11,'Data Input'!$A$3:$AX$39,4,FALSE)","v":27.11},{"$f":"+VLOOKUP(+$A11,'Data Input'!$A$3:$AX$39,5,FALSE)","v":-5},{"$f":"+VLOOKUP(+$A11,'Data Input'!$A$3:$AX$39,6,FALSE)","v":0},{"$f":"+VLOOKUP(+$A11,'Data Input'!$A$3:$AX$39,7,FALSE)","v":"B"},{"$f":"+VLOOKUP($A11,'Data Input'!$A$3:$AX$39,33,FALSE)","v":5},{"$f":"+VLOOKUP($A11,'Data Input'!$A$3:$AX$39,34,FALSE)","v":18},{"$f":"+VLOOKUP($A11,'Data Input'!$A$3:$AX$39,35,FALSE)","v":37.80000000000291},null,{"$f":"+VLOOKUP($A11,'Data Input'!$A$3:$AX$39,37,FALSE)","v":13},null,"6th"]
[400,{"$f":"+VLOOKUP(+$A12,'Data Input'!$A$3:$AX$39,2,FALSE)","v":"Swallow"},{"$f":"+VLOOKUP(+$A12,'Data Input'!$A$3:$AX$39,3,FALSE)","v":"K Halifax"},{"$f":"+VLOOKUP(+$A12,'Data Input'!$A$3:$AX$39,4,FALSE)","v":26},{"$f":"+VLOOKUP(+$A12,'Data Input'!$A$3:$AX$39,5,FALSE)","v":-7},{"$f":"+VLOOKUP(+$A12,'Data Input'!$A$3:$AX$39,6,FALSE)","v":""},{"$f":"+VLOOKUP(+$A12,'Data Input'!$A$3:$AX$39,7,FALSE)","v":"B"},{"$f":"+VLOOKUP($A12,'Data Input'!$A$3:$AX$39,33,FALSE)","v":5},{"$f":"+VLOOKUP($A12,'Data Input'!$A$3:$AX$39,34,FALSE)","v":34},{"$f":"+VLOOKUP($A12,'Data Input'!$A$3:$AX$39,35,FALSE)","v":41.490000000001601},null,{"$f":"+VLOOKUP($A12,'Data Input'!$A$3:$AX$39,37,FALSE)","v":23},null,"10th"]
[418,{"$f":"+VLOOKUP(+$A13,'Data Input'!$A$3:$AX$39,2,FALSE)","v":"Tinkerbell"},{"$f":"+VLOOKUP(+$A13,'Data Input'!$A$3:$AX$39,3,FALSE)","v":"A Lincoln"},{"$f":"+VLOOKUP(+$A13,'Data Input'!$A$3:$AX$39,4,FALSE)","v":25.2},{"$f":"+VLOOKUP(+$A13,'Data Input'!$A$3:$AX$39,5,FALSE)","v":-8},{"$f":"+VLOOKUP(+$A13,'Data Input'!$A$3:$AX$39,6,FALSE)","v":""},{"$f":"+VLOOKUP(+$A13,'Data Input'!$A$3:$AX$39,7,FALSE)","v":"B"},{"$f":"+VLOOKUP($A13,'Data Input'!$A$3:$AX$39,33,FALSE)","v":4},{"$f":"+VLOOKUP($A13,'Data Input'!$A$3:$AX$39,34,FALSE)","v":50},{"$f":"+VLOOKUP($A13,'Data Input'!$A$3:$AX$39,35,FALSE)","v":59.760000000002037},null,{"$f":"+VLOOKUP($A13,'Data Input'!$A$3:$AX$39,37,FALSE)","v":3},null,"FIRST"]
[]
[]
[]
[]
[]
[]
[]
[]
[{"$f":"+COUNT(A3:A21)","v":11}]

{"sheet":"Classes C","index":6,"n_rows":15,"n_cols":14,"rows_kept":15,"cut":false,"hidden":false,"merged":[]}
["Wilberforce Smith",null,null,null,null,null,null,null,"Corrected"]
["No","Yacht","Skipper","Length","H/C","P","Class","H","M","S",null,"Pos"," ","CLASS POSITION"]
[79,{"$f":"+VLOOKUP(+$A3,'Data Input'!$A$3:$AX$39,2,FALSE)","v":"Daisy"},{"$f":"+VLOOKUP(+$A3,'Data Input'!$A$3:$AX$39,3,FALSE)","v":"T Ford"},{"$f":"+VLOOKUP(+$A3,'Data Input'!$A$3:$AX$39,4,FALSE)","v":22},{"$f":"+VLOOKUP(+$A3,'Data Input'!$A$3:$AX$39,5,FALSE)","v":-25},{"$f":"+VLOOKUP(+$A3,'Data Input'!$A$3:$AX$39,6,FALSE)","v":0},{"$f":"+VLOOKUP(+$A3,'Data Input'!$A$3:$AX$39,7,FALSE)","v":"C"},{"$f":"+VLOOKUP($A3,'Data Input'!$A$3:$AX$39,33,FALSE)","v":6},{"$f":"+VLOOKUP($A3,'Data Input'!$A$3:$AX$39,34,FALSE)","v":7},{"$f":"+VLOOKUP($A3,'Data Input'!$A$3:$AX$39,35,FALSE)","v":49.5},null,{"$f":"+VLOOKUP($A3,'Data Input'!$A$3:$AX$39,37,FALSE)","v":25},null,"5th"]
[87,{"$f":"+VLOOKUP(+$A4,'Data Input'!$A$3:$AX$39,2,FALSE)","v":"Modwena"},{"$f":"+VLOOKUP(+$A4,'Data Input'!$A$3:$AX$39,3,FALSE)","v":"M Cassidy"},{"$f":"+VLOOKUP(+$A4,'Data Input'!$A$3:$AX$39,4,FALSE)","v":24.11},{"$f":"+VLOOKUP(+$A4,'Data Input'!$A$3:$AX$39,5,FALSE)","v":-19},{"$f":"+VLOOKUP(+$A4,'Data Input'!$A$3:$AX$39,6,FALSE)","v":0},{"$f":"+VLOOKUP(+$A4,'Data Input'!$A$3:$AX$39,7,FALSE)","v":"C"},{"$f":"+VLOOKUP($A4,'Data Input'!$A$3:$AX$39,33,FALSE)","v":5},{"$f":"+VLOOKUP($A4,'Data Input'!$A$3:$AX$39,34,FALSE)","v":22},{"$f":"+VLOOKUP($A4,'Data Input'!$A$3:$AX$39,35,FALSE)","v":32.520000000000437},null,{"$f":"+VLOOKUP($A4,'Data Input'!$A$3:$AX$39,37,FALSE)","v":15},null,"THIRD"]
[141,{"$f":"+VLOOKUP(+$A5,'Data Input'!$A$3:$AX$39,2,FALSE)","v":"Nirvana"},{"$f":"+VLOOKUP(+$A5,'Data Input'!$A$3:$AX$39,3,FALSE)","v":" M Claridge"},{"$f":"+VLOOKUP(+$A5,'Data Input'!$A$3:$AX$39,4,FALSE)","v":20},{"$f":"+VLOOKUP(+$A5,'Data Input'!$A$3:$AX$39,5,FALSE)","v":-23},{"$f":"+VLOOKUP(+$A5,'Data Input'!$A$3:$AX$39,6,FALSE)","v":"DNS"},{"$f":"+VLOOKUP(+$A5,'Data Input'!$A$3:$AX$39,7,FALSE)","v":"C"},{"$f":"+VLOOKUP($A5,'Data Input'!$A$3:$AX$39,33,FALSE)","v":0},{"$f":"+VLOOKUP($A5,'Data Input'!$A$3:$AX$39,34,FALSE)","v":0},{"$f":"+VLOOKUP($A5,'Data Input'!$A$3:$AX$39,35,FALSE)","v":0},null,{"$f":"+VLOOKUP($A5,'Data Input'!$A$3:$AX$39,37,FALSE)","v":"DNS"}]
[216,{"$f":"+VLOOKUP(+$A6,'Data Input'!$A$3:$AX$39,2,FALSE)","v":"Tamara"},{"$f":"+VLOOKUP(+$A6,'Data Input'!$A$3:$AX$39,3,FALSE)","v":"N Heath"},{"$f":"+VLOOKUP(+$A6,'Data Input'!$A$3:$AX$39,4,FALSE)","v":24.8},{"$f":"+VLOOKUP(+$A6,'Data Input'!$A$3:$AX$39,5,FALSE)","v":-16},{"$f":"+VLOOKUP(+$A6,'Data Input'!$A$3:$AX$39,6,FALSE)","v":"P"},{"$f":"+VLOOKUP(+$A6,'Data Input'!$A$3:$AX$39,7,FALSE)","v":"C"},{"$f":"+VLOOKUP($A6,'Data Input'!$A$3:$AX$39,33,FALSE)","v":5},{"$f":"+VLOOKUP($A6,'Data Input'!$A$3:$AX$39,34,FALSE)","v":13},{"$f":"+VLOOKUP($A6,'Data Input'!$A$3:$AX$39,35,FALSE)","v":30.959999999999127},null,{"$f":"+VLOOKUP($A6,'Data Input'!$A$3:$AX$39,37,FALSE)","v":"P"}]
[274,{"$f":"+VLOOKUP(+$A7,'Data Input'!$A$3:$AX$39,2,FALSE)","v":"Elfin"},{"$f":"+VLOOKUP(+$A7,'Data Input'!$A$3:$AX$39,3,FALSE)","v":"A Bond"},{"$f":"+VLOOKUP(+$A7,'Data Input'!$A$3:$AX$39,4,FALSE)","v":20},{"$f":"+VLOOKUP(+$A7,'Data Input'!$A$3:$AX$39,5,FALSE)","v":-27},{"$f":"+VLOOKUP(+$A7,'Data Input'!$A$3:$AX$39,6,FALSE)","v":0},{"$f":"+VLOOKUP(+$A7,'Data Input'!$A$3:$AX$39,7,FALSE)","v":"C"},{"$f":"+VLOOKUP($A7,'Data Input'!$A$3:$AX$39,33,FALSE)","v":6},{"$f":"+VLOOKUP($A7,'Data Input'!$A$3:$AX$39,34,FALSE)","v":2},{"$f":"+VLOOKUP($A7,'Data Input'!$A$3:$AX$39,35,FALSE)","v":44.950000000000728},null,{"$f":"+VLOOKUP($A7,'Data Input'!$A$3:$AX$39,37,FALSE)","v":24},null,"4th"]
[375,{"$f":"+VLOOKUP(+$A8,'Data Input'!$A$3:$AX$39,2,FALSE)","v":"Amaryllis"},{"$f":"+VLOOKUP(+$A8,'Data Input'!$A$3:$AX$39,3,FALSE)","v":"C Tuckett"},{"$f":"+VLOOKUP(+$A8,'Data Input'!$A$3:$AX$39,4,FALSE)","v":21.4},{"$f":"+VLOOKUP(+$A8,'Data Input'!$A$3:$AX$39,5,FALSE)","v":-10},{"$f":"+VLOOKUP(+$A8,'Data Input'!$A$3:$AX$39,6,FALSE)","v":0},{"$f":"+VLOOKUP(+$A8,'Data Input'!$A$3:$AX$39,7,FALSE)","v":"C"},{"$f":"+VLOOKUP($A8,'Data Input'!$A$3:$AX$39,33,FALSE)","v":5},{"$f":"+VLOOKUP($A8,'Data Input'!$A$3:$AX$39,34,FALSE)","v":4},{"$f":"+VLOOKUP($A8,'Data Input'!$A$3:$AX$39,35,FALSE)","v":38.100000000002183},null,{"$f":"+VLOOKUP($A8,'Data Input'!$A$3:$AX$39,37,FALSE)","v":8},null,"SECOND"]
[429,{"$f":"+VLOOKUP(+$A9,'Data Input'!$A$3:$AX$39,2,FALSE)","v":"Pickle"},{"$f":"+VLOOKUP(+$A9,'Data Input'!$A$3:$AX$39,3,FALSE)","v":"P Montague"},{"$f":"+VLOOKUP(+$A9,'Data Input'!$A$3:$AX$39,4,FALSE)","v":22.6},{"$f":"+VLOOKUP(+$A9,'Data Input'!$A$3:$AX$39,5,FALSE)","v":-16},{"$f":"+VLOOKUP(+$A9,'Data Input'!$A$3:$AX$39,6,FALSE)","v":0},{"$f":"+VLOOKUP(+$A9,'Data Input'!$A$3:$AX$39,7,FALSE)","v":"C"},{"$f":"+VLOOKUP($A9,'Data Input'!$A$3:$AX$39,33,FALSE)","v":4},{"$f":"+VLOOKUP($A9,'Data Input'!$A$3:$AX$39,34,FALSE)","v":50},{"$f":"+VLOOKUP($A9,'Data Input'!$A$3:$AX$39,35,FALSE)","v":34.200000000000728},null,{"$f":"+VLOOKUP($A9,'Data Input'!$A$3:$AX$39,37,FALSE)","v":2},null,"FIRST"]
[]
[]
[]
[]
[]
[{"$f":"+COUNT(A3:A14)","v":7}]