{"text_format":"1","workbook":"xlsx","n_sheets":7,"sheets":["Data Input","YNR","Moonraker","Classes","Classes A","Classes B","Classes C"],"not_rendered":{"charts":0,"images":0,"macros":0,"external_links":0,"defined_names":16,"comments":0,"pivot_tables":0},"unopened":[],"bounds":{"document_bytes":16777216,"sheet_cells":100000,"rows_first":2000,"rows_last":500,"rows_between":2000,"halvings":0,"cell_chars":16384,"cell_head_chars":4096},"cells_cut":0,"cells_raw":0,"read":"whole","date_system":"1900"}

{"sheet":"Data Input","index":0,"n_rows":42,"n_cols":50,"rows_kept":42,"cut":false,"hidden":false,"merged":[]}
["No","Yacht","Skipper","Length","H/C","P","Class",null,"Start",null,null,"Out 1",null,null,"In 1",null,null,"Out 2",null,null,"In 2",null,null,"Finish",null,null,null,"Elapsed",null,null,"Pos",null,null,"Corrected",null,null,"Pos",null,"Bridge1","Bridge 2","Bridge T","T","T-B elapsed","Corr"]
[null,null,null,null,null,null,null,"H","M","S","H","M","S","H","M","S","H","M","S","H","M","S","H","M","S",null,"H","M","S",null,null," ","H","M","S",null,null," ","Seconds","Seconds","Seconds","Seconds","Seconds","Seconds"]
[10,"Flight","J Farrow",29.11,-9,null,{"$f":"IF(D3=\"\",\"\",IF(D3<25,\"C\",IF(D3<28.01,\"B\",\"A\")))","v":"A"},10,45,0,null,null,null,null,null,null,null,null,null,null,null,null,16,45,54,null,{"$f":"INT(AQ3/3600)","v":6},{"$f":"INT((AQ3-AA3*3600)/60)","v":0},{"$f":"AQ3-(AA3*3600+AB3*60)","v":54},null,{"$f":"+AT3","v":18},null,{"$f":"INT(AR3/3600)","v":5},{"$f":"INT((AR3-AG3*3600)/60)","v":28},{"$f":"AR3-(AG3*3600+AH3*60)","v":25.139999999999418},null,{"$f":"+AW3","v":20},null,{"$f":"(P3+O3*60+N3*3600)-(M3+L3*60+K3*3600)","v":0},{"$f":"(V3+U3*60+T3*3600)-(S3+R3*60+Q3*3600)","v":0},{"$f":"AM3+AN3","v":0},{"$f":"(Y3+X3*60+W3*3600)-(J3+I3*60+H3*3600)","v":21654},{"$f":"ABS(AP3-AO3)","v":21654},{"$f":"AQ3*(0.01*(100+E3))","v":19705.14},{"$f":"+IF(F3=\"\",AQ3,500000)","v":21654},{"$f":"IF(F3=\"\",+RANK(AS3,$AS$3:$AS$39,1),+F3)","v":18},{"$f":"+IF(AT3<4,\"Trophy\",\"\")","v":""},{"$f":"+IF(F3=\"\",AR3,500000)","v":19705.14},{"$f":"IF(F3=\"\",+RANK(AV3,$AV$3:$AV$39,1),+F3)","v":20},{"$f":"+IF(AW3<4,\"Trophy\",\"\")","v":""}]
[22,"Moonraker","P Jeckells",29.6,2,null,"A",11,30,0,null,null,null,null,null,null,null,null,null,null,null,null,16,37,35,null,5,7,35,null,6,null,5,13,44.099999999998545,null,9,null,0,0,0,18455,18455,18824.099999999999,18455,6,"",18824.099999999999,9,""]
[24,"Pippa","G Angel",27.1,-7,null,"B",12,45,0,null,null,null,null,null,null,null,null,null,null,null,null,18,36,40,null,{"$f":"INT(AQ5/3600)","v":5},{"$f":"INT((AQ5-AA5*3600)/60)","v":51},{"$f":"AQ5-(AA5*3600+AB5*60)","v":40},null,{"$f":"+AT5","v":16},null,{"$f":"INT(AR5/3600)","v":5},{"$f":"INT((AR5-AG5*3600)/60)","v":27},{"$f":"AR5-(AG5*3600+AH5*60)","v":3},null,{"$f":"+AW5","v":18},null,{"$f":"(P5+O5*60+N5*3600)-(M5+L5*60+K5*3600)","v":0},{"$f":"(V5+U5*60+T5*3600)-(S5+R5*60+Q5*3600)","v":0},{"$f":"AM5+AN5","v":0},{"$f":"(Y5+X5*60+W5*3600)-(J5+I5*60+H5*3600)","v":21100},{"$f":"ABS(AP5-AO5)","v":21100},{"$f":"AQ5*(0.01*(100+E5))","v":19623},{"$f":"+IF(F5=\"\",AQ5,500000)","v":21100},16,{"$f":"+IF(AT5<4,\"Trophy\",\"\")","v":""},{"$f":"+IF(F5=\"\",AR5,500000)","v":19623},18,{"$f":"+IF(AW5<4,\"Trophy\",\"\")","v":""}]
[25,"Melody","M Wells",26,-11,null,"B",11,15,0,null,null,null,null,null,null,null,null,null,null,null,null,17,26,10,null,6,11,10,null,20,null,5,30,20.299999999999272,null,22,null,0,0,0,22270,22270,19820.3,22270,20,"",19820.3,22,""]
{"$rows_left_out":37}
{"sheet":"YNR","index":1,"n_rows":40,"n_cols":14,"rows_kept":40,"cut":false,"hidden":false,"merged":[]}
[null,null,null,null,null,null,null,null,"Corrected",null,null,null,null,"YNR POSITION"]
["No","Yacht","Skipper","Length","H/C","P","Class","H","M","S",null,"Pos"]
[10,{"$f":"+VLOOKUP(+$A3,'Data Input'!$A$3:$AX$39,2,FALSE)","v":"Flight"},{"$f":"+VLOOKUP(+$A3,'Data Input'!$A$3:$AX$39,3,FALSE)","v":"J Farrow"},{"$f":"+VLOOKUP(+$A3,'Data Input'!$A$3:$AX$39,4,FALSE)","v":29.11},{"$f":"+VLOOKUP(+$A3,'Data Input'!$A$3:$AX$39,5,FALSE)","v":-9},{"$f":"+VLOOKUP(+$A3,'Data Input'!$A$3:$AX$39,6,FALSE)","v":0},{"$f":"+VLOOKUP(+$A3,'Data Input'!$A$3:$AX$39,7,FALSE)","v":"A"},{"$f":"+VLOOKUP($A3,'Data Input'!$A$3:$AX$39,33,FALSE)","v":5},{"$f":"+VLOOKUP($A3,'Data Input'!$A$3:$AX$39,34,FALSE)","v":28},{"$f":"+VLOOKUP($A3,'Data Input'!$A$3:$AX$39,35,FALSE)","v":25.139999999999418},null,{"$f":"+VLOOKUP($A3,'Data Input'!$A$3:$AX$39,37,FALSE)","v":20}]
[22,{"$f":"+VLOOKUP(+$A4,'Data Input'!$A$3:$AX$39,2,FALSE)","v":"Moonraker"},{"$f":"+VLOOKUP(+$A4,'Data Input'!$A$3:$AX$39,3,FALSE)","v":"P Jeckells"},{"$f":"+VLOOKUP(+$A4,'Data Input'!$A$3:$AX$39,4,FALSE)","v":29.6},{"$f":"+VLOOKUP(+$A4,'Data Input'!$A$3:$AX$39,5,FALSE)","v":2},{"$f":"+VLOOKUP(+$A4,'Data Input'!$A$3:$AX$39,6,FALSE)","v":0},{"$f":"+VLOOKUP(+$A4,'Data Input'!$A$3:$AX$39,7,FALSE)","v":"A"},{"$f":"+VLOOKUP($A4,'Data Input'!$A$3:$AX$39,33,FALSE)","v":5},{"$f":"+VLOOKUP($A4,'Data Input'!$A$3:$AX$39,34,FALSE)","v":13},{"$f":"+VLOOKUP($A4,'Data Input'!$A$3:$AX$39,35,FALSE)","v":44.099999999998545},null,{"$f":"+VLOOKUP($A4,'Data Input'!$A$3:$AX$39,37,FALSE)","v":9}]
[24,{"$f":"+VLOOKUP(+$A5,'Data Input'!$A$3:$AX$39,2,FALSE)","v":"Pippa"},{"$f":"+VLOOKUP(+$A5,'Data Input'!$A$3:$AX$39,3,FALSE)","v":"G Angel"},{"$f":"+VLOOKUP(+$A5,'Data Input'!$A$3:$AX$39,4,FALSE)","v":27.1},{"$f":"+VLOOKUP(+$A5,'Data Input'!$A$3:$AX$39,5,FALSE)","v":-7},{"$f":"+VLOOKUP(+$A5,'Data Input'!$A$3:$AX$39,6,FALSE)","v":0},{"$f":"+VLOOKUP(+$A5,'Data Input'!$A$3:$AX$39,7,FALSE)","v":"B"},{"$f":"+VLOOKUP($A5,'Data Input'!$A$3:$AX$39,33,FALSE)","v":5},{"$f":"+VLOOKUP($A5,'Data Input'!$A$3:$AX$39,34,FALSE)","v":27},{"$f":"+VLOOKUP($A5,'Data Input'!$A$3:$AX$39,35,FALSE)","v":3},null,{"$f":"+VLOOKUP($A5,'Data Input'!$A$3:$AX$39,37,FALSE)","v":18}]
[25,{"$f":"+VLOOKUP(+$A6,'Data Input'!$A$3:$AX$39,2,FALSE)","v":"Melody"},{"$f":"+VLOOKUP(+$A6,'Data Input'!$A$3:$AX$39,3,FALSE)","v":"M Wells"},{"$f":"+VLOOKUP(+$A6,'Data Input'!$A$3:$AX$39,4,FALSE)","v":26},{"$f":"+VLOOKUP(+$A6,'Data Input'!$A$3:$AX$39,5,FALSE)","v":-11},{"$f":"+VLOOKUP(+$A6,'Data Input'!$A$3:$AX$39,6,FALSE)","v":0},{"$f":"+VLOOKUP(+$A6,'Data Input'!$A$3:$AX$39,7,FALSE)","v":"B"},{"$f":"+VLOOKUP($A6,'Data Input'!$A$3:$AX$39,33,FALSE)","v":5},{"$f":"+VLOOKUP($A6,'Data Input'!$A$3:$AX$39,34,FALSE)","v":30},{"$f":"+VLOOKUP($A6,'Data Input'!$A$3:$AX$39,35,FALSE)","v":20.299999999999272},null,{"$f":"+VLOOKUP($A6,'Data Input'!$A$3:$AX$39,37,FALSE)","v":22}]
{"$rows_left_out":35}
{"sheet":"Moonraker","index":2,"n_rows":41,"n_cols":14,"rows_kept":41,"cut":false,"hidden":false,"merged":[]}
[null,null,null,null,null,null,null,null,"Elapsed",null,null,null,null,"MOONRAKER POSITION"]
["No","Yacht","Skipper","Length","H/C","P","Class","H","M","S",null,"Pos"," "]
[10,{"$f":"+VLOOKUP(+$A3,'Data Input'!$A$3:$AX$39,2,FALSE)","v":"Flight"},{"$f":"+VLOOKUP(+$A3,'Data Input'!$A$3:$AX$39,3,FALSE)","v":"J Farrow"},{"$f":"+VLOOKUP(+$A3,'Data Input'!$A$3:$AX$39,4,FALSE)","v":29.11},{"$f":"+VLOOKUP(+$A3,'Data Input'!$A$3:$AX$39,5,FALSE)","v":-9},{"$f":"+VLOOKUP(+$A3,'Data Input'!$A$3:$AX$39,6,FALSE)","v":0},{"$f":"+VLOOKUP(+$A3,'Data Input'!$A$3:$AX$39,7,FALSE)","v":"A"},{"$f":"+VLOOKUP($A3,'Data Input'!$A$3:$AX$39,27,FALSE)","v":6},{"$f":"+VLOOKUP($A3,'Data Input'!$A$3:$AX$39,28,FALSE)","v":0},{"$f":"+VLOOKUP($A3,'Data Input'!$A$3:$AX$39,29,FALSE)","v":54},null,{"$f":"+VLOOKUP($A3,'Data Input'!$A$3:$AX$39,31,FALSE)","v":18}]
[22,{"$f":"+VLOOKUP(+$A4,'Data Input'!$A$3:$AX$39,2,FALSE)","v":"Moonraker"},{"$f":"+VLOOKUP(+$A4,'Data Input'!$A$3:$AX$39,3,FALSE)","v":"P Jeckells"},{"$f":"+VLOOKUP(+$A4,'Data Input'!$A$3:$AX$39,4,FALSE)","v":29.6},{"$f":"+VLOOKUP(+$A4,'Data Input'!$A$3:$AX$39,5,FALSE)","v":2},{"$f":"+VLOOKUP(+$A4,'Data Input'!$A$3:$AX$39,6,FALSE)","v":0},{"$f":"+VLOOKUP(+$A4,'Data Input'!$A$3:$AX$39,7,FALSE)","v":"A"},{"$f":"+VLOOKUP($A4,'Data Input'!$A$3:$AX$39,27,FALSE)","v":5},{"$f":"+VLOOKUP($A4,'Data Input'!$A$3:$AX$39,28,FALSE)","v":7},{"$f":"+VLOOKUP($A4,'Data Input'!$A$3:$AX$39,29,FALSE)","v":35},null,{"$f":"+VLOOKUP($A4,'Data Input'!$A$3:$AX$39,31,FALSE)","v":6}]
[24,{"$f":"+VLOOKUP(+$A5,'Data Input'!$A$3:$AX$39,2,FALSE)","v":"Pippa"},{"$f":"+VLOOKUP(+$A5,'Data Input'!$A$3:$AX$39,3,FALSE)","v":"G Angel"},{"$f":"+VLOOKUP(+$A5,'Data Input'!$A$3:$AX$39,4,FALSE)","v":27.1},{"$f":"+VLOOKUP(+$A5,'Data Input'!$A$3:$AX$39,5,FALSE)","v":-7},{"$f":"+VLOOKUP(+$A5,'Data Input'!$A$3:$AX$39,6,FALSE)","v":0},{"$f":"+VLOOKUP(+$A5,'Data Input'!$A$3:$AX$39,7,FALSE)","v":"B"},{"$f":"+VLOOKUP($A5,'Data Input'!$A$3:$AX$39,27,FALSE)","v":5},{"$f":"+VLOOKUP($A5,'Data Input'!$A$3:$AX$39,28,FALSE)","v":51},{"$f":"+VLOOKUP($A5,'Data Input'!$A$3:$AX$39,29,FALSE)","v":40},null,{"$f":"+VLOOKUP($A5,'Data Input'!$A$3:$AX$39,31,FALSE)","v":16}]
[25,{"$f":"+VLOOKUP(+$A6,'Data Input'!$A$3:$AX$39,2,FALSE)","v":"Melody"},{"$f":"+VLOOKUP(+$A6,'Data Input'!$A$3:$AX$39,3,FALSE)","v":"M Wells"},{"$f":"+VLOOKUP(+$A6,'Data Input'!$A$3:$AX$39,4,FALSE)","v":26},{"$f":"+VLOOKUP(+$A6,'Data Input'!$A$3:$AX$39,5,FALSE)","v":-11},{"$f":"+VLOOKUP(+$A6,'Data Input'!$A$3:$AX$39,6,FALSE)","v":0},{"$f":"+VLOOKUP(+$A6,'Data Input'!$A$3:$AX$39,7,FALSE)","v":"B"},{"$f":"+VLOOKUP($A6,'Data Input'!$A$3:$AX$39,27,FALSE)","v":6},{"$f":"+VLOOKUP($A6,'Data Input'!$A$3:$AX$39,28,FALSE)","v":11},{"$f":"+VLOOKUP($A6,'Data Input'!$A$3:$AX$39,29,FALSE)","v":10},null,{"$f":"+VLOOKUP($A6,'Data Input'!$A$3:$AX$39,31,FALSE)","v":20}]
{"$rows_left_out":36}
{"sheet":"Classes","index":3,"n_rows":53,"n_cols":15,"rows_kept":53,"cut":false,"hidden":false,"merged":[]}
[null,null,null,null,null,null,null,null,"Corrected",null,null,null,null,null,"Don’t use filters on this page"]
["No","Yacht","Skipper","Length","H/C","P","Class","H","M","S",null,"Pos"," ",null,"Sort will place into clases and then order.  You can then insert rows with Trophy Name before printing"]
[10,{"$f":"+VLOOKUP(+$A3,'Data Input'!$A$3:$AX$39,2,FALSE)","v":"Flight"},{"$f":"+VLOOKUP(+$A3,'Data Input'!$A$3:$AX$39,3,FALSE)","v":"J Farrow"},{"$f":"+VLOOKUP(+$A3,'Data Input'!$A$3:$AX$39,4,FALSE)","v":29.11},{"$f":"+VLOOKUP(+$A3,'Data Input'!$A$3:$AX$39,5,FALSE)","v":-9},{"$f":"+VLOOKUP(+$A3,'Data Input'!$A$3:$AX$39,6,FALSE)","v":0},{"$f":"+VLOOKUP(+$A3,'Data Input'!$A$3:$AX$39,7,FALSE)","v":"A"},{"$f":"+VLOOKUP($A3,'Data Input'!$A$3:$AX$39,33,FALSE)","v":5},{"$f":"+VLOOKUP($A3,'Data Input'!$A$3:$AX$39,34,FALSE)","v":28},{"$f":"+VLOOKUP($A3,'Data Input'!$A$3:$AX$39,35,FALSE)","v":25.139999999999418},null,{"$f":"+VLOOKUP($A3,'Data Input'!$A$3:$AX$39,37,FALSE)","v":20},null,null,"Starlight Lady"]
[22,{"$f":"+VLOOKUP(+$A4,'Data Input'!$A$3:$AX$39,2,FALSE)","v":"Moonraker"},{"$f":"+VLOOKUP(+$A4,'Data Input'!$A$3:$AX$39,3,FALSE)","v":"P Jeckells"},{"$f":"+VLOOKUP(+$A4,'Data Input'!$A$3:$AX$39,4,FALSE)","v":29.6},{"$f":"+VLOOKUP(+$A4,'Data Input'!$A$3:$AX$39,5,FALSE)","v":2},{"$f":"+VLOOKUP(+$A4,'Data Input'!$A$3:$AX$39,6,FALSE)","v":0},{"$f":"+VLOOKUP(+$A4,'Data Input'!$A$3:$AX$39,7,FALSE)","v":"A"},{"$f":"+VLOOKUP($A4,'Data Input'!$A$3:$AX$39,33,FALSE)","v":5},{"$f":"+VLOOKUP($A4,'Data Input'!$A$3:$AX$39,34,FALSE)","v":13},{"$f":"+VLOOKUP($A4,'Data Input'!$A$3:$AX$39,35,FALSE)","v":44.099999999998545},null,{"$f":"+VLOOKUP($A4,'Data Input'!$A$3:$AX$39,37,FALSE)","v":9},null,null,"Jeckells"]
[24,{"$f":"+VLOOKUP(+$A5,'Data Input'!$A$3:$AX$39,2,FALSE)","v":"Pippa"},{"$f":"+VLOOKUP(+$A5,'Data Input'!$A$3:$AX$39,3,FALSE)","v":"G Angel"},{"$f":"+VLOOKUP(+$A5,'Data Input'!$A$3:$AX$39,4,FALSE)","v":27.1},{"$f":"+VLOOKUP(+$A5,'Data Input'!$A$3:$AX$39,5,FALSE)","v":-7},{"$f":"+VLOOKUP(+$A5,'Data Input'!$A$3:$AX$39,6,FALSE)","v":0},{"$f":"+VLOOKUP(+$A5,'Data Input'!$A$3:$AX$39,7,FALSE)","v":"B"},{"$f":"+VLOOKUP($A5,'Data Input'!$A$3:$AX$39,33,FALSE)","v":5},{"$f":"+VLOOKUP($A5,'Data Input'!$A$3:$AX$39,34,FALSE)","v":27},{"$f":"+VLOOKUP($A5,'Data Input'!$A$3:$AX$39,35,FALSE)","v":3},null,{"$f":"+VLOOKUP($A5,'Data Input'!$A$3:$AX$39,37,FALSE)","v":18},null,null,"Wilberforce Smith"]
[25,{"$f":"+VLOOKUP(+$A6,'Data Input'!$A$3:$AX$39,2,FALSE)","v":"Melody"},{"$f":"+VLOOKUP(+$A6,'Data Input'!$A$3:$AX$39,3,FALSE)","v":"M Wells"},{"$f":"+VLOOKUP(+$A6,'Data Input'!$A$3:$AX$39,4,FALSE)","v":26},{"$f":"+VLOOKUP(+$A6,'Data Input'!$A$3:$AX$39,5,FALSE)","v":-11},{"$f":"+VLOOKUP(+$A6,'Data Input'!$A$3:$AX$39,6,FALSE)","v":0},{"$f":"+VLOOKUP(+$A6,'Data Input'!$A$3:$AX$39,7,FALSE)","v":"B"},{"$f":"+VLOOKUP($A6,'Data Input'!$A$3:$AX$39,33,FALSE)","v":5},{"$f":"+VLOOKUP($A6,'Data Input'!$A$3:$AX$39,34,FALSE)","v":30},{"$f":"+VLOOKUP($A6,'Data Input'!$A$3:$AX$39,35,FALSE)","v":20.299999999999272},null,{"$f":"+VLOOKUP($A6,'Data Input'!$A$3:$AX$39,37,FALSE)","v":22}]
{"$rows_left_out":48}
{"sheet":"Classes A","index":4,"n_rows":23,"n_cols":14,"rows_kept":23,"cut":false,"hidden":false,"merged":[]}
["Starlight Lady",null,null,null,null,null,null,null,"Corrected",null,null,null,null,"CLASS POSITION"]
["No","Yacht","Skipper","Length","H/C","P","Class","H","M","S",null,"Pos"," "]
[10,{"$f":"+VLOOKUP(+$A3,'Data Input'!$A$3:$AX$39,2,FALSE)","v":"Flight"},{"$f":"+VLOOKUP(+$A3,'Data Input'!$A$3:$AX$39,3,FALSE)","v":"J Farrow"},{"$f":"+VLOOKUP(+$A3,'Data Input'!$A$3:$AX$39,4,FALSE)","v":29.11},{"$f":"+VLOOKUP(+$A3,'Data Input'!$A$3:$AX$39,5,FALSE)","v":-9},{"$f":"+VLOOKUP(+$A3,'Data Input'!$A$3:$AX$39,6,FALSE)","v":0},{"$f":"+VLOOKUP(+$A3,'Data Input'!$A$3:$AX$39,7,FALSE)","v":"A"},{"$f":"+VLOOKUP($A3,'Data Input'!$A$3:$AX$39,33,FALSE)","v":5},{"$f":"+VLOOKUP($A3,'Data Input'!$A$3:$AX$39,34,FALSE)","v":28},{"$f":"+VLOOKUP($A3,'Data Input'!$A$3:$AX$39,35,FALSE)","v":25.139999999999418},null,{"$f":"+VLOOKUP($A3,'Data Input'!$A$3:$AX$39,37,FALSE)","v":20},null,"9th"]
[22,{"$f":"+VLOOKUP(+$A4,'Data Input'!$A$3:$AX$39,2,FALSE)","v":"Moonraker"},{"$f":"+VLOOKUP(+$A4,'Data Input'!$A$3:$AX$39,3,FALSE)","v":"P Jeckells"},{"$f":"+VLOOKUP(+$A4,'Data Input'!$A$3:$AX$39,4,FALSE)","v":29.6},{"$f":"+VLOOKUP(+$A4,'Data Input'!$A$3:$AX$39,5,FALSE)","v":2},{"$f":"+VLOOKUP(+$A4,'Data Input'!$A$3:$AX$39,6,FALSE)","v":0},{"$f":"+VLOOKUP(+$A4,'Data Input'!$A$3:$AX$39,7,FALSE)","v":"A"},{"$f":"+VLOOKUP($A4,'Data Input'!$A$3:$AX$39,33,FALSE)","v":5},{"$f":"+VLOOKUP($A4,'Data Input'!$A$3:$AX$39,34,FALSE)","v":13},{"$f":"+VLOOKUP($A4,'Data Input'!$A$3:$AX$39,35,FALSE)","v":44.099999999998545},null,{"$f":"+VLOOKUP($A4,'Data Input'!$A$3:$AX$39,37,FALSE)","v":9},null,"4th"]
[52,{"$f":"+VLOOKUP(+$A5,'Data Input'!$A$3:$AX$39,2,FALSE)","v":"Maidie"},{"$f":"+VLOOKUP(+$A5,'Data Input'!$A$3:$AX$39,3,FALSE)","v":"M Barnes"},{"$f":"+VLOOKUP(+$A5,'Data Input'!$A$3:$AX$39,4,FALSE)","v":43},{"$f":"+VLOOKUP(+$A5,'Data Input'!$A$3:$AX$39,5,FALSE)","v":10},{"$f":"+VLOOKUP(+$A5,'Data Input'!$A$3:$AX$39,6,FALSE)","v":"DNF"},{"$f":"+VLOOKUP(+$A5,'Data Input'!$A$3:$AX$39,7,FALSE)","v":"A"},{"$f":"+VLOOKUP($A5,'Data Input'!$A$3:$AX$39,33,FALSE)","v":15},{"$f":"+VLOOKUP($A5,'Data Input'!$A$3:$AX$39,34,FALSE)","v":57},{"$f":"+VLOOKUP($A5,'Data Input'!$A$3:$AX$39,35,FALSE)","v":0},null,{"$f":"+VLOOKUP($A5,'Data Input'!$A$3:$AX$39,37,FALSE)","v":"DNF"}]
[149,{"$f":"+VLOOKUP(+$A6,'Data Input'!$A$3:$AX$39,2,FALSE)","v":"Stella Genesta"},{"$f":"+VLOOKUP(+$A6,'Data Input'!$A$3:$AX$39,3,FALSE)","v":"M Burwood"},{"$f":"+VLOOKUP(+$A6,'Data Input'!$A$3:$AX$39,4,FALSE)","v":30},{"$f":"+VLOOKUP(+$A6,'Data Input'!$A$3:$AX$39,5,FALSE)","v":-19},{"$f":"+VLOOKUP(+$A6,'Data Input'!$A$3:$AX$39,6,FALSE)","v":0},{"$f":"+VLOOKUP(+$A6,'Data Input'!$A$3:$AX$39,7,FALSE)","v":"A"},{"$f":"+VLOOKUP($A6,'Data Input'!$A$3:$AX$39,33,FALSE)","v":5},{"$f":"+VLOOKUP($A6,'Data Input'!$A$3:$AX$39,34,FALSE)","v":30},{"$f":"+VLOOKUP($A6,'Data Input'!$A$3:$AX$39,35,FALSE)","v":15.840000000000146},null,{"$f":"+VLOOKUP($A6,'Data Input'!$A$3:$AX$39,37,FALSE)","v":21},null,"10th"]
{"$rows_left_out":18}
{"sheet":"Classes B","index":5,"n_rows":22,"n_cols":14,"rows_kept":22,"cut":false,"hidden":false,"merged":[]}
["Jeckells",null,null,null,null,null,null,null,"Corrected",null,null,null,null,"CLASS POSITION"]
["No","Yacht","Skipper","Length","H/C","P","Class","H","M","S",null,"Pos"," "]
[24,{"$f":"+VLOOKUP(+$A3,'Data Input'!$A$3:$AX$39,2,FALSE)","v":"Pippa"},{"$f":"+VLOOKUP(+$A3,'Data Input'!$A$3:$AX$39,3,FALSE)","v":"G Angel"},{"$f":"+VLOOKUP(+$A3,'Data Input'!$A$3:$AX$39,4,FALSE)","v":27.1},{"$f":"+VLOOKUP(+$A3,'Data Input'!$A$3:$AX$39,5,FALSE)","v":-7},{"$f":"+VLOOKUP(+$A3,'Data Input'!$A$3:$AX$39,6,FALSE)","v":0},{"$f":"+VLOOKUP(+$A3,'Data Input'!$A$3:$AX$39,7,FALSE)","v":"B"},{"$f":"+VLOOKUP($A3,'Data Input'!$A$3:$AX$39,33,FALSE)","v":5},{"$f":"+VLOOKUP($A3,'Data Input'!$A$3:$AX$39,34,FALSE)","v":27},{"$f":"+VLOOKUP($A3,'Data Input'!$A$3:$AX$39,35,FALSE)","v":3},null,{"$f":"+VLOOKUP($A3,'Data Input'!$A$3:$AX$39,37,FALSE)","v":18},null,"7th"]
[25,{"$f":"+VLOOKUP(+$A4,'Data Input'!$A$3:$AX$39,2,FALSE)","v":"Melody"},{"$f":"+VLOOKUP(+$A4,'Data Input'!$A$3:$AX$39,3,FALSE)","v":"M Wells"},{"$f":"+VLOOKUP(+$A4,'Data Input'!$A$3:$AX$39,4,FALSE)","v":26},{"$f":"+VLOOKUP(+$A4,'Data Input'!$A$3:$AX$39,5,FALSE)","v":-11},{"$f":"+VLOOKUP(+$A4,'Data Input'!$A$3:$AX$39,6,FALSE)","v":0},{"$f":"+VLOOKUP(+$A4,'Data Input'!$A$3:$AX$39,7,FALSE)","v":"B"},{"$f":"+VLOOKUP($A4,'Data Input'!$A$3:$AX$39,33,FALSE)","v":5},{"$f":"+VLOOKUP($A4,'Data Input'!$A$3:$AX$39,34,FALSE)","v":30},{"$f":"+VLOOKUP($A4,'Data Input'!$A$3:$AX$39,35,FALSE)","v":20.299999999999272},null,{"$f":"+VLOOKUP($A4,'Data Input'!$A$3:$AX$39,37,FALSE)","v":22},null,"9th"]
[179,{"$f":"+VLOOKUP(+$A5,'Data Input'!$A$3:$AX$39,2,FALSE)","v":"Waxwing"},{"$f":"+VLOOKUP(+$A5,'Data Input'!$A$3:$AX$39,3,FALSE)","v":"R & S Clayton"},{"$f":"+VLOOKUP(+$A5,'Data Input'!$A$3:$AX$39,4,FALSE)","v":27},{"$f":"+VLOOKUP(+$A5,'Data Input'!$A$3:$AX$39,5,FALSE)","v":-8},{"$f":"+VLOOKUP(+$A5,'Data Input'!$A$3:$AX$39,6,FALSE)","v":0},{"$f":"+VLOOKUP(+$A5,'Data Input'!$A$3:$AX$39,7,FALSE)","v":"B"},{"$f":"+VLOOKUP($A5,'Data Input'!$A$3:$AX$39,33,FALSE)","v":5},{"$f":"+VLOOKUP($A5,'Data Input'!$A$3:$AX$39,34,FALSE)","v":16},{"$f":"+VLOOKUP($A5,'Data Input'!$A$3:$AX$39,35,FALSE)","v":15.920000000001892},null,{"$f":"+VLOOKUP($A5,'Data Input'!$A$3:$AX$39,37,FALSE)","v":11},null,"5th"]
[199,{"$f":"+VLOOKUP(+$A6,'Data Input'!$A$3:$AX$39,2,FALSE)","v":"Morning Calm"},{"$f":"+VLOOKUP(+$A6,'Data Input'!$A$3:$AX$39,3,FALSE)","v":"W Clark"},{"$f":"+VLOOKUP(+$A6,'Data Input'!$A$3:$AX$39,4,FALSE)","v":26},{"$f":"+VLOOKUP(+$A6,'Data Input'!$A$3:$AX$39,5,FALSE)","v":-9},{"$f":"+VLOOKUP(+$A6,'Data Input'!$A$3:$AX$39,6,FALSE)","v":0},{"$f":"+VLOOKUP(+$A6,'Data Input'!$A$3:$AX$39,7,FALSE)","v":"B"},{"$f":"+VLOOKUP($A6,'Data Input'!$A$3:$AX$39,33,FALSE)","v":5},{"$f":"+VLOOKUP($A6,'Data Input'!$A$3:$AX$39,34,FALSE)","v":0},{"$f":"+VLOOKUP($A6,'Data Input'!$A$3:$AX$39,35,FALSE)","v":53.490000000001601},null,{"$f":"+VLOOKUP($A6,'Data Input'!$A$3:$AX$39,37,FALSE)","v":6},null,"THIRD"]
{"$rows_left_out":17}
{"sheet":"Classes C","index":6,"n_rows":15,"n_cols":14,"rows_kept":15,"cut":false,"hidden":false,"merged":[]}
["Wilberforce Smith",null,null,null,null,null,null,null,"Corrected"]
["No","Yacht","Skipper","Length","H/C","P","Class","H","M","S",null,"Pos"," ","CLASS POSITION"]
[79,{"$f":"+VLOOKUP(+$A3,'Data Input'!$A$3:$AX$39,2,FALSE)","v":"Daisy"},{"$f":"+VLOOKUP(+$A3,'Data Input'!$A$3:$AX$39,3,FALSE)","v":"T Ford"},{"$f":"+VLOOKUP(+$A3,'Data Input'!$A$3:$AX$39,4,FALSE)","v":22},{"$f":"+VLOOKUP(+$A3,'Data Input'!$A$3:$AX$39,5,FALSE)","v":-25},{"$f":"+VLOOKUP(+$A3,'Data Input'!$A$3:$AX$39,6,FALSE)","v":0},{"$f":"+VLOOKUP(+$A3,'Data Input'!$A$3:$AX$39,7,FALSE)","v":"C"},{"$f":"+VLOOKUP($A3,'Data Input'!$A$3:$AX$39,33,FALSE)","v":6},{"$f":"+VLOOKUP($A3,'Data Input'!$A$3:$AX$39,34,FALSE)","v":7},{"$f":"+VLOOKUP($A3,'Data Input'!$A$3:$AX$39,35,FALSE)","v":49.5},null,{"$f":"+VLOOKUP($A3,'Data Input'!$A$3:$AX$39,37,FALSE)","v":25},null,"5th"]
[87,{"$f":"+VLOOKUP(+$A4,'Data Input'!$A$3:$AX$39,2,FALSE)","v":"Modwena"},{"$f":"+VLOOKUP(+$A4,'Data Input'!$A$3:$AX$39,3,FALSE)","v":"M Cassidy"},{"$f":"+VLOOKUP(+$A4,'Data Input'!$A$3:$AX$39,4,FALSE)","v":24.11},{"$f":"+VLOOKUP(+$A4,'Data Input'!$A$3:$AX$39,5,FALSE)","v":-19},{"$f":"+VLOOKUP(+$A4,'Data Input'!$A$3:$AX$39,6,FALSE)","v":0},{"$f":"+VLOOKUP(+$A4,'Data Input'!$A$3:$AX$39,7,FALSE)","v":"C"},{"$f":"+VLOOKUP($A4,'Data Input'!$A$3:$AX$39,33,FALSE)","v":5},{"$f":"+VLOOKUP($A4,'Data Input'!$A$3:$AX$39,34,FALSE)","v":22},{"$f":"+VLOOKUP($A4,'Data Input'!$A$3:$AX$39,35,FALSE)","v":32.520000000000437},null,{"$f":"+VLOOKUP($A4,'Data Input'!$A$3:$AX$39,37,FALSE)","v":15},null,"THIRD"]
[141,{"$f":"+VLOOKUP(+$A5,'Data Input'!$A$3:$AX$39,2,FALSE)","v":"Nirvana"},{"$f":"+VLOOKUP(+$A5,'Data Input'!$A$3:$AX$39,3,FALSE)","v":" M Claridge"},{"$f":"+VLOOKUP(+$A5,'Data Input'!$A$3:$AX$39,4,FALSE)","v":20},{"$f":"+VLOOKUP(+$A5,'Data Input'!$A$3:$AX$39,5,FALSE)","v":-23},{"$f":"+VLOOKUP(+$A5,'Data Input'!$A$3:$AX$39,6,FALSE)","v":"DNS"},{"$f":"+VLOOKUP(+$A5,'Data Input'!$A$3:$AX$39,7,FALSE)","v":"C"},{"$f":"+VLOOKUP($A5,'Data Input'!$A$3:$AX$39,33,FALSE)","v":0},{"$f":"+VLOOKUP($A5,'Data Input'!$A$3:$AX$39,34,FALSE)","v":0},{"$f":"+VLOOKUP($A5,'Data Input'!$A$3:$AX$39,35,FALSE)","v":0},null,{"$f":"+VLOOKUP($A5,'Data Input'!$A$3:$AX$39,37,FALSE)","v":"DNS"}]
[216,{"$f":"+VLOOKUP(+$A6,'Data Input'!$A$3:$AX$39,2,FALSE)","v":"Tamara"},{"$f":"+VLOOKUP(+$A6,'Data Input'!$A$3:$AX$39,3,FALSE)","v":"N Heath"},{"$f":"+VLOOKUP(+$A6,'Data Input'!$A$3:$AX$39,4,FALSE)","v":24.8},{"$f":"+VLOOKUP(+$A6,'Data Input'!$A$3:$AX$39,5,FALSE)","v":-16},{"$f":"+VLOOKUP(+$A6,'Data Input'!$A$3:$AX$39,6,FALSE)","v":"P"},{"$f":"+VLOOKUP(+$A6,'Data Input'!$A$3:$AX$39,7,FALSE)","v":"C"},{"$f":"+VLOOKUP($A6,'Data Input'!$A$3:$AX$39,33,FALSE)","v":5},{"$f":"+VLOOKUP($A6,'Data Input'!$A$3:$AX$39,34,FALSE)","v":13},{"$f":"+VLOOKUP($A6,'Data Input'!$A$3:$AX$39,35,FALSE)","v":30.959999999999127},null,{"$f":"+VLOOKUP($A6,'Data Input'!$A$3:$AX$39,37,FALSE)","v":"P"}]
{"$rows_left_out":9}