{"text_format":"1","workbook":"xlsx","n_sheets":8,"sheets":["Sam's Entry sheet","Data Input","YNR","Moonraker","Classes","Classes A","Classes B","Classes C"],"not_rendered":{"charts":0,"images":0,"macros":0,"external_links":0,"defined_names":16,"comments":0,"pivot_tables":0},"unopened":[],"bounds":{"document_bytes":16777216,"sheet_cells":100000,"rows_first":2000,"rows_last":500,"rows_between":2000,"halvings":0,"cell_chars":16384,"cell_head_chars":4096},"cells_cut":0,"cells_raw":0,"read":"whole","date_system":"1900"}

{"sheet":"Sam's Entry sheet","index":0,"n_rows":42,"n_cols":7,"rows_kept":42,"cut":false,"hidden":false,"merged":[]}
["No","Yacht","Skipper","Length","H/C","P"]
[null,null,null,null,null,null,"Do not enter data on row 2 of this sheet."]
[7,"Forester","Will Bentall","32 6",-8]
[10,"Flight","Joe Farrow","29 11",-9]
[13,"Ladybird","Ben Knight",34,1]
[15,"Pirate","Kevin Thomas",29,-7]
[22,"Moonraker","Peter Jeckells","29 6",2]
[25,"Melody","Mark Wells",26,-11]
[37,"Harrier","Jack Copping",27,-20]
[48,"Sparklet","Mike Barnes",41,9]
[79,"Daisy","Tim Ford",22,-26]
[87,"Modwena","Mark Cassidy","24 11",-19]
[98,"Force Four","JD Winterton","31 6",-21,"P"]
[141,"Nirvana","Dr Michael Claridge",19,-23,"P"]
[152,"Sabrina 2","John Holmes",29,-5]
[155,"Stratus","Rhiannon Alger","22 10",-16]
[179,"Waxwing","Robin Clayton",27,-8]
[199,"Morning Calm","Bill Clarke",26,-8]
[216,"Tamara","Nick Heath","24 8",-16]
[217,"Melinda","Paul Howes","27 11",1]
[218,"Mystery","Matt Ford",26,-8]
[219,"Farthing","Melanie Farrar",36,3]
[224,"Anna","R&D Branscombe",25,-10]
[250,"Storm","Matthew Thwaites",35,16]
[262,"Jessie May","Sally Dugdale","27 11",-5]
[303,"Nutcracker","Phil Davies",25,-11]
[314,"Whisper","Johnnie Kerridge",25,-3]
[323,"Starlight Lady","Nick Matthews",30,12]
[338,"Bewitched","Colin Chettleburgh",30,-4]
[348,"Alchemy","Richard Smith","22 6",-14]
[370,"Glory","Colin Brown",35,-6]
[373,"Meggie","Mark Tansley","34 5",14]
[416,"Alice Rose","Steve Burton","28 6",-7]
[417,"Stellar","Tim Frary","31 4",16]
[418,"Tinkerbell","Adrian Lincoln","25 10",-8]
[419,"Skylark","Will Pank",30,2]
[420,"Lyra","Paul Carrington",30,16]
[423,"Valkyrie II","Nigel Kippen",30,-25,"P"]
[429,"Pickle","Phil Montague","22 6",-16]
[]
[]
["xx","Worksheet limit - no more than 39 entries please."]

{"sheet":"Data Input","index":1,"n_rows":44,"n_cols":50,"rows_kept":44,"cut":false,"hidden":false,"merged":[]}
["No","Yacht","Skipper","Length","H/C","P","Class",null,"Start",null,null,"Out 1",null,null,"In 1",null,null,"Out 2",null,null,"In 2",null,null,"Finish",null,null,null,"Elapsed",null,null,"Pos",null,null,"Corrected",null,null,"Pos",null,"Bridge1","Bridge 2","Bridge T","T","T-B elapsed","Corr"]
[null,null,null,null,null,null,null,"H","M","S","H","M","S","H","M","S","H","M","S","H","M","S","H","M","S",null,"H","M","S",null,null," ","H","M","S",null,null," ","Seconds","Seconds","Seconds","Seconds","Seconds","Seconds"]
[{"$f":"'Sam''s Entry sheet'!A3","v":7},{"$f":"'Sam''s Entry sheet'!B3","v":"Forester"},{"$f":"'Sam''s Entry sheet'!C3","v":"Will Bentall"},{"$f":"'Sam''s Entry sheet'!D3","v":"32 6"},{"$f":"'Sam''s Entry sheet'!E3","v":-8},{"$f":"'Sam''s Entry sheet'!F3","v":0},{"$f":"IF(D3=0,\"\",IF(D3<25,\"C\",IF(D3<28.01,\"B\",\"A\")))","v":"A"},null,null,null,null,null,null,null,null,null,null,null,null,null,null,null,null,null,null,null,{"$f":"INT(AQ3/3600)","v":0},{"$f":"INT((AQ3-AA3*3600)/60)","v":0},{"$f":"AQ3-(AA3*3600+AB3*60)","v":0},null,{"$f":"+AT3","v":0},null,{"$f":"INT(AR3/3600)","v":0},{"$f":"INT((AR3-AG3*3600)/60)","v":0},{"$f":"AR3-(AG3*3600+AH3*60)","v":0},null,{"$f":"+AW3","v":0},null,{"$f":"(P3+O3*60+N3*3600)-(M3+L3*60+K3*3600)","v":0},{"$f":"(V3+U3*60+T3*3600)-(S3+R3*60+Q3*3600)","v":0},{"$f":"AM3+AN3","v":0},{"$f":"(Y3+X3*60+W3*3600)-(J3+I3*60+H3*3600)","v":0},{"$f":"ABS(AP3-AO3)","v":0},{"$f":"AQ3*(0.01*(100+E3))","v":0},{"$f":"+IF(F3=\"\",AQ3,500000)","v":500000},{"$f":"IF(F3=\"\",+RANK(AS3,$AS$3:$AS$41,1),+F3)","v":0},{"$f":"+IF(AT3<4,\"Trophy\",\"\")","v":"Trophy"},{"$f":"+IF(F3=\"\",AR3,500000)","v":500000},{"$f":"IF(F3=\"\",+RANK(AV3,$AV$3:$AV$41,1),+F3)","v":0},{"$f":"+IF(AW3<4,\"Trophy\",\"\")","v":"Trophy"}]
[{"$f":"'Sam''s Entry sheet'!A4","v":10},{"$f":"'Sam''s Entry sheet'!B4","v":"Flight"},{"$f":"'Sam''s Entry sheet'!C4","v":"Joe Farrow"},{"$f":"'Sam''s Entry sheet'!D4","v":"29 11"},{"$f":"'Sam''s Entry sheet'!E4","v":-9},{"$f":"'Sam''s Entry sheet'!F4","v":0},"A",null,null,null,null,null,null,null,null,null,null,null,null,null,null,null,null,null,null,null,0,0,0,null,0,null,0,0,0,null,0,null,0,0,0,0,0,0,500000,0,"Trophy",500000,0,"Trophy"]
[{"$f":"'Sam''s Entry sheet'!A5","v":13},{"$f":"'Sam''s Entry sheet'!B5","v":"Ladybird"},{"$f":"'Sam''s Entry sheet'!C5","v":"Ben Knight"},{"$f":"'Sam''s Entry sheet'!D5","v":34},{"$f":"'Sam''s Entry sheet'!E5","v":1},{"$f":"'Sam''s Entry sheet'!F5","v":0},"A",null,null,null,null,null,null,null,null,null,null,null,null,null,null,null,null,null,null,null,0,0,0,null,0,null,0,0,0,null,0,null,0,0,0,0,0,0,500000,0,"Trophy",500000,0,"Trophy"]
[{"$f":"'Sam''s Entry sheet'!A6","v":15},{"$f":"'Sam''s Entry sheet'!B6","v":"Pirate"},{"$f":"'Sam''s Entry sheet'!C6","v":"Kevin Thomas"},{"$f":"'Sam''s Entry sheet'!D6","v":29},{"$f":"'Sam''s Entry sheet'!E6","v":-7},{"$f":"'Sam''s Entry sheet'!F6","v":0},{"$f":"IF(D6=0,\"\",IF(D6<25,\"C\",IF(D6<28.01,\"B\",\"A\")))","v":"A"},null,null,null,null,null,null,null,null,null,null,null,null,null,null,null,null,null,null,null,0,0,0,null,0,null,0,0,0,null,0,null,0,0,0,0,0,0,500000,0,"Trophy",500000,0,"Trophy"]
[{"$f":"'Sam''s Entry sheet'!A7","v":22},{"$f":"'Sam''s Entry sheet'!B7","v":"Moonraker"},{"$f":"'Sam''s Entry sheet'!C7","v":"Peter Jeckells"},{"$f":"'Sam''s Entry sheet'!D7","v":"29 6"},{"$f":"'Sam''s Entry sheet'!E7","v":2},{"$f":"'Sam''s Entry sheet'!F7","v":0},"A",null,null,null,null,null,null,null,null,null,null,null,null,null,null,null,null,null,null,null,0,0,0,null,0,null,0,0,0,null,0,null,0,0,0,0,0,0,500000,0,"Trophy",500000,0,"Trophy"]
[{"$f":"'Sam''s Entry sheet'!A8","v":25},{"$f":"'Sam''s Entry sheet'!B8","v":"Melody"},{"$f":"'Sam''s Entry sheet'!C8","v":"Mark Wells"},{"$f":"'Sam''s Entry sheet'!D8","v":26},{"$f":"'Sam''s Entry sheet'!E8","v":-11},{"$f":"'Sam''s Entry sheet'!F8","v":0},"B",null,null,null,null,null,null,null,null,null,null,null,null,null,null,null,null,null,null,null,0,0,0,null,0,null,0,0,0,null,0,null,0,0,0,0,0,0,500000,0,"Trophy",500000,0,"Trophy"]
[{"$f":"'Sam''s Entry sheet'!A9","v":37},{"$f":"'Sam''s Entry sheet'!B9","v":"Harrier"},{"$f":"'Sam''s Entry sheet'!C9","v":"Jack Copping"},{"$f":"'Sam''s Entry sheet'!D9","v":27},{"$f":"'Sam''s Entry sheet'!E9","v":-20},{"$f":"'Sam''s Entry sheet'!F9","v":0},"B",null,null,null,null,null,null,null,null,null,null,null,null,null,null,null,null,null,null,null,0,0,0,null,0,null,0,0,0,null,0,null,0,0,0,0,0,0,500000,0,"Trophy",500000,0,"Trophy"]
[{"$f":"'Sam''s Entry sheet'!A10","v":48},{"$f":"'Sam''s Entry sheet'!B10","v":"Sparklet"},{"$f":"'Sam''s Entry sheet'!C10","v":"Mike Barnes"},{"$f":"'Sam''s Entry sheet'!D10","v":41},{"$f":"'Sam''s Entry sheet'!E10","v":9},{"$f":"'Sam''s Entry sheet'!F10","v":0},"A",null,null,null,null,null,null,null,null,null,null,null,null,null,null,null,null,null,null,null,0,0,0,null,0,null,0,0,0,null,0,null,0,0,0,0,0,0,500000,0,"Trophy",500000,0,"Trophy"]
[{"$f":"'Sam''s Entry sheet'!A11","v":79},{"$f":"'Sam''s Entry sheet'!B11","v":"Daisy"},{"$f":"'Sam''s Entry sheet'!C11","v":"Tim Ford"},{"$f":"'Sam''s Entry sheet'!D11","v":22},{"$f":"'Sam''s Entry sheet'!E11","v":-26},{"$f":"'Sam''s Entry sheet'!F11","v":0},"C",null,null,null,null,null,null,null,null,null,null,null,null,null,null,null,null,null,null,null,0,0,0,null,0,null,0,0,0,null,0,null,0,0,0,0,0,0,500000,0,"Trophy",500000,0,"Trophy"]
[{"$f":"'Sam''s Entry sheet'!A12","v":87},{"$f":"'Sam''s Entry sheet'!B12","v":"Modwena"},{"$f":"'Sam''s Entry sheet'!C12","v":"Mark Cassidy"},{"$f":"'Sam''s Entry sheet'!D12","v":"24 11"},{"$f":"'Sam''s Entry sheet'!E12","v":-19},{"$f":"'Sam''s Entry sheet'!F12","v":0},"A",null,null,null,null,null,null,null,null,null,null,null,null,null,null,null,null,null,null,null,0,0,0,null,0,null,0,0,0,null,0,null,0,0,0,0,0,0,500000,0,"Trophy",500000,0,"Trophy"]
[{"$f":"'Sam''s Entry sheet'!A13","v":98},{"$f":"'Sam''s Entry sheet'!B13","v":"Force Four"},{"$f":"'Sam''s Entry sheet'!C13","v":"JD Winterton"},{"$f":"'Sam''s Entry sheet'!D13","v":"31 6"},{"$f":"'Sam''s Entry sheet'!E13","v":-21},{"$f":"'Sam''s Entry sheet'!F13","v":"P"},"A",null,null,null,null,null,null,null,null,null,null,null,null,null,null,null,null,null,null,null,0,0,0,null,"P",null,0,0,0,null,"P",null,0,0,0,0,0,0,500000,"P","",500000,"P",""]
[{"$f":"'Sam''s Entry sheet'!A14","v":141},{"$f":"'Sam''s Entry sheet'!B14","v":"Nirvana"},{"$f":"'Sam''s Entry sheet'!C14","v":"Dr Michael Claridge"},{"$f":"'Sam''s Entry sheet'!D14","v":19},{"$f":"'Sam''s Entry sheet'!E14","v":-23},{"$f":"'Sam''s Entry sheet'!F14","v":"P"},"C",null,null,null,null,null,null,null,null,null,null,null,null,null,null,null,null,null,null,null,0,0,0,null,"P",null,0,0,0,null,"P",null,0,0,0,0,0,0,500000,"P","",500000,"P",""]
[{"$f":"'Sam''s Entry sheet'!A15","v":152},{"$f":"'Sam''s Entry sheet'!B15","v":"Sabrina 2"},{"$f":"'Sam''s Entry sheet'!C15","v":"John Holmes"},{"$f":"'Sam''s Entry sheet'!D15","v":29},{"$f":"'Sam''s Entry sheet'!E15","v":-5},{"$f":"'Sam''s Entry sheet'!F15","v":0},"A",null,null,null,null,null,null,null,null,null,null,null,null,null,null,null,null,null,null,null,0,0,0,null,0,null,0,0,0,null,0,null,0,0,0,0,0,0,500000,0,"Trophy",500000,0,"Trophy"]
[{"$f":"'Sam''s Entry sheet'!A16","v":155},{"$f":"'Sam''s Entry sheet'!B16","v":"Stratus"},{"$f":"'Sam''s Entry sheet'!C16","v":"Rhiannon Alger"},{"$f":"'Sam''s Entry sheet'!D16","v":"22 10"},{"$f":"'Sam''s Entry sheet'!E16","v":-16},{"$f":"'Sam''s Entry sheet'!F16","v":0},"A",null,null,null,null,null,null,null,null,null,null,null,null,null,null,null,null,null,null,null,0,0,0,null,0,null,0,0,0,null,0,null,0,0,0,0,0,0,500000,0,"Trophy",500000,0,"Trophy"]
[{"$f":"'Sam''s Entry sheet'!A17","v":179},{"$f":"'Sam''s Entry sheet'!B17","v":"Waxwing"},{"$f":"'Sam''s Entry sheet'!C17","v":"Robin Clayton"},{"$f":"'Sam''s Entry sheet'!D17","v":27},{"$f":"'Sam''s Entry sheet'!E17","v":-8},{"$f":"'Sam''s Entry sheet'!F17","v":0},"B",null,null,null,null,null,null,null,null,null,null,null,null,null,null,null,null,null,null,null,0,0,0,null,0,null,0,0,0,null,0,null,0,0,0,0,0,0,500000,0,"Trophy",500000,0,"Trophy"]
[{"$f":"'Sam''s Entry sheet'!A18","v":199},{"$f":"'Sam''s Entry sheet'!B18","v":"Morning Calm"},{"$f":"'Sam''s Entry sheet'!C18","v":"Bill Clarke"},{"$f":"'Sam''s Entry sheet'!D18","v":26},{"$f":"'Sam''s Entry sheet'!E18","v":-8},{"$f":"'Sam''s Entry sheet'!F18","v":0},"B",null,null,null,null,null,null,null,null,null,null,null,null,null,null,null,null,null,null,null,0,0,0,null,0,null,0,0,0,null,0,null,0,0,0,0,0,0,500000,0,"Trophy",500000,0,"Trophy"]
[{"$f":"'Sam''s Entry sheet'!A19","v":216},{"$f":"'Sam''s Entry sheet'!B19","v":"Tamara"},{"$f":"'Sam''s Entry sheet'!C19","v":"Nick Heath"},{"$f":"'Sam''s Entry sheet'!D19","v":"24 8"},{"$f":"'Sam''s Entry sheet'!E19","v":-16},{"$f":"'Sam''s Entry sheet'!F19","v":0},"A",null,null,null,null,null,null,null,null,null,null,null,null,null,null,null,null,null,null,null,0,0,0,null,0,null,0,0,0,null,0,null,0,0,0,0,0,0,500000,0,"Trophy",500000,0,"Trophy"]
[{"$f":"'Sam''s Entry sheet'!A20","v":217},{"$f":"'Sam''s Entry sheet'!B20","v":"Melinda"},{"$f":"'Sam''s Entry sheet'!C20","v":"Paul Howes"},{"$f":"'Sam''s Entry sheet'!D20","v":"27 11"},{"$f":"'Sam''s Entry sheet'!E20","v":1},{"$f":"'Sam''s Entry sheet'!F20","v":0},"A",null,null,null,null,null,null,null,null,null,null,null,null,null,null,null,null,null,null,null,0,0,0,null,0,null,0,0,0,null,0,null,0,0,0,0,0,0,500000,0,"Trophy",500000,0,"Trophy"]
[{"$f":"'Sam''s Entry sheet'!A21","v":218},{"$f":"'Sam''s Entry sheet'!B21","v":"Mystery"},{"$f":"'Sam''s Entry sheet'!C21","v":"Matt Ford"},{"$f":"'Sam''s Entry sheet'!D21","v":26},{"$f":"'Sam''s Entry sheet'!E21","v":-8},{"$f":"'Sam''s Entry sheet'!F21","v":0},"B",null,null,null,null,null,null,null,null,null,null,null,null,null,null,null,null,null,null,null,0,0,0,null,0,null,0,0,0,null,0,null,0,0,0,0,0,0,500000,0,"Trophy",500000,0,"Trophy"]
[{"$f":"'Sam''s Entry sheet'!A22","v":219},{"$f":"'Sam''s Entry sheet'!B22","v":"Farthing"},{"$f":"'Sam''s Entry sheet'!C22","v":"Melanie Farrar"},{"$f":"'Sam''s Entry sheet'!D22","v":36},{"$f":"'Sam''s Entry sheet'!E22","v":3},{"$f":"'Sam''s Entry sheet'!F22","v":0},"A",null,null,null,null,null,null,null,null,null,null,null,null,null,null,null,null,null,null,null,0,0,0,null,0,null,0,0,0,null,0,null,0,0,0,0,0,0,500000,0,"Trophy",500000,0,"Trophy"]
[{"$f":"'Sam''s Entry sheet'!A23","v":224},{"$f":"'Sam''s Entry sheet'!B23","v":"Anna"},{"$f":"'Sam''s Entry sheet'!C23","v":"R&D Branscombe"},{"$f":"'Sam''s Entry sheet'!D23","v":25},{"$f":"'Sam''s Entry sheet'!E23","v":-10},{"$f":"'Sam''s Entry sheet'!F23","v":0},"B",null,null,null,null,null,null,null,null,null,null,null,null,null,null,null,null,null,null,null,0,0,0,null,0,null,0,0,0,null,0,null,0,0,0,0,0,0,500000,0,"Trophy",500000,0,"Trophy"]
[{"$f":"'Sam''s Entry sheet'!A24","v":250},{"$f":"'Sam''s Entry sheet'!B24","v":"Storm"},{"$f":"'Sam''s Entry sheet'!C24","v":"Matthew Thwaites"},{"$f":"'Sam''s Entry sheet'!D24","v":35},{"$f":"'Sam''s Entry sheet'!E24","v":16},{"$f":"'Sam''s Entry sheet'!F24","v":0},"A",null,null,null,null,null,null,null,null,null,null,null,null,null,null,null,null,null,null,null,0,0,0,null,0,null,0,0,0,null,0,null,0,0,0,0,0,0,500000,0,"Trophy",500000,0,"Trophy"]
[{"$f":"'Sam''s Entry sheet'!A25","v":262},{"$f":"'Sam''s Entry sheet'!B25","v":"Jessie May"},{"$f":"'Sam''s Entry sheet'!C25","v":"Sally Dugdale"},{"$f":"'Sam''s Entry sheet'!D25","v":"27 11"},{"$f":"'Sam''s Entry sheet'!E25","v":-5},{"$f":"'Sam''s Entry sheet'!F25","v":0},"A",null,null,null,null,null,null,null,null,null,null,null,null,null,null,null,null,null,null,null,0,0,0,null,0,null,0,0,0,null,0,null,0,0,0,0,0,0,500000,0,"Trophy",500000,0,"Trophy"]
[{"$f":"'Sam''s Entry sheet'!A26","v":303},{"$f":"'Sam''s Entry sheet'!B26","v":"Nutcracker"},{"$f":"'Sam''s Entry sheet'!C26","v":"Phil Davies"},{"$f":"'Sam''s Entry sheet'!D26","v":25},{"$f":"'Sam''s Entry sheet'!E26","v":-11},{"$f":"'Sam''s Entry sheet'!F26","v":0},"B",null,null,null,null,null,null,null,null,null,null,null,null,null,null,null,null,null,null,null,0,0,0,null,0,null,0,0,0,null,0,null,0,0,0,0,0,0,500000,0,"Trophy",500000,0,"Trophy"]
[{"$f":"'Sam''s Entry sheet'!A27","v":314},{"$f":"'Sam''s Entry sheet'!B27","v":"Whisper"},{"$f":"'Sam''s Entry sheet'!C27","v":"Johnnie Kerridge"},{"$f":"'Sam''s Entry sheet'!D27","v":25},{"$f":"'Sam''s Entry sheet'!E27","v":-3},{"$f":"'Sam''s Entry sheet'!F27","v":0},"B",null,null,null,null,null,null,null,null,null,null,null,null,null,null,null,null,null,null,null,0,0,0,null,0,null,0,0,0,null,0,null,0,0,0,0,0,0,500000,0,"Trophy",500000,0,"Trophy"]
[{"$f":"'Sam''s Entry sheet'!A28","v":323},{"$f":"'Sam''s Entry sheet'!B28","v":"Starlight Lady"},{"$f":"'Sam''s Entry sheet'!C28","v":"Nick Matthews"},{"$f":"'Sam''s Entry sheet'!D28","v":30},{"$f":"'Sam''s Entry sheet'!E28","v":12},{"$f":"'Sam''s Entry sheet'!F28","v":0},"A",null,null,null,null,null,null,null,null,null,null,null,null,null,null,null,null,null,null,null,0,0,0,null,0,null,0,0,0,null,0,null,0,0,0,0,0,0,500000,0,"Trophy",500000,0,"Trophy"]
[{"$f":"'Sam''s Entry sheet'!A29","v":338},{"$f":"'Sam''s Entry sheet'!B29","v":"Bewitched"},{"$f":"'Sam''s Entry sheet'!C29","v":"Colin Chettleburgh"},{"$f":"'Sam''s Entry sheet'!D29","v":30},{"$f":"'Sam''s Entry sheet'!E29","v":-4},{"$f":"'Sam''s Entry sheet'!F29","v":0},"A",null,null,null,null,null,null,null,null,null,null,null,null,null,null,null,null,null,null,null,0,0,0,null,0,null,0,0,0,null,0,null,0,0,0,0,0,0,500000,0,"Trophy",500000,0,"Trophy"]
[{"$f":"'Sam''s Entry sheet'!A30","v":348},{"$f":"'Sam''s Entry sheet'!B30","v":"Alchemy"},{"$f":"'Sam''s Entry sheet'!C30","v":"Richard Smith"},{"$f":"'Sam''s Entry sheet'!D30","v":"22 6"},{"$f":"'Sam''s Entry sheet'!E30","v":-14},{"$f":"'Sam''s Entry sheet'!F30","v":0},"A",null,null,null,null,null,null,null,null,null,null,null,null,null,null,null,null,null,null,null,0,0,0,null,0,null,0,0,0,null,0,null,0,0,0,0,0,0,500000,0,"Trophy",500000,0,"Trophy"]
[{"$f":"'Sam''s Entry sheet'!A31","v":370},{"$f":"'Sam''s Entry sheet'!B31","v":"Glory"},{"$f":"'Sam''s Entry sheet'!C31","v":"Colin Brown"},{"$f":"'Sam''s Entry sheet'!D31","v":35},{"$f":"'Sam''s Entry sheet'!E31","v":-6},{"$f":"'Sam''s Entry sheet'!F31","v":0},"A",null,null,null,null,null,null,null,null,null,null,null,null,null,null,null,null,null,null,null,0,0,0,null,0,null,0,0,0,null,0,null,0,0,0,0,0,0,500000,0,"Trophy",500000,0,"Trophy"]
[{"$f":"'Sam''s Entry sheet'!A32","v":373},{"$f":"'Sam''s Entry sheet'!B32","v":"Meggie"},{"$f":"'Sam''s Entry sheet'!C32","v":"Mark Tansley"},{"$f":"'Sam''s Entry sheet'!D32","v":"34 5"},{"$f":"'Sam''s Entry sheet'!E32","v":14},{"$f":"'Sam''s Entry sheet'!F32","v":0},"A",null,null,null,null,null,null,null,null,null,null,null,null,null,null,null,null,null,null,null,0,0,0,null,0,null,0,0,0,null,0,null,0,0,0,0,0,0,500000,0,"Trophy",500000,0,"Trophy"]
[{"$f":"'Sam''s Entry sheet'!A33","v":416},{"$f":"'Sam''s Entry sheet'!B33","v":"Alice Rose"},{"$f":"'Sam''s Entry sheet'!C33","v":"Steve Burton"},{"$f":"'Sam''s Entry sheet'!D33","v":"28 6"},{"$f":"'Sam''s Entry sheet'!E33","v":-7},{"$f":"'Sam''s Entry sheet'!F33","v":0},"A",null,null,null,null,null,null,null,null,null,null,null,null,null,null,null,null,null,null,null,0,0,0,null,0,null,0,0,0,null,0,null,0,0,0,0,0,0,500000,0,"Trophy",500000,0,"Trophy"]
[{"$f":"'Sam''s Entry sheet'!A34","v":417},{"$f":"'Sam''s Entry sheet'!B34","v":"Stellar"},{"$f":"'Sam''s Entry sheet'!C34","v":"Tim Frary"},{"$f":"'Sam''s Entry sheet'!D34","v":"31 4"},{"$f":"'Sam''s Entry sheet'!E34","v":16},{"$f":"'Sam''s Entry sheet'!F34","v":0},"A",null,null,null,null,null,null,null,null,null,null,null,null,null,null,null,null,null,null,null,0,0,0,null,0,null,0,0,0,null,0,null,0,0,0,0,0,0,500000,0,"Trophy",500000,0,"Trophy"]
[{"$f":"'Sam''s Entry sheet'!A35","v":418},{"$f":"'Sam''s Entry sheet'!B35","v":"Tinkerbell"},{"$f":"'Sam''s Entry sheet'!C35","v":"Adrian Lincoln"},{"$f":"'Sam''s Entry sheet'!D35","v":"25 10"},{"$f":"'Sam''s Entry sheet'!E35","v":-8},{"$f":"'Sam''s Entry sheet'!F35","v":0},"A",null,null,null,null,null,null,null,null,null,null,null,null,null,null,null,null,null,null,null,0,0,0,null,0,null,0,0,0,null,0,null,0,0,0,0,0,0,500000,0,"Trophy",500000,0,"Trophy"]
[{"$f":"'Sam''s Entry sheet'!A36","v":419},{"$f":"'Sam''s Entry sheet'!B36","v":"Skylark"},{"$f":"'Sam''s Entry sheet'!C36","v":"Will Pank"},{"$f":"'Sam''s Entry sheet'!D36","v":30},{"$f":"'Sam''s Entry sheet'!E36","v":2},{"$f":"'Sam''s Entry sheet'!F36","v":0},"A"]
[{"$f":"'Sam''s Entry sheet'!A37","v":420},{"$f":"'Sam''s Entry sheet'!B37","v":"Lyra"},{"$f":"'Sam''s Entry sheet'!C37","v":"Paul Carrington"},{"$f":"'Sam''s Entry sheet'!D37","v":30},{"$f":"'Sam''s Entry sheet'!E37","v":16},{"$f":"'Sam''s Entry sheet'!F37","v":0},"A"]
[{"$f":"'Sam''s Entry sheet'!A38","v":423},{"$f":"'Sam''s Entry sheet'!B38","v":"Valkyrie II"},{"$f":"'Sam''s Entry sheet'!C38","v":"Nigel Kippen"},{"$f":"'Sam''s Entry sheet'!D38","v":30},{"$f":"'Sam''s Entry sheet'!E38","v":-25},{"$f":"'Sam''s Entry sheet'!F38","v":"P"},"A"]
[{"$f":"'Sam''s Entry sheet'!A39","v":429},{"$f":"'Sam''s Entry sheet'!B39","v":"Pickle"},{"$f":"'Sam''s Entry sheet'!C39","v":"Phil Montague"},{"$f":"'Sam''s Entry sheet'!D39","v":"22 6"},{"$f":"'Sam''s Entry sheet'!E39","v":-16},{"$f":"'Sam''s Entry sheet'!F39","v":0},"A"]
[{"$f":"'Sam''s Entry sheet'!A40","v":0},{"$f":"'Sam''s Entry sheet'!B40","v":0},{"$f":"'Sam''s Entry sheet'!C40","v":0},{"$f":"'Sam''s Entry sheet'!D40","v":0},{"$f":"'Sam''s Entry sheet'!E40","v":0},{"$f":"'Sam''s Entry sheet'!F40","v":0},""]
[{"$f":"'Sam''s Entry sheet'!A41","v":0},{"$f":"'Sam''s Entry sheet'!B41","v":0},{"$f":"'Sam''s Entry sheet'!C41","v":0},{"$f":"'Sam''s Entry sheet'!D41","v":0},{"$f":"'Sam''s Entry sheet'!E41","v":0},{"$f":"'Sam''s Entry sheet'!F41","v":0},""]
["xx"]
[]
[{"$f":"COUNT(A3:A43)","v":39}]

{"sheet":"YNR","index":2,"n_rows":42,"n_cols":14,"rows_kept":42,"cut":false,"hidden":false,"merged":[]}
[null,null,null,null,null,null,null,null,"Corrected"]
["No","Yacht","Skipper","Length","H/C","P","Class","H","M","S",null,"Pos"]
[{"$f":"'Data Input'!A3","v":7},{"$f":"+VLOOKUP(+$A3,'Data Input'!$A$3:$AX$41,2,FALSE)","v":"Forester"},{"$f":"+VLOOKUP(+$A3,'Data Input'!$A$3:$AX$41,3,FALSE)","v":"Will Bentall"},{"$f":"+VLOOKUP(+$A3,'Data Input'!$A$3:$AX$41,4,FALSE)","v":"32 6"},{"$f":"+VLOOKUP(+$A3,'Data Input'!$A$3:$AX$41,5,FALSE)","v":-8},{"$f":"+VLOOKUP(+$A3,'Data Input'!$A$3:$AX$41,6,FALSE)","v":0},{"$f":"+VLOOKUP(+$A3,'Data Input'!$A$3:$AX$41,7,FALSE)","v":"A"},{"$f":"+VLOOKUP($A3,'Data Input'!$A$3:$AX$41,33,FALSE)","v":0},{"$f":"+VLOOKUP($A3,'Data Input'!$A$3:$AX$41,34,FALSE)","v":0},{"$f":"+VLOOKUP($A3,'Data Input'!$A$3:$AX$41,35,FALSE)","v":0},null,{"$f":"+VLOOKUP($A3,'Data Input'!$A$3:$AX$41,37,FALSE)","v":0},null,"FIRST"]
[{"$f":"'Data Input'!A4","v":10},{"$f":"+VLOOKUP(+$A4,'Data Input'!$A$3:$AX$41,2,FALSE)","v":"Flight"},{"$f":"+VLOOKUP(+$A4,'Data Input'!$A$3:$AX$41,3,FALSE)","v":"Joe Farrow"},{"$f":"+VLOOKUP(+$A4,'Data Input'!$A$3:$AX$41,4,FALSE)","v":"29 11"},{"$f":"+VLOOKUP(+$A4,'Data Input'!$A$3:$AX$41,5,FALSE)","v":-9},{"$f":"+VLOOKUP(+$A4,'Data Input'!$A$3:$AX$41,6,FALSE)","v":0},{"$f":"+VLOOKUP(+$A4,'Data Input'!$A$3:$AX$41,7,FALSE)","v":"A"},{"$f":"+VLOOKUP($A4,'Data Input'!$A$3:$AX$41,33,FALSE)","v":0},{"$f":"+VLOOKUP($A4,'Data Input'!$A$3:$AX$41,34,FALSE)","v":0},{"$f":"+VLOOKUP($A4,'Data Input'!$A$3:$AX$41,35,FALSE)","v":0},null,{"$f":"+VLOOKUP($A4,'Data Input'!$A$3:$AX$41,37,FALSE)","v":0},null,"SECOND"]
[{"$f":"'Data Input'!A5","v":13},{"$f":"+VLOOKUP(+$A5,'Data Input'!$A$3:$AX$41,2,FALSE)","v":"Ladybird"},{"$f":"+VLOOKUP(+$A5,'Data Input'!$A$3:$AX$41,3,FALSE)","v":"Ben Knight"},{"$f":"+VLOOKUP(+$A5,'Data Input'!$A$3:$AX$41,4,FALSE)","v":34},{"$f":"+VLOOKUP(+$A5,'Data Input'!$A$3:$AX$41,5,FALSE)","v":1},{"$f":"+VLOOKUP(+$A5,'Data Input'!$A$3:$AX$41,6,FALSE)","v":0},{"$f":"+VLOOKUP(+$A5,'Data Input'!$A$3:$AX$41,7,FALSE)","v":"A"},{"$f":"+VLOOKUP($A5,'Data Input'!$A$3:$AX$41,33,FALSE)","v":0},{"$f":"+VLOOKUP($A5,'Data Input'!$A$3:$AX$41,34,FALSE)","v":0},{"$f":"+VLOOKUP($A5,'Data Input'!$A$3:$AX$41,35,FALSE)","v":0},null,{"$f":"+VLOOKUP($A5,'Data Input'!$A$3:$AX$41,37,FALSE)","v":0},null,"THIRD"]
[{"$f":"'Data Input'!A6","v":15},{"$f":"+VLOOKUP(+$A6,'Data Input'!$A$3:$AX$41,2,FALSE)","v":"Pirate"},{"$f":"+VLOOKUP(+$A6,'Data Input'!$A$3:$AX$41,3,FALSE)","v":"Kevin Thomas"},{"$f":"+VLOOKUP(+$A6,'Data Input'!$A$3:$AX$41,4,FALSE)","v":29},{"$f":"+VLOOKUP(+$A6,'Data Input'!$A$3:$AX$41,5,FALSE)","v":-7},{"$f":"+VLOOKUP(+$A6,'Data Input'!$A$3:$AX$41,6,FALSE)","v":0},{"$f":"+VLOOKUP(+$A6,'Data Input'!$A$3:$AX$41,7,FALSE)","v":"A"},{"$f":"+VLOOKUP($A6,'Data Input'!$A$3:$AX$41,33,FALSE)","v":0},{"$f":"+VLOOKUP($A6,'Data Input'!$A$3:$AX$41,34,FALSE)","v":0},{"$f":"+VLOOKUP($A6,'Data Input'!$A$3:$AX$41,35,FALSE)","v":0},null,{"$f":"+VLOOKUP($A6,'Data Input'!$A$3:$AX$41,37,FALSE)","v":0},null,4]
[{"$f":"'Data Input'!A7","v":22},{"$f":"+VLOOKUP(+$A7,'Data Input'!$A$3:$AX$41,2,FALSE)","v":"Moonraker"},{"$f":"+VLOOKUP(+$A7,'Data Input'!$A$3:$AX$41,3,FALSE)","v":"Peter Jeckells"},{"$f":"+VLOOKUP(+$A7,'Data Input'!$A$3:$AX$41,4,FALSE)","v":"29 6"},{"$f":"+VLOOKUP(+$A7,'Data Input'!$A$3:$AX$41,5,FALSE)","v":2},{"$f":"+VLOOKUP(+$A7,'Data Input'!$A$3:$AX$41,6,FALSE)","v":0},{"$f":"+VLOOKUP(+$A7,'Data Input'!$A$3:$AX$41,7,FALSE)","v":"A"},{"$f":"+VLOOKUP($A7,'Data Input'!$A$3:$AX$41,33,FALSE)","v":0},{"$f":"+VLOOKUP($A7,'Data Input'!$A$3:$AX$41,34,FALSE)","v":0},{"$f":"+VLOOKUP($A7,'Data Input'!$A$3:$AX$41,35,FALSE)","v":0},null,{"$f":"+VLOOKUP($A7,'Data Input'!$A$3:$AX$41,37,FALSE)","v":0},null,{"$f":"N6+1","v":5}]
[{"$f":"'Data Input'!A8","v":25},{"$f":"+VLOOKUP(+$A8,'Data Input'!$A$3:$AX$41,2,FALSE)","v":"Melody"},{"$f":"+VLOOKUP(+$A8,'Data Input'!$A$3:$AX$41,3,FALSE)","v":"Mark Wells"},{"$f":"+VLOOKUP(+$A8,'Data Input'!$A$3:$AX$41,4,FALSE)","v":26},{"$f":"+VLOOKUP(+$A8,'Data Input'!$A$3:$AX$41,5,FALSE)","v":-11},{"$f":"+VLOOKUP(+$A8,'Data Input'!$A$3:$AX$41,6,FALSE)","v":0},{"$f":"+VLOOKUP(+$A8,'Data Input'!$A$3:$AX$41,7,FALSE)","v":"B"},{"$f":"+VLOOKUP($A8,'Data Input'!$A$3:$AX$41,33,FALSE)","v":0},{"$f":"+VLOOKUP($A8,'Data Input'!$A$3:$AX$41,34,FALSE)","v":0},{"$f":"+VLOOKUP($A8,'Data Input'!$A$3:$AX$41,35,FALSE)","v":0},null,{"$f":"+VLOOKUP($A8,'Data Input'!$A$3:$AX$41,37,FALSE)","v":0},null,{"$f":"N7+1","v":6}]
[{"$f":"'Data Input'!A9","v":37},{"$f":"+VLOOKUP(+$A9,'Data Input'!$A$3:$AX$41,2,FALSE)","v":"Harrier"},{"$f":"+VLOOKUP(+$A9,'Data Input'!$A$3:$AX$41,3,FALSE)","v":"Jack Copping"},{"$f":"+VLOOKUP(+$A9,'Data Input'!$A$3:$AX$41,4,FALSE)","v":27},{"$f":"+VLOOKUP(+$A9,'Data Input'!$A$3:$AX$41,5,FALSE)","v":-20},{"$f":"+VLOOKUP(+$A9,'Data Input'!$A$3:$AX$41,6,FALSE)","v":0},{"$f":"+VLOOKUP(+$A9,'Data Input'!$A$3:$AX$41,7,FALSE)","v":"B"},{"$f":"+VLOOKUP($A9,'Data Input'!$A$3:$AX$41,33,FALSE)","v":0},{"$f":"+VLOOKUP($A9,'Data Input'!$A$3:$AX$41,34,FALSE)","v":0},{"$f":"+VLOOKUP($A9,'Data Input'!$A$3:$AX$41,35,FALSE)","v":0},null,{"$f":"+VLOOKUP($A9,'Data Input'!$A$3:$AX$41,37,FALSE)","v":0},null,7]
[{"$f":"'Data Input'!A10","v":48},{"$f":"+VLOOKUP(+$A10,'Data Input'!$A$3:$AX$41,2,FALSE)","v":"Sparklet"},{"$f":"+VLOOKUP(+$A10,'Data Input'!$A$3:$AX$41,3,FALSE)","v":"Mike Barnes"},{"$f":"+VLOOKUP(+$A10,'Data Input'!$A$3:$AX$41,4,FALSE)","v":41},{"$f":"+VLOOKUP(+$A10,'Data Input'!$A$3:$AX$41,5,FALSE)","v":9},{"$f":"+VLOOKUP(+$A10,'Data Input'!$A$3:$AX$41,6,FALSE)","v":0},{"$f":"+VLOOKUP(+$A10,'Data Input'!$A$3:$AX$41,7,FALSE)","v":"A"},{"$f":"+VLOOKUP($A10,'Data Input'!$A$3:$AX$41,33,FALSE)","v":0},{"$f":"+VLOOKUP($A10,'Data Input'!$A$3:$AX$41,34,FALSE)","v":0},{"$f":"+VLOOKUP($A10,'Data Input'!$A$3:$AX$41,35,FALSE)","v":0},null,{"$f":"+VLOOKUP($A10,'Data Input'!$A$3:$AX$41,37,FALSE)","v":0},null,8]
[{"$f":"'Data Input'!A11","v":79},{"$f":"+VLOOKUP(+$A11,'Data Input'!$A$3:$AX$41,2,FALSE)","v":"Daisy"},{"$f":"+VLOOKUP(+$A11,'Data Input'!$A$3:$AX$41,3,FALSE)","v":"Tim Ford"},{"$f":"+VLOOKUP(+$A11,'Data Input'!$A$3:$AX$41,4,FALSE)","v":22},{"$f":"+VLOOKUP(+$A11,'Data Input'!$A$3:$AX$41,5,FALSE)","v":-26},{"$f":"+VLOOKUP(+$A11,'Data Input'!$A$3:$AX$41,6,FALSE)","v":0},{"$f":"+VLOOKUP(+$A11,'Data Input'!$A$3:$AX$41,7,FALSE)","v":"C"},{"$f":"+VLOOKUP($A11,'Data Input'!$A$3:$AX$41,33,FALSE)","v":0},{"$f":"+VLOOKUP($A11,'Data Input'!$A$3:$AX$41,34,FALSE)","v":0},{"$f":"+VLOOKUP($A11,'Data Input'!$A$3:$AX$41,35,FALSE)","v":0},null,{"$f":"+VLOOKUP($A11,'Data Input'!$A$3:$AX$41,37,FALSE)","v":0},null,9]
[{"$f":"'Data Input'!A12","v":87},{"$f":"+VLOOKUP(+$A12,'Data Input'!$A$3:$AX$41,2,FALSE)","v":"Modwena"},{"$f":"+VLOOKUP(+$A12,'Data Input'!$A$3:$AX$41,3,FALSE)","v":"Mark Cassidy"},{"$f":"+VLOOKUP(+$A12,'Data Input'!$A$3:$AX$41,4,FALSE)","v":"24 11"},{"$f":"+VLOOKUP(+$A12,'Data Input'!$A$3:$AX$41,5,FALSE)","v":-19},{"$f":"+VLOOKUP(+$A12,'Data Input'!$A$3:$AX$41,6,FALSE)","v":0},{"$f":"+VLOOKUP(+$A12,'Data Input'!$A$3:$AX$41,7,FALSE)","v":"A"},{"$f":"+VLOOKUP($A12,'Data Input'!$A$3:$AX$41,33,FALSE)","v":0},{"$f":"+VLOOKUP($A12,'Data Input'!$A$3:$AX$41,34,FALSE)","v":0},{"$f":"+VLOOKUP($A12,'Data Input'!$A$3:$AX$41,35,FALSE)","v":0},null,{"$f":"+VLOOKUP($A12,'Data Input'!$A$3:$AX$41,37,FALSE)","v":0},null,10]
[{"$f":"'Data Input'!A13","v":98},{"$f":"+VLOOKUP(+$A13,'Data Input'!$A$3:$AX$41,2,FALSE)","v":"Force Four"},{"$f":"+VLOOKUP(+$A13,'Data Input'!$A$3:$AX$41,3,FALSE)","v":"JD Winterton"},{"$f":"+VLOOKUP(+$A13,'Data Input'!$A$3:$AX$41,4,FALSE)","v":"31 6"},{"$f":"+VLOOKUP(+$A13,'Data Input'!$A$3:$AX$41,5,FALSE)","v":-21},{"$f":"+VLOOKUP(+$A13,'Data Input'!$A$3:$AX$41,6,FALSE)","v":"P"},{"$f":"+VLOOKUP(+$A13,'Data Input'!$A$3:$AX$41,7,FALSE)","v":"A"},{"$f":"+VLOOKUP($A13,'Data Input'!$A$3:$AX$41,33,FALSE)","v":0},{"$f":"+VLOOKUP($A13,'Data Input'!$A$3:$AX$41,34,FALSE)","v":0},{"$f":"+VLOOKUP($A13,'Data Input'!$A$3:$AX$41,35,FALSE)","v":0},null,{"$f":"+VLOOKUP($A13,'Data Input'!$A$3:$AX$41,37,FALSE)","v":"P"},null,11]
[{"$f":"'Data Input'!A14","v":141},{"$f":"+VLOOKUP(+$A14,'Data Input'!$A$3:$AX$41,2,FALSE)","v":"Nirvana"},{"$f":"+VLOOKUP(+$A14,'Data Input'!$A$3:$AX$41,3,FALSE)","v":"Dr Michael Claridge"},{"$f":"+VLOOKUP(+$A14,'Data Input'!$A$3:$AX$41,4,FALSE)","v":19},{"$f":"+VLOOKUP(+$A14,'Data Input'!$A$3:$AX$41,5,FALSE)","v":-23},{"$f":"+VLOOKUP(+$A14,'Data Input'!$A$3:$AX$41,6,FALSE)","v":"P"},{"$f":"+VLOOKUP(+$A14,'Data Input'!$A$3:$AX$41,7,FALSE)","v":"C"},{"$f":"+VLOOKUP($A14,'Data Input'!$A$3:$AX$41,33,FALSE)","v":0},{"$f":"+VLOOKUP($A14,'Data Input'!$A$3:$AX$41,34,FALSE)","v":0},{"$f":"+VLOOKUP($A14,'Data Input'!$A$3:$AX$41,35,FALSE)","v":0},null,{"$f":"+VLOOKUP($A14,'Data Input'!$A$3:$AX$41,37,FALSE)","v":"P"},null,12]
[{"$f":"'Data Input'!A15","v":152},{"$f":"+VLOOKUP(+$A15,'Data Input'!$A$3:$AX$41,2,FALSE)","v":"Sabrina 2"},{"$f":"+VLOOKUP(+$A15,'Data Input'!$A$3:$AX$41,3,FALSE)","v":"John Holmes"},{"$f":"+VLOOKUP(+$A15,'Data Input'!$A$3:$AX$41,4,FALSE)","v":29},{"$f":"+VLOOKUP(+$A15,'Data Input'!$A$3:$AX$41,5,FALSE)","v":-5},{"$f":"+VLOOKUP(+$A15,'Data Input'!$A$3:$AX$41,6,FALSE)","v":0},{"$f":"+VLOOKUP(+$A15,'Data Input'!$A$3:$AX$41,7,FALSE)","v":"A"},{"$f":"+VLOOKUP($A15,'Data Input'!$A$3:$AX$41,33,FALSE)","v":0},{"$f":"+VLOOKUP($A15,'Data Input'!$A$3:$AX$41,34,FALSE)","v":0},{"$f":"+VLOOKUP($A15,'Data Input'!$A$3:$AX$41,35,FALSE)","v":0},null,{"$f":"+VLOOKUP($A15,'Data Input'!$A$3:$AX$41,37,FALSE)","v":0}]
[{"$f":"'Data Input'!A16","v":155},{"$f":"+VLOOKUP(+$A16,'Data Input'!$A$3:$AX$41,2,FALSE)","v":"Stratus"},{"$f":"+VLOOKUP(+$A16,'Data Input'!$A$3:$AX$41,3,FALSE)","v":"Rhiannon Alger"},{"$f":"+VLOOKUP(+$A16,'Data Input'!$A$3:$AX$41,4,FALSE)","v":"22 10"},{"$f":"+VLOOKUP(+$A16,'Data Input'!$A$3:$AX$41,5,FALSE)","v":-16},{"$f":"+VLOOKUP(+$A16,'Data Input'!$A$3:$AX$41,6,FALSE)","v":0},{"$f":"+VLOOKUP(+$A16,'Data Input'!$A$3:$AX$41,7,FALSE)","v":"A"},{"$f":"+VLOOKUP($A16,'Data Input'!$A$3:$AX$41,33,FALSE)","v":0},{"$f":"+VLOOKUP($A16,'Data Input'!$A$3:$AX$41,34,FALSE)","v":0},{"$f":"+VLOOKUP($A16,'Data Input'!$A$3:$AX$41,35,FALSE)","v":0},null,{"$f":"+VLOOKUP($A16,'Data Input'!$A$3:$AX$41,37,FALSE)","v":0}]
[{"$f":"'Data Input'!A17","v":179},{"$f":"+VLOOKUP(+$A17,'Data Input'!$A$3:$AX$41,2,FALSE)","v":"Waxwing"},{"$f":"+VLOOKUP(+$A17,'Data Input'!$A$3:$AX$41,3,FALSE)","v":"Robin Clayton"},{"$f":"+VLOOKUP(+$A17,'Data Input'!$A$3:$AX$41,4,FALSE)","v":27},{"$f":"+VLOOKUP(+$A17,'Data Input'!$A$3:$AX$41,5,FALSE)","v":-8},{"$f":"+VLOOKUP(+$A17,'Data Input'!$A$3:$AX$41,6,FALSE)","v":0},{"$f":"+VLOOKUP(+$A17,'Data Input'!$A$3:$AX$41,7,FALSE)","v":"B"},{"$f":"+VLOOKUP($A17,'Data Input'!$A$3:$AX$41,33,FALSE)","v":0},{"$f":"+VLOOKUP($A17,'Data Input'!$A$3:$AX$41,34,FALSE)","v":0},{"$f":"+VLOOKUP($A17,'Data Input'!$A$3:$AX$41,35,FALSE)","v":0},null,{"$f":"+VLOOKUP($A17,'Data Input'!$A$3:$AX$41,37,FALSE)","v":0}]
[{"$f":"'Data Input'!A18","v":199},{"$f":"+VLOOKUP(+$A18,'Data Input'!$A$3:$AX$41,2,FALSE)","v":"Morning Calm"},{"$f":"+VLOOKUP(+$A18,'Data Input'!$A$3:$AX$41,3,FALSE)","v":"Bill Clarke"},{"$f":"+VLOOKUP(+$A18,'Data Input'!$A$3:$AX$41,4,FALSE)","v":26},{"$f":"+VLOOKUP(+$A18,'Data Input'!$A$3:$AX$41,5,FALSE)","v":-8},{"$f":"+VLOOKUP(+$A18,'Data Input'!$A$3:$AX$41,6,FALSE)","v":0},{"$f":"+VLOOKUP(+$A18,'Data Input'!$A$3:$AX$41,7,FALSE)","v":"B"},{"$f":"+VLOOKUP($A18,'Data Input'!$A$3:$AX$41,33,FALSE)","v":0},{"$f":"+VLOOKUP($A18,'Data Input'!$A$3:$AX$41,34,FALSE)","v":0},{"$f":"+VLOOKUP($A18,'Data Input'!$A$3:$AX$41,35,FALSE)","v":0},null,{"$f":"+VLOOKUP($A18,'Data Input'!$A$3:$AX$41,37,FALSE)","v":0}]
[{"$f":"'Data Input'!A19","v":216},{"$f":"+VLOOKUP(+$A19,'Data Input'!$A$3:$AX$41,2,FALSE)","v":"Tamara"},{"$f":"+VLOOKUP(+$A19,'Data Input'!$A$3:$AX$41,3,FALSE)","v":"Nick Heath"},{"$f":"+VLOOKUP(+$A19,'Data Input'!$A$3:$AX$41,4,FALSE)","v":"24 8"},{"$f":"+VLOOKUP(+$A19,'Data Input'!$A$3:$AX$41,5,FALSE)","v":-16},{"$f":"+VLOOKUP(+$A19,'Data Input'!$A$3:$AX$41,6,FALSE)","v":0},{"$f":"+VLOOKUP(+$A19,'Data Input'!$A$3:$AX$41,7,FALSE)","v":"A"},{"$f":"+VLOOKUP($A19,'Data Input'!$A$3:$AX$41,33,FALSE)","v":0},{"$f":"+VLOOKUP($A19,'Data Input'!$A$3:$AX$41,34,FALSE)","v":0},{"$f":"+VLOOKUP($A19,'Data Input'!$A$3:$AX$41,35,FALSE)","v":0},null,{"$f":"+VLOOKUP($A19,'Data Input'!$A$3:$AX$41,37,FALSE)","v":0}]
[{"$f":"'Data Input'!A20","v":217},{"$f":"+VLOOKUP(+$A20,'Data Input'!$A$3:$AX$41,2,FALSE)","v":"Melinda"},{"$f":"+VLOOKUP(+$A20,'Data Input'!$A$3:$AX$41,3,FALSE)","v":"Paul Howes"},{"$f":"+VLOOKUP(+$A20,'Data Input'!$A$3:$AX$41,4,FALSE)","v":"27 11"},{"$f":"+VLOOKUP(+$A20,'Data Input'!$A$3:$AX$41,5,FALSE)","v":1},{"$f":"+VLOOKUP(+$A20,'Data Input'!$A$3:$AX$41,6,FALSE)","v":0},{"$f":"+VLOOKUP(+$A20,'Data Input'!$A$3:$AX$41,7,FALSE)","v":"A"},{"$f":"+VLOOKUP($A20,'Data Input'!$A$3:$AX$41,33,FALSE)","v":0},{"$f":"+VLOOKUP($A20,'Data Input'!$A$3:$AX$41,34,FALSE)","v":0},{"$f":"+VLOOKUP($A20,'Data Input'!$A$3:$AX$41,35,FALSE)","v":0},null,{"$f":"+VLOOKUP($A20,'Data Input'!$A$3:$AX$41,37,FALSE)","v":0}]
[{"$f":"'Data Input'!A21","v":218},{"$f":"+VLOOKUP(+$A21,'Data Input'!$A$3:$AX$41,2,FALSE)","v":"Mystery"},{"$f":"+VLOOKUP(+$A21,'Data Input'!$A$3:$AX$41,3,FALSE)","v":"Matt Ford"},{"$f":"+VLOOKUP(+$A21,'Data Input'!$A$3:$AX$41,4,FALSE)","v":26},{"$f":"+VLOOKUP(+$A21,'Data Input'!$A$3:$AX$41,5,FALSE)","v":-8},{"$f":"+VLOOKUP(+$A21,'Data Input'!$A$3:$AX$41,6,FALSE)","v":0},{"$f":"+VLOOKUP(+$A21,'Data Input'!$A$3:$AX$41,7,FALSE)","v":"B"},{"$f":"+VLOOKUP($A21,'Data Input'!$A$3:$AX$41,33,FALSE)","v":0},{"$f":"+VLOOKUP($A21,'Data Input'!$A$3:$AX$41,34,FALSE)","v":0},{"$f":"+VLOOKUP($A21,'Data Input'!$A$3:$AX$41,35,FALSE)","v":0},null,{"$f":"+VLOOKUP($A21,'Data Input'!$A$3:$AX$41,37,FALSE)","v":0}]
[{"$f":"'Data Input'!A22","v":219},{"$f":"+VLOOKUP(+$A22,'Data Input'!$A$3:$AX$41,2,FALSE)","v":"Farthing"},{"$f":"+VLOOKUP(+$A22,'Data Input'!$A$3:$AX$41,3,FALSE)","v":"Melanie Farrar"},{"$f":"+VLOOKUP(+$A22,'Data Input'!$A$3:$AX$41,4,FALSE)","v":36},{"$f":"+VLOOKUP(+$A22,'Data Input'!$A$3:$AX$41,5,FALSE)","v":3},{"$f":"+VLOOKUP(+$A22,'Data Input'!$A$3:$AX$41,6,FALSE)","v":0},{"$f":"+VLOOKUP(+$A22,'Data Input'!$A$3:$AX$41,7,FALSE)","v":"A"},{"$f":"+VLOOKUP($A22,'Data Input'!$A$3:$AX$41,33,FALSE)","v":0},{"$f":"+VLOOKUP($A22,'Data Input'!$A$3:$AX$41,34,FALSE)","v":0},{"$f":"+VLOOKUP($A22,'Data Input'!$A$3:$AX$41,35,FALSE)","v":0},null,{"$f":"+VLOOKUP($A22,'Data Input'!$A$3:$AX$41,37,FALSE)","v":0}]
[{"$f":"'Data Input'!A23","v":224},{"$f":"+VLOOKUP(+$A23,'Data Input'!$A$3:$AX$41,2,FALSE)","v":"Anna"},{"$f":"+VLOOKUP(+$A23,'Data Input'!$A$3:$AX$41,3,FALSE)","v":"R&D Branscombe"},{"$f":"+VLOOKUP(+$A23,'Data Input'!$A$3:$AX$41,4,FALSE)","v":25},{"$f":"+VLOOKUP(+$A23,'Data Input'!$A$3:$AX$41,5,FALSE)","v":-10},{"$f":"+VLOOKUP(+$A23,'Data Input'!$A$3:$AX$41,6,FALSE)","v":0},{"$f":"+VLOOKUP(+$A23,'Data Input'!$A$3:$AX$41,7,FALSE)","v":"B"},{"$f":"+VLOOKUP($A23,'Data Input'!$A$3:$AX$41,33,FALSE)","v":0},{"$f":"+VLOOKUP($A23,'Data Input'!$A$3:$AX$41,34,FALSE)","v":0},{"$f":"+VLOOKUP($A23,'Data Input'!$A$3:$AX$41,35,FALSE)","v":0},null,{"$f":"+VLOOKUP($A23,'Data Input'!$A$3:$AX$41,37,FALSE)","v":0}]
[{"$f":"'Data Input'!A24","v":250},{"$f":"+VLOOKUP(+$A24,'Data Input'!$A$3:$AX$41,2,FALSE)","v":"Storm"},{"$f":"+VLOOKUP(+$A24,'Data Input'!$A$3:$AX$41,3,FALSE)","v":"Matthew Thwaites"},{"$f":"+VLOOKUP(+$A24,'Data Input'!$A$3:$AX$41,4,FALSE)","v":35},{"$f":"+VLOOKUP(+$A24,'Data Input'!$A$3:$AX$41,5,FALSE)","v":16},{"$f":"+VLOOKUP(+$A24,'Data Input'!$A$3:$AX$41,6,FALSE)","v":0},{"$f":"+VLOOKUP(+$A24,'Data Input'!$A$3:$AX$41,7,FALSE)","v":"A"},{"$f":"+VLOOKUP($A24,'Data Input'!$A$3:$AX$41,33,FALSE)","v":0},{"$f":"+VLOOKUP($A24,'Data Input'!$A$3:$AX$41,34,FALSE)","v":0},{"$f":"+VLOOKUP($A24,'Data Input'!$A$3:$AX$41,35,FALSE)","v":0},null,{"$f":"+VLOOKUP($A24,'Data Input'!$A$3:$AX$41,37,FALSE)","v":0}]
[{"$f":"'Data Input'!A25","v":262},{"$f":"+VLOOKUP(+$A25,'Data Input'!$A$3:$AX$41,2,FALSE)","v":"Jessie May"},{"$f":"+VLOOKUP(+$A25,'Data Input'!$A$3:$AX$41,3,FALSE)","v":"Sally Dugdale"},{"$f":"+VLOOKUP(+$A25,'Data Input'!$A$3:$AX$41,4,FALSE)","v":"27 11"},{"$f":"+VLOOKUP(+$A25,'Data Input'!$A$3:$AX$41,5,FALSE)","v":-5},{"$f":"+VLOOKUP(+$A25,'Data Input'!$A$3:$AX$41,6,FALSE)","v":0},{"$f":"+VLOOKUP(+$A25,'Data Input'!$A$3:$AX$41,7,FALSE)","v":"A"},{"$f":"+VLOOKUP($A25,'Data Input'!$A$3:$AX$41,33,FALSE)","v":0},{"$f":"+VLOOKUP($A25,'Data Input'!$A$3:$AX$41,34,FALSE)","v":0},{"$f":"+VLOOKUP($A25,'Data Input'!$A$3:$AX$41,35,FALSE)","v":0},null,{"$f":"+VLOOKUP($A25,'Data Input'!$A$3:$AX$41,37,FALSE)","v":0}]
[{"$f":"'Data Input'!A26","v":303},{"$f":"+VLOOKUP(+$A26,'Data Input'!$A$3:$AX$41,2,FALSE)","v":"Nutcracker"},{"$f":"+VLOOKUP(+$A26,'Data Input'!$A$3:$AX$41,3,FALSE)","v":"Phil Davies"},{"$f":"+VLOOKUP(+$A26,'Data Input'!$A$3:$AX$41,4,FALSE)","v":25},{"$f":"+VLOOKUP(+$A26,'Data Input'!$A$3:$AX$41,5,FALSE)","v":-11},{"$f":"+VLOOKUP(+$A26,'Data Input'!$A$3:$AX$41,6,FALSE)","v":0},{"$f":"+VLOOKUP(+$A26,'Data Input'!$A$3:$AX$41,7,FALSE)","v":"B"},{"$f":"+VLOOKUP($A26,'Data Input'!$A$3:$AX$41,33,FALSE)","v":0},{"$f":"+VLOOKUP($A26,'Data Input'!$A$3:$AX$41,34,FALSE)","v":0},{"$f":"+VLOOKUP($A26,'Data Input'!$A$3:$AX$41,35,FALSE)","v":0},null,{"$f":"+VLOOKUP($A26,'Data Input'!$A$3:$AX$41,37,FALSE)","v":0}]
[{"$f":"'Data Input'!A27","v":314},{"$f":"+VLOOKUP(+$A27,'Data Input'!$A$3:$AX$41,2,FALSE)","v":"Whisper"},{"$f":"+VLOOKUP(+$A27,'Data Input'!$A$3:$AX$41,3,FALSE)","v":"Johnnie Kerridge"},{"$f":"+VLOOKUP(+$A27,'Data Input'!$A$3:$AX$41,4,FALSE)","v":25},{"$f":"+VLOOKUP(+$A27,'Data Input'!$A$3:$AX$41,5,FALSE)","v":-3},{"$f":"+VLOOKUP(+$A27,'Data Input'!$A$3:$AX$41,6,FALSE)","v":0},{"$f":"+VLOOKUP(+$A27,'Data Input'!$A$3:$AX$41,7,FALSE)","v":"B"},{"$f":"+VLOOKUP($A27,'Data Input'!$A$3:$AX$41,33,FALSE)","v":0},{"$f":"+VLOOKUP($A27,'Data Input'!$A$3:$AX$41,34,FALSE)","v":0},{"$f":"+VLOOKUP($A27,'Data Input'!$A$3:$AX$41,35,FALSE)","v":0},null,{"$f":"+VLOOKUP($A27,'Data Input'!$A$3:$AX$41,37,FALSE)","v":0}]
[{"$f":"'Data Input'!A28","v":323},{"$f":"+VLOOKUP(+$A28,'Data Input'!$A$3:$AX$41,2,FALSE)","v":"Starlight Lady"},{"$f":"+VLOOKUP(+$A28,'Data Input'!$A$3:$AX$41,3,FALSE)","v":"Nick Matthews"},{"$f":"+VLOOKUP(+$A28,'Data Input'!$A$3:$AX$41,4,FALSE)","v":30},{"$f":"+VLOOKUP(+$A28,'Data Input'!$A$3:$AX$41,5,FALSE)","v":12},{"$f":"+VLOOKUP(+$A28,'Data Input'!$A$3:$AX$41,6,FALSE)","v":0},{"$f":"+VLOOKUP(+$A28,'Data Input'!$A$3:$AX$41,7,FALSE)","v":"A"},{"$f":"+VLOOKUP($A28,'Data Input'!$A$3:$AX$41,33,FALSE)","v":0},{"$f":"+VLOOKUP($A28,'Data Input'!$A$3:$AX$41,34,FALSE)","v":0},{"$f":"+VLOOKUP($A28,'Data Input'!$A$3:$AX$41,35,FALSE)","v":0},null,{"$f":"+VLOOKUP($A28,'Data Input'!$A$3:$AX$41,37,FALSE)","v":0}]
[{"$f":"'Data Input'!A29","v":338},{"$f":"+VLOOKUP(+$A29,'Data Input'!$A$3:$AX$41,2,FALSE)","v":"Bewitched"},{"$f":"+VLOOKUP(+$A29,'Data Input'!$A$3:$AX$41,3,FALSE)","v":"Colin Chettleburgh"},{"$f":"+VLOOKUP(+$A29,'Data Input'!$A$3:$AX$41,4,FALSE)","v":30},{"$f":"+VLOOKUP(+$A29,'Data Input'!$A$3:$AX$41,5,FALSE)","v":-4},{"$f":"+VLOOKUP(+$A29,'Data Input'!$A$3:$AX$41,6,FALSE)","v":0},{"$f":"+VLOOKUP(+$A29,'Data Input'!$A$3:$AX$41,7,FALSE)","v":"A"},{"$f":"+VLOOKUP($A29,'Data Input'!$A$3:$AX$41,33,FALSE)","v":0},{"$f":"+VLOOKUP($A29,'Data Input'!$A$3:$AX$41,34,FALSE)","v":0},{"$f":"+VLOOKUP($A29,'Data Input'!$A$3:$AX$41,35,FALSE)","v":0},null,{"$f":"+VLOOKUP($A29,'Data Input'!$A$3:$AX$41,37,FALSE)","v":0}]
[{"$f":"'Data Input'!A30","v":348},{"$f":"+VLOOKUP(+$A30,'Data Input'!$A$3:$AX$41,2,FALSE)","v":"Alchemy"},{"$f":"+VLOOKUP(+$A30,'Data Input'!$A$3:$AX$41,3,FALSE)","v":"Richard Smith"},{"$f":"+VLOOKUP(+$A30,'Data Input'!$A$3:$AX$41,4,FALSE)","v":"22 6"},{"$f":"+VLOOKUP(+$A30,'Data Input'!$A$3:$AX$41,5,FALSE)","v":-14},{"$f":"+VLOOKUP(+$A30,'Data Input'!$A$3:$AX$41,6,FALSE)","v":0},{"$f":"+VLOOKUP(+$A30,'Data Input'!$A$3:$AX$41,7,FALSE)","v":"A"},{"$f":"+VLOOKUP($A30,'Data Input'!$A$3:$AX$41,33,FALSE)","v":0},{"$f":"+VLOOKUP($A30,'Data Input'!$A$3:$AX$41,34,FALSE)","v":0},{"$f":"+VLOOKUP($A30,'Data Input'!$A$3:$AX$41,35,FALSE)","v":0},null,{"$f":"+VLOOKUP($A30,'Data Input'!$A$3:$AX$41,37,FALSE)","v":0}]
[{"$f":"'Data Input'!A31","v":370},{"$f":"+VLOOKUP(+$A31,'Data Input'!$A$3:$AX$41,2,FALSE)","v":"Glory"},{"$f":"+VLOOKUP(+$A31,'Data Input'!$A$3:$AX$41,3,FALSE)","v":"Colin Brown"},{"$f":"+VLOOKUP(+$A31,'Data Input'!$A$3:$AX$41,4,FALSE)","v":35},{"$f":"+VLOOKUP(+$A31,'Data Input'!$A$3:$AX$41,5,FALSE)","v":-6},{"$f":"+VLOOKUP(+$A31,'Data Input'!$A$3:$AX$41,6,FALSE)","v":0},{"$f":"+VLOOKUP(+$A31,'Data Input'!$A$3:$AX$41,7,FALSE)","v":"A"},{"$f":"+VLOOKUP($A31,'Data Input'!$A$3:$AX$41,33,FALSE)","v":0},{"$f":"+VLOOKUP($A31,'Data Input'!$A$3:$AX$41,34,FALSE)","v":0},{"$f":"+VLOOKUP($A31,'Data Input'!$A$3:$AX$41,35,FALSE)","v":0},null,{"$f":"+VLOOKUP($A31,'Data Input'!$A$3:$AX$41,37,FALSE)","v":0}]
[{"$f":"'Data Input'!A32","v":373},{"$f":"+VLOOKUP(+$A32,'Data Input'!$A$3:$AX$41,2,FALSE)","v":"Meggie"},{"$f":"+VLOOKUP(+$A32,'Data Input'!$A$3:$AX$41,3,FALSE)","v":"Mark Tansley"},{"$f":"+VLOOKUP(+$A32,'Data Input'!$A$3:$AX$41,4,FALSE)","v":"34 5"},{"$f":"+VLOOKUP(+$A32,'Data Input'!$A$3:$AX$41,5,FALSE)","v":14},{"$f":"+VLOOKUP(+$A32,'Data Input'!$A$3:$AX$41,6,FALSE)","v":0},{"$f":"+VLOOKUP(+$A32,'Data Input'!$A$3:$AX$41,7,FALSE)","v":"A"},{"$f":"+VLOOKUP($A32,'Data Input'!$A$3:$AX$41,33,FALSE)","v":0},{"$f":"+VLOOKUP($A32,'Data Input'!$A$3:$AX$41,34,FALSE)","v":0},{"$f":"+VLOOKUP($A32,'Data Input'!$A$3:$AX$41,35,FALSE)","v":0},null,{"$f":"+VLOOKUP($A32,'Data Input'!$A$3:$AX$41,37,FALSE)","v":0}]
[{"$f":"'Data Input'!A33","v":416},{"$f":"+VLOOKUP(+$A33,'Data Input'!$A$3:$AX$41,2,FALSE)","v":"Alice Rose"},{"$f":"+VLOOKUP(+$A33,'Data Input'!$A$3:$AX$41,3,FALSE)","v":"Steve Burton"},{"$f":"+VLOOKUP(+$A33,'Data Input'!$A$3:$AX$41,4,FALSE)","v":"28 6"},{"$f":"+VLOOKUP(+$A33,'Data Input'!$A$3:$AX$41,5,FALSE)","v":-7},{"$f":"+VLOOKUP(+$A33,'Data Input'!$A$3:$AX$41,6,FALSE)","v":0},{"$f":"+VLOOKUP(+$A33,'Data Input'!$A$3:$AX$41,7,FALSE)","v":"A"},{"$f":"+VLOOKUP($A33,'Data Input'!$A$3:$AX$41,33,FALSE)","v":0},{"$f":"+VLOOKUP($A33,'Data Input'!$A$3:$AX$41,34,FALSE)","v":0},{"$f":"+VLOOKUP($A33,'Data Input'!$A$3:$AX$41,35,FALSE)","v":0},null,{"$f":"+VLOOKUP($A33,'Data Input'!$A$3:$AX$41,37,FALSE)","v":0}]
[{"$f":"'Data Input'!A34","v":417},{"$f":"+VLOOKUP(+$A34,'Data Input'!$A$3:$AX$41,2,FALSE)","v":"Stellar"},{"$f":"+VLOOKUP(+$A34,'Data Input'!$A$3:$AX$41,3,FALSE)","v":"Tim Frary"},{"$f":"+VLOOKUP(+$A34,'Data Input'!$A$3:$AX$41,4,FALSE)","v":"31 4"},{"$f":"+VLOOKUP(+$A34,'Data Input'!$A$3:$AX$41,5,FALSE)","v":16},{"$f":"+VLOOKUP(+$A34,'Data Input'!$A$3:$AX$41,6,FALSE)","v":0},{"$f":"+VLOOKUP(+$A34,'Data Input'!$A$3:$AX$41,7,FALSE)","v":"A"},{"$f":"+VLOOKUP($A34,'Data Input'!$A$3:$AX$41,33,FALSE)","v":0},{"$f":"+VLOOKUP($A34,'Data Input'!$A$3:$AX$41,34,FALSE)","v":0},{"$f":"+VLOOKUP($A34,'Data Input'!$A$3:$AX$41,35,FALSE)","v":0},null,{"$f":"+VLOOKUP($A34,'Data Input'!$A$3:$AX$41,37,FALSE)","v":0}]
[{"$f":"'Data Input'!A35","v":418},{"$f":"+VLOOKUP(+$A35,'Data Input'!$A$3:$AX$41,2,FALSE)","v":"Tinkerbell"},{"$f":"+VLOOKUP(+$A35,'Data Input'!$A$3:$AX$41,3,FALSE)","v":"Adrian Lincoln"},{"$f":"+VLOOKUP(+$A35,'Data Input'!$A$3:$AX$41,4,FALSE)","v":"25 10"},{"$f":"+VLOOKUP(+$A35,'Data Input'!$A$3:$AX$41,5,FALSE)","v":-8},{"$f":"+VLOOKUP(+$A35,'Data Input'!$A$3:$AX$41,6,FALSE)","v":0},{"$f":"+VLOOKUP(+$A35,'Data Input'!$A$3:$AX$41,7,FALSE)","v":"A"},{"$f":"+VLOOKUP($A35,'Data Input'!$A$3:$AX$41,33,FALSE)","v":0},{"$f":"+VLOOKUP($A35,'Data Input'!$A$3:$AX$41,34,FALSE)","v":0},{"$f":"+VLOOKUP($A35,'Data Input'!$A$3:$AX$41,35,FALSE)","v":0},null,{"$f":"+VLOOKUP($A35,'Data Input'!$A$3:$AX$41,37,FALSE)","v":0}]
[{"$f":"'Data Input'!A36","v":419},{"$f":"+VLOOKUP(+$A36,'Data Input'!$A$3:$AX$41,2,FALSE)","v":"Skylark"},{"$f":"+VLOOKUP(+$A36,'Data Input'!$A$3:$AX$41,3,FALSE)","v":"Will Pank"},{"$f":"+VLOOKUP(+$A36,'Data Input'!$A$3:$AX$41,4,FALSE)","v":30},{"$f":"+VLOOKUP(+$A36,'Data Input'!$A$3:$AX$41,5,FALSE)","v":2},{"$f":"+VLOOKUP(+$A36,'Data Input'!$A$3:$AX$41,6,FALSE)","v":0},{"$f":"+VLOOKUP(+$A36,'Data Input'!$A$3:$AX$41,7,FALSE)","v":"A"},{"$f":"+VLOOKUP($A36,'Data Input'!$A$3:$AX$41,33,FALSE)","v":0},{"$f":"+VLOOKUP($A36,'Data Input'!$A$3:$AX$41,34,FALSE)","v":0},{"$f":"+VLOOKUP($A36,'Data Input'!$A$3:$AX$41,35,FALSE)","v":0},null,{"$f":"+VLOOKUP($A36,'Data Input'!$A$3:$AX$41,37,FALSE)","v":0}]
[{"$f":"'Data Input'!A37","v":420},{"$f":"+VLOOKUP(+$A37,'Data Input'!$A$3:$AX$41,2,FALSE)","v":"Lyra"},{"$f":"+VLOOKUP(+$A37,'Data Input'!$A$3:$AX$41,3,FALSE)","v":"Paul Carrington"},{"$f":"+VLOOKUP(+$A37,'Data Input'!$A$3:$AX$41,4,FALSE)","v":30},{"$f":"+VLOOKUP(+$A37,'Data Input'!$A$3:$AX$41,5,FALSE)","v":16},{"$f":"+VLOOKUP(+$A37,'Data Input'!$A$3:$AX$41,6,FALSE)","v":0},{"$f":"+VLOOKUP(+$A37,'Data Input'!$A$3:$AX$41,7,FALSE)","v":"A"},{"$f":"+VLOOKUP($A37,'Data Input'!$A$3:$AX$41,33,FALSE)","v":0},{"$f":"+VLOOKUP($A37,'Data Input'!$A$3:$AX$41,34,FALSE)","v":0},{"$f":"+VLOOKUP($A37,'Data Input'!$A$3:$AX$41,35,FALSE)","v":0},null,{"$f":"+VLOOKUP($A37,'Data Input'!$A$3:$AX$41,37,FALSE)","v":0}]
[{"$f":"'Data Input'!A38","v":423},{"$f":"+VLOOKUP(+$A38,'Data Input'!$A$3:$AX$41,2,FALSE)","v":"Valkyrie II"},{"$f":"+VLOOKUP(+$A38,'Data Input'!$A$3:$AX$41,3,FALSE)","v":"Nigel Kippen"},{"$f":"+VLOOKUP(+$A38,'Data Input'!$A$3:$AX$41,4,FALSE)","v":30},{"$f":"+VLOOKUP(+$A38,'Data Input'!$A$3:$AX$41,5,FALSE)","v":-25},{"$f":"+VLOOKUP(+$A38,'Data Input'!$A$3:$AX$41,6,FALSE)","v":"P"},{"$f":"+VLOOKUP(+$A38,'Data Input'!$A$3:$AX$41,7,FALSE)","v":"A"},{"$f":"+VLOOKUP($A38,'Data Input'!$A$3:$AX$41,33,FALSE)","v":0},{"$f":"+VLOOKUP($A38,'Data Input'!$A$3:$AX$41,34,FALSE)","v":0},{"$f":"+VLOOKUP($A38,'Data Input'!$A$3:$AX$41,35,FALSE)","v":0},null,{"$f":"+VLOOKUP($A38,'Data Input'!$A$3:$AX$41,37,FALSE)","v":0}]
[{"$f":"'Data Input'!A39","v":429},{"$f":"+VLOOKUP(+$A39,'Data Input'!$A$3:$AX$41,2,FALSE)","v":"Pickle"},{"$f":"+VLOOKUP(+$A39,'Data Input'!$A$3:$AX$41,3,FALSE)","v":"Phil Montague"},{"$f":"+VLOOKUP(+$A39,'Data Input'!$A$3:$AX$41,4,FALSE)","v":"22 6"},{"$f":"+VLOOKUP(+$A39,'Data Input'!$A$3:$AX$41,5,FALSE)","v":-16},{"$f":"+VLOOKUP(+$A39,'Data Input'!$A$3:$AX$41,6,FALSE)","v":0},{"$f":"+VLOOKUP(+$A39,'Data Input'!$A$3:$AX$41,7,FALSE)","v":"A"},{"$f":"+VLOOKUP($A39,'Data Input'!$A$3:$AX$41,33,FALSE)","v":0},{"$f":"+VLOOKUP($A39,'Data Input'!$A$3:$AX$41,34,FALSE)","v":0},{"$f":"+VLOOKUP($A39,'Data Input'!$A$3:$AX$41,35,FALSE)","v":0},null,{"$f":"+VLOOKUP($A39,'Data Input'!$A$3:$AX$41,37,FALSE)","v":0}]
[{"$f":"'Data Input'!A40","v":0},{"$f":"+VLOOKUP(+$A40,'Data Input'!$A$3:$AX$41,2,FALSE)","v":0},{"$f":"+VLOOKUP(+$A40,'Data Input'!$A$3:$AX$41,3,FALSE)","v":0},{"$f":"+VLOOKUP(+$A40,'Data Input'!$A$3:$AX$41,4,FALSE)","v":0},{"$f":"+VLOOKUP(+$A40,'Data Input'!$A$3:$AX$41,5,FALSE)","v":0},{"$f":"+VLOOKUP(+$A40,'Data Input'!$A$3:$AX$41,6,FALSE)","v":0},{"$f":"+VLOOKUP(+$A40,'Data Input'!$A$3:$AX$41,7,FALSE)","v":""},{"$f":"+VLOOKUP($A40,'Data Input'!$A$3:$AX$41,33,FALSE)","v":0},{"$f":"+VLOOKUP($A40,'Data Input'!$A$3:$AX$41,34,FALSE)","v":0},{"$f":"+VLOOKUP($A40,'Data Input'!$A$3:$AX$41,35,FALSE)","v":0},null,{"$f":"+VLOOKUP($A40,'Data Input'!$A$3:$AX$41,37,FALSE)","v":0}]
[{"$f":"'Data Input'!A41","v":0},{"$f":"+VLOOKUP(+$A41,'Data Input'!$A$3:$AX$41,2,FALSE)","v":0},{"$f":"+VLOOKUP(+$A41,'Data Input'!$A$3:$AX$41,3,FALSE)","v":0},{"$f":"+VLOOKUP(+$A41,'Data Input'!$A$3:$AX$41,4,FALSE)","v":0},{"$f":"+VLOOKUP(+$A41,'Data Input'!$A$3:$AX$41,5,FALSE)","v":0},{"$f":"+VLOOKUP(+$A41,'Data Input'!$A$3:$AX$41,6,FALSE)","v":0},{"$f":"+VLOOKUP(+$A41,'Data Input'!$A$3:$AX$41,7,FALSE)","v":""},{"$f":"+VLOOKUP($A41,'Data Input'!$A$3:$AX$41,33,FALSE)","v":0},{"$f":"+VLOOKUP($A41,'Data Input'!$A$3:$AX$41,34,FALSE)","v":0},{"$f":"+VLOOKUP($A41,'Data Input'!$A$3:$AX$41,35,FALSE)","v":0},null,{"$f":"+VLOOKUP($A41,'Data Input'!$A$3:$AX$41,37,FALSE)","v":0}]
[{"$f":"COUNT(A3:A41)","v":39}]

{"sheet":"Moonraker","index":3,"n_rows":42,"n_cols":14,"rows_kept":42,"cut":false,"hidden":false,"merged":[]}
[null,null,null,null,null,null,null,null,"Elapsed"]
["No","Yacht","Skipper","Length","H/C","P","Class","H","M","S",null,"Pos"," "]
[{"$f":"'Data Input'!A3","v":7},{"$f":"+VLOOKUP(+$A3,'Data Input'!$A$3:$AX$41,2,FALSE)","v":"Forester"},{"$f":"+VLOOKUP(+$A3,'Data Input'!$A$3:$AX$41,3,FALSE)","v":"Will Bentall"},{"$f":"+VLOOKUP(+$A3,'Data Input'!$A$3:$AX$41,4,FALSE)","v":"32 6"},{"$f":"+VLOOKUP(+$A3,'Data Input'!$A$3:$AX$41,5,FALSE)","v":-8},{"$f":"+VLOOKUP(+$A3,'Data Input'!$A$3:$AX$41,6,FALSE)","v":0},{"$f":"+VLOOKUP(+$A3,'Data Input'!$A$3:$AX$41,7,FALSE)","v":"A"},{"$f":"+VLOOKUP($A3,'Data Input'!$A$3:$AX$41,27,FALSE)","v":0},{"$f":"+VLOOKUP($A3,'Data Input'!$A$3:$AX$41,28,FALSE)","v":0},{"$f":"+VLOOKUP($A3,'Data Input'!$A$3:$AX$41,29,FALSE)","v":0},null,{"$f":"+VLOOKUP($A3,'Data Input'!$A$3:$AX$41,31,FALSE)","v":0},null,"FIRST"]
[{"$f":"'Data Input'!A4","v":10},{"$f":"+VLOOKUP(+$A4,'Data Input'!$A$3:$AX$41,2,FALSE)","v":"Flight"},{"$f":"+VLOOKUP(+$A4,'Data Input'!$A$3:$AX$41,3,FALSE)","v":"Joe Farrow"},{"$f":"+VLOOKUP(+$A4,'Data Input'!$A$3:$AX$41,4,FALSE)","v":"29 11"},{"$f":"+VLOOKUP(+$A4,'Data Input'!$A$3:$AX$41,5,FALSE)","v":-9},{"$f":"+VLOOKUP(+$A4,'Data Input'!$A$3:$AX$41,6,FALSE)","v":0},{"$f":"+VLOOKUP(+$A4,'Data Input'!$A$3:$AX$41,7,FALSE)","v":"A"},{"$f":"+VLOOKUP($A4,'Data Input'!$A$3:$AX$41,27,FALSE)","v":0},{"$f":"+VLOOKUP($A4,'Data Input'!$A$3:$AX$41,28,FALSE)","v":0},{"$f":"+VLOOKUP($A4,'Data Input'!$A$3:$AX$41,29,FALSE)","v":0},null,{"$f":"+VLOOKUP($A4,'Data Input'!$A$3:$AX$41,31,FALSE)","v":0},null,"SECOND"]
[{"$f":"'Data Input'!A5","v":13},{"$f":"+VLOOKUP(+$A5,'Data Input'!$A$3:$AX$41,2,FALSE)","v":"Ladybird"},{"$f":"+VLOOKUP(+$A5,'Data Input'!$A$3:$AX$41,3,FALSE)","v":"Ben Knight"},{"$f":"+VLOOKUP(+$A5,'Data Input'!$A$3:$AX$41,4,FALSE)","v":34},{"$f":"+VLOOKUP(+$A5,'Data Input'!$A$3:$AX$41,5,FALSE)","v":1},{"$f":"+VLOOKUP(+$A5,'Data Input'!$A$3:$AX$41,6,FALSE)","v":0},{"$f":"+VLOOKUP(+$A5,'Data Input'!$A$3:$AX$41,7,FALSE)","v":"A"},{"$f":"+VLOOKUP($A5,'Data Input'!$A$3:$AX$41,27,FALSE)","v":0},{"$f":"+VLOOKUP($A5,'Data Input'!$A$3:$AX$41,28,FALSE)","v":0},{"$f":"+VLOOKUP($A5,'Data Input'!$A$3:$AX$41,29,FALSE)","v":0},null,{"$f":"+VLOOKUP($A5,'Data Input'!$A$3:$AX$41,31,FALSE)","v":0},null,"THIRD"]
[{"$f":"'Data Input'!A6","v":15},{"$f":"+VLOOKUP(+$A6,'Data Input'!$A$3:$AX$41,2,FALSE)","v":"Pirate"},{"$f":"+VLOOKUP(+$A6,'Data Input'!$A$3:$AX$41,3,FALSE)","v":"Kevin Thomas"},{"$f":"+VLOOKUP(+$A6,'Data Input'!$A$3:$AX$41,4,FALSE)","v":29},{"$f":"+VLOOKUP(+$A6,'Data Input'!$A$3:$AX$41,5,FALSE)","v":-7},{"$f":"+VLOOKUP(+$A6,'Data Input'!$A$3:$AX$41,6,FALSE)","v":0},{"$f":"+VLOOKUP(+$A6,'Data Input'!$A$3:$AX$41,7,FALSE)","v":"A"},{"$f":"+VLOOKUP($A6,'Data Input'!$A$3:$AX$41,27,FALSE)","v":0},{"$f":"+VLOOKUP($A6,'Data Input'!$A$3:$AX$41,28,FALSE)","v":0},{"$f":"+VLOOKUP($A6,'Data Input'!$A$3:$AX$41,29,FALSE)","v":0},null,{"$f":"+VLOOKUP($A6,'Data Input'!$A$3:$AX$41,31,FALSE)","v":0},null,4]
[{"$f":"'Data Input'!A7","v":22},{"$f":"+VLOOKUP(+$A7,'Data Input'!$A$3:$AX$41,2,FALSE)","v":"Moonraker"},{"$f":"+VLOOKUP(+$A7,'Data Input'!$A$3:$AX$41,3,FALSE)","v":"Peter Jeckells"},{"$f":"+VLOOKUP(+$A7,'Data Input'!$A$3:$AX$41,4,FALSE)","v":"29 6"},{"$f":"+VLOOKUP(+$A7,'Data Input'!$A$3:$AX$41,5,FALSE)","v":2},{"$f":"+VLOOKUP(+$A7,'Data Input'!$A$3:$AX$41,6,FALSE)","v":0},{"$f":"+VLOOKUP(+$A7,'Data Input'!$A$3:$AX$41,7,FALSE)","v":"A"},{"$f":"+VLOOKUP($A7,'Data Input'!$A$3:$AX$41,27,FALSE)","v":0},{"$f":"+VLOOKUP($A7,'Data Input'!$A$3:$AX$41,28,FALSE)","v":0},{"$f":"+VLOOKUP($A7,'Data Input'!$A$3:$AX$41,29,FALSE)","v":0},null,{"$f":"+VLOOKUP($A7,'Data Input'!$A$3:$AX$41,31,FALSE)","v":0},null,{"$f":"N6+1","v":5}]
[{"$f":"'Data Input'!A8","v":25},{"$f":"+VLOOKUP(+$A8,'Data Input'!$A$3:$AX$41,2,FALSE)","v":"Melody"},{"$f":"+VLOOKUP(+$A8,'Data Input'!$A$3:$AX$41,3,FALSE)","v":"Mark Wells"},{"$f":"+VLOOKUP(+$A8,'Data Input'!$A$3:$AX$41,4,FALSE)","v":26},{"$f":"+VLOOKUP(+$A8,'Data Input'!$A$3:$AX$41,5,FALSE)","v":-11},{"$f":"+VLOOKUP(+$A8,'Data Input'!$A$3:$AX$41,6,FALSE)","v":0},{"$f":"+VLOOKUP(+$A8,'Data Input'!$A$3:$AX$41,7,FALSE)","v":"B"},{"$f":"+VLOOKUP($A8,'Data Input'!$A$3:$AX$41,27,FALSE)","v":0},{"$f":"+VLOOKUP($A8,'Data Input'!$A$3:$AX$41,28,FALSE)","v":0},{"$f":"+VLOOKUP($A8,'Data Input'!$A$3:$AX$41,29,FALSE)","v":0},null,{"$f":"+VLOOKUP($A8,'Data Input'!$A$3:$AX$41,31,FALSE)","v":0},null,{"$f":"N7+1","v":6}]
[{"$f":"'Data Input'!A9","v":37},{"$f":"+VLOOKUP(+$A9,'Data Input'!$A$3:$AX$41,2,FALSE)","v":"Harrier"},{"$f":"+VLOOKUP(+$A9,'Data Input'!$A$3:$AX$41,3,FALSE)","v":"Jack Copping"},{"$f":"+VLOOKUP(+$A9,'Data Input'!$A$3:$AX$41,4,FALSE)","v":27},{"$f":"+VLOOKUP(+$A9,'Data Input'!$A$3:$AX$41,5,FALSE)","v":-20},{"$f":"+VLOOKUP(+$A9,'Data Input'!$A$3:$AX$41,6,FALSE)","v":0},{"$f":"+VLOOKUP(+$A9,'Data Input'!$A$3:$AX$41,7,FALSE)","v":"B"},{"$f":"+VLOOKUP($A9,'Data Input'!$A$3:$AX$41,27,FALSE)","v":0},{"$f":"+VLOOKUP($A9,'Data Input'!$A$3:$AX$41,28,FALSE)","v":0},{"$f":"+VLOOKUP($A9,'Data Input'!$A$3:$AX$41,29,FALSE)","v":0},null,{"$f":"+VLOOKUP($A9,'Data Input'!$A$3:$AX$41,31,FALSE)","v":0},null,7]
[{"$f":"'Data Input'!A10","v":48},{"$f":"+VLOOKUP(+$A10,'Data Input'!$A$3:$AX$41,2,FALSE)","v":"Sparklet"},{"$f":"+VLOOKUP(+$A10,'Data Input'!$A$3:$AX$41,3,FALSE)","v":"Mike Barnes"},{"$f":"+VLOOKUP(+$A10,'Data Input'!$A$3:$AX$41,4,FALSE)","v":41},{"$f":"+VLOOKUP(+$A10,'Data Input'!$A$3:$AX$41,5,FALSE)","v":9},{"$f":"+VLOOKUP(+$A10,'Data Input'!$A$3:$AX$41,6,FALSE)","v":0},{"$f":"+VLOOKUP(+$A10,'Data Input'!$A$3:$AX$41,7,FALSE)","v":"A"},{"$f":"+VLOOKUP($A10,'Data Input'!$A$3:$AX$41,27,FALSE)","v":0},{"$f":"+VLOOKUP($A10,'Data Input'!$A$3:$AX$41,28,FALSE)","v":0},{"$f":"+VLOOKUP($A10,'Data Input'!$A$3:$AX$41,29,FALSE)","v":0},null,{"$f":"+VLOOKUP($A10,'Data Input'!$A$3:$AX$41,31,FALSE)","v":0},null,8]
[{"$f":"'Data Input'!A11","v":79},{"$f":"+VLOOKUP(+$A11,'Data Input'!$A$3:$AX$41,2,FALSE)","v":"Daisy"},{"$f":"+VLOOKUP(+$A11,'Data Input'!$A$3:$AX$41,3,FALSE)","v":"Tim Ford"},{"$f":"+VLOOKUP(+$A11,'Data Input'!$A$3:$AX$41,4,FALSE)","v":22},{"$f":"+VLOOKUP(+$A11,'Data Input'!$A$3:$AX$41,5,FALSE)","v":-26},{"$f":"+VLOOKUP(+$A11,'Data Input'!$A$3:$AX$41,6,FALSE)","v":0},{"$f":"+VLOOKUP(+$A11,'Data Input'!$A$3:$AX$41,7,FALSE)","v":"C"},{"$f":"+VLOOKUP($A11,'Data Input'!$A$3:$AX$41,27,FALSE)","v":0},{"$f":"+VLOOKUP($A11,'Data Input'!$A$3:$AX$41,28,FALSE)","v":0},{"$f":"+VLOOKUP($A11,'Data Input'!$A$3:$AX$41,29,FALSE)","v":0},null,{"$f":"+VLOOKUP($A11,'Data Input'!$A$3:$AX$41,31,FALSE)","v":0},null,9]
[{"$f":"'Data Input'!A12","v":87},{"$f":"+VLOOKUP(+$A12,'Data Input'!$A$3:$AX$41,2,FALSE)","v":"Modwena"},{"$f":"+VLOOKUP(+$A12,'Data Input'!$A$3:$AX$41,3,FALSE)","v":"Mark Cassidy"},{"$f":"+VLOOKUP(+$A12,'Data Input'!$A$3:$AX$41,4,FALSE)","v":"24 11"},{"$f":"+VLOOKUP(+$A12,'Data Input'!$A$3:$AX$41,5,FALSE)","v":-19},{"$f":"+VLOOKUP(+$A12,'Data Input'!$A$3:$AX$41,6,FALSE)","v":0},{"$f":"+VLOOKUP(+$A12,'Data Input'!$A$3:$AX$41,7,FALSE)","v":"A"},{"$f":"+VLOOKUP($A12,'Data Input'!$A$3:$AX$41,27,FALSE)","v":0},{"$f":"+VLOOKUP($A12,'Data Input'!$A$3:$AX$41,28,FALSE)","v":0},{"$f":"+VLOOKUP($A12,'Data Input'!$A$3:$AX$41,29,FALSE)","v":0},null,{"$f":"+VLOOKUP($A12,'Data Input'!$A$3:$AX$41,31,FALSE)","v":0},null,10]
[{"$f":"'Data Input'!A13","v":98},{"$f":"+VLOOKUP(+$A13,'Data Input'!$A$3:$AX$41,2,FALSE)","v":"Force Four"},{"$f":"+VLOOKUP(+$A13,'Data Input'!$A$3:$AX$41,3,FALSE)","v":"JD Winterton"},{"$f":"+VLOOKUP(+$A13,'Data Input'!$A$3:$AX$41,4,FALSE)","v":"31 6"},{"$f":"+VLOOKUP(+$A13,'Data Input'!$A$3:$AX$41,5,FALSE)","v":-21},{"$f":"+VLOOKUP(+$A13,'Data Input'!$A$3:$AX$41,6,FALSE)","v":"P"},{"$f":"+VLOOKUP(+$A13,'Data Input'!$A$3:$AX$41,7,FALSE)","v":"A"},{"$f":"+VLOOKUP($A13,'Data Input'!$A$3:$AX$41,27,FALSE)","v":0},{"$f":"+VLOOKUP($A13,'Data Input'!$A$3:$AX$41,28,FALSE)","v":0},{"$f":"+VLOOKUP($A13,'Data Input'!$A$3:$AX$41,29,FALSE)","v":0},null,{"$f":"+VLOOKUP($A13,'Data Input'!$A$3:$AX$41,31,FALSE)","v":"P"},null,11]
[{"$f":"'Data Input'!A14","v":141},{"$f":"+VLOOKUP(+$A14,'Data Input'!$A$3:$AX$41,2,FALSE)","v":"Nirvana"},{"$f":"+VLOOKUP(+$A14,'Data Input'!$A$3:$AX$41,3,FALSE)","v":"Dr Michael Claridge"},{"$f":"+VLOOKUP(+$A14,'Data Input'!$A$3:$AX$41,4,FALSE)","v":19},{"$f":"+VLOOKUP(+$A14,'Data Input'!$A$3:$AX$41,5,FALSE)","v":-23},{"$f":"+VLOOKUP(+$A14,'Data Input'!$A$3:$AX$41,6,FALSE)","v":"P"},{"$f":"+VLOOKUP(+$A14,'Data Input'!$A$3:$AX$41,7,FALSE)","v":"C"},{"$f":"+VLOOKUP($A14,'Data Input'!$A$3:$AX$41,27,FALSE)","v":0},{"$f":"+VLOOKUP($A14,'Data Input'!$A$3:$AX$41,28,FALSE)","v":0},{"$f":"+VLOOKUP($A14,'Data Input'!$A$3:$AX$41,29,FALSE)","v":0},null,{"$f":"+VLOOKUP($A14,'Data Input'!$A$3:$AX$41,31,FALSE)","v":"P"},null,12]
[{"$f":"'Data Input'!A15","v":152},{"$f":"+VLOOKUP(+$A15,'Data Input'!$A$3:$AX$41,2,FALSE)","v":"Sabrina 2"},{"$f":"+VLOOKUP(+$A15,'Data Input'!$A$3:$AX$41,3,FALSE)","v":"John Holmes"},{"$f":"+VLOOKUP(+$A15,'Data Input'!$A$3:$AX$41,4,FALSE)","v":29},{"$f":"+VLOOKUP(+$A15,'Data Input'!$A$3:$AX$41,5,FALSE)","v":-5},{"$f":"+VLOOKUP(+$A15,'Data Input'!$A$3:$AX$41,6,FALSE)","v":0},{"$f":"+VLOOKUP(+$A15,'Data Input'!$A$3:$AX$41,7,FALSE)","v":"A"},{"$f":"+VLOOKUP($A15,'Data Input'!$A$3:$AX$41,27,FALSE)","v":0},{"$f":"+VLOOKUP($A15,'Data Input'!$A$3:$AX$41,28,FALSE)","v":0},{"$f":"+VLOOKUP($A15,'Data Input'!$A$3:$AX$41,29,FALSE)","v":0},null,{"$f":"+VLOOKUP($A15,'Data Input'!$A$3:$AX$41,31,FALSE)","v":0}]
[{"$f":"'Data Input'!A16","v":155},{"$f":"+VLOOKUP(+$A16,'Data Input'!$A$3:$AX$41,2,FALSE)","v":"Stratus"},{"$f":"+VLOOKUP(+$A16,'Data Input'!$A$3:$AX$41,3,FALSE)","v":"Rhiannon Alger"},{"$f":"+VLOOKUP(+$A16,'Data Input'!$A$3:$AX$41,4,FALSE)","v":"22 10"},{"$f":"+VLOOKUP(+$A16,'Data Input'!$A$3:$AX$41,5,FALSE)","v":-16},{"$f":"+VLOOKUP(+$A16,'Data Input'!$A$3:$AX$41,6,FALSE)","v":0},{"$f":"+VLOOKUP(+$A16,'Data Input'!$A$3:$AX$41,7,FALSE)","v":"A"},{"$f":"+VLOOKUP($A16,'Data Input'!$A$3:$AX$41,27,FALSE)","v":0},{"$f":"+VLOOKUP($A16,'Data Input'!$A$3:$AX$41,28,FALSE)","v":0},{"$f":"+VLOOKUP($A16,'Data Input'!$A$3:$AX$41,29,FALSE)","v":0},null,{"$f":"+VLOOKUP($A16,'Data Input'!$A$3:$AX$41,31,FALSE)","v":0}]
[{"$f":"'Data Input'!A17","v":179},{"$f":"+VLOOKUP(+$A17,'Data Input'!$A$3:$AX$41,2,FALSE)","v":"Waxwing"},{"$f":"+VLOOKUP(+$A17,'Data Input'!$A$3:$AX$41,3,FALSE)","v":"Robin Clayton"},{"$f":"+VLOOKUP(+$A17,'Data Input'!$A$3:$AX$41,4,FALSE)","v":27},{"$f":"+VLOOKUP(+$A17,'Data Input'!$A$3:$AX$41,5,FALSE)","v":-8},{"$f":"+VLOOKUP(+$A17,'Data Input'!$A$3:$AX$41,6,FALSE)","v":0},{"$f":"+VLOOKUP(+$A17,'Data Input'!$A$3:$AX$41,7,FALSE)","v":"B"},{"$f":"+VLOOKUP($A17,'Data Input'!$A$3:$AX$41,27,FALSE)","v":0},{"$f":"+VLOOKUP($A17,'Data Input'!$A$3:$AX$41,28,FALSE)","v":0},{"$f":"+VLOOKUP($A17,'Data Input'!$A$3:$AX$41,29,FALSE)","v":0},null,{"$f":"+VLOOKUP($A17,'Data Input'!$A$3:$AX$41,31,FALSE)","v":0}]
[{"$f":"'Data Input'!A18","v":199},{"$f":"+VLOOKUP(+$A18,'Data Input'!$A$3:$AX$41,2,FALSE)","v":"Morning Calm"},{"$f":"+VLOOKUP(+$A18,'Data Input'!$A$3:$AX$41,3,FALSE)","v":"Bill Clarke"},{"$f":"+VLOOKUP(+$A18,'Data Input'!$A$3:$AX$41,4,FALSE)","v":26},{"$f":"+VLOOKUP(+$A18,'Data Input'!$A$3:$AX$41,5,FALSE)","v":-8},{"$f":"+VLOOKUP(+$A18,'Data Input'!$A$3:$AX$41,6,FALSE)","v":0},{"$f":"+VLOOKUP(+$A18,'Data Input'!$A$3:$AX$41,7,FALSE)","v":"B"},{"$f":"+VLOOKUP($A18,'Data Input'!$A$3:$AX$41,27,FALSE)","v":0},{"$f":"+VLOOKUP($A18,'Data Input'!$A$3:$AX$41,28,FALSE)","v":0},{"$f":"+VLOOKUP($A18,'Data Input'!$A$3:$AX$41,29,FALSE)","v":0},null,{"$f":"+VLOOKUP($A18,'Data Input'!$A$3:$AX$41,31,FALSE)","v":0}]
[{"$f":"'Data Input'!A19","v":216},{"$f":"+VLOOKUP(+$A19,'Data Input'!$A$3:$AX$41,2,FALSE)","v":"Tamara"},{"$f":"+VLOOKUP(+$A19,'Data Input'!$A$3:$AX$41,3,FALSE)","v":"Nick Heath"},{"$f":"+VLOOKUP(+$A19,'Data Input'!$A$3:$AX$41,4,FALSE)","v":"24 8"},{"$f":"+VLOOKUP(+$A19,'Data Input'!$A$3:$AX$41,5,FALSE)","v":-16},{"$f":"+VLOOKUP(+$A19,'Data Input'!$A$3:$AX$41,6,FALSE)","v":0},{"$f":"+VLOOKUP(+$A19,'Data Input'!$A$3:$AX$41,7,FALSE)","v":"A"},{"$f":"+VLOOKUP($A19,'Data Input'!$A$3:$AX$41,27,FALSE)","v":0},{"$f":"+VLOOKUP($A19,'Data Input'!$A$3:$AX$41,28,FALSE)","v":0},{"$f":"+VLOOKUP($A19,'Data Input'!$A$3:$AX$41,29,FALSE)","v":0},null,{"$f":"+VLOOKUP($A19,'Data Input'!$A$3:$AX$41,31,FALSE)","v":0}]
[{"$f":"'Data Input'!A20","v":217},{"$f":"+VLOOKUP(+$A20,'Data Input'!$A$3:$AX$41,2,FALSE)","v":"Melinda"},{"$f":"+VLOOKUP(+$A20,'Data Input'!$A$3:$AX$41,3,FALSE)","v":"Paul Howes"},{"$f":"+VLOOKUP(+$A20,'Data Input'!$A$3:$AX$41,4,FALSE)","v":"27 11"},{"$f":"+VLOOKUP(+$A20,'Data Input'!$A$3:$AX$41,5,FALSE)","v":1},{"$f":"+VLOOKUP(+$A20,'Data Input'!$A$3:$AX$41,6,FALSE)","v":0},{"$f":"+VLOOKUP(+$A20,'Data Input'!$A$3:$AX$41,7,FALSE)","v":"A"},{"$f":"+VLOOKUP($A20,'Data Input'!$A$3:$AX$41,27,FALSE)","v":0},{"$f":"+VLOOKUP($A20,'Data Input'!$A$3:$AX$41,28,FALSE)","v":0},{"$f":"+VLOOKUP($A20,'Data Input'!$A$3:$AX$41,29,FALSE)","v":0},null,{"$f":"+VLOOKUP($A20,'Data Input'!$A$3:$AX$41,31,FALSE)","v":0}]
[{"$f":"'Data Input'!A21","v":218},{"$f":"+VLOOKUP(+$A21,'Data Input'!$A$3:$AX$41,2,FALSE)","v":"Mystery"},{"$f":"+VLOOKUP(+$A21,'Data Input'!$A$3:$AX$41,3,FALSE)","v":"Matt Ford"},{"$f":"+VLOOKUP(+$A21,'Data Input'!$A$3:$AX$41,4,FALSE)","v":26},{"$f":"+VLOOKUP(+$A21,'Data Input'!$A$3:$AX$41,5,FALSE)","v":-8},{"$f":"+VLOOKUP(+$A21,'Data Input'!$A$3:$AX$41,6,FALSE)","v":0},{"$f":"+VLOOKUP(+$A21,'Data Input'!$A$3:$AX$41,7,FALSE)","v":"B"},{"$f":"+VLOOKUP($A21,'Data Input'!$A$3:$AX$41,27,FALSE)","v":0},{"$f":"+VLOOKUP($A21,'Data Input'!$A$3:$AX$41,28,FALSE)","v":0},{"$f":"+VLOOKUP($A21,'Data Input'!$A$3:$AX$41,29,FALSE)","v":0},null,{"$f":"+VLOOKUP($A21,'Data Input'!$A$3:$AX$41,31,FALSE)","v":0}]
[{"$f":"'Data Input'!A22","v":219},{"$f":"+VLOOKUP(+$A22,'Data Input'!$A$3:$AX$41,2,FALSE)","v":"Farthing"},{"$f":"+VLOOKUP(+$A22,'Data Input'!$A$3:$AX$41,3,FALSE)","v":"Melanie Farrar"},{"$f":"+VLOOKUP(+$A22,'Data Input'!$A$3:$AX$41,4,FALSE)","v":36},{"$f":"+VLOOKUP(+$A22,'Data Input'!$A$3:$AX$41,5,FALSE)","v":3},{"$f":"+VLOOKUP(+$A22,'Data Input'!$A$3:$AX$41,6,FALSE)","v":0},{"$f":"+VLOOKUP(+$A22,'Data Input'!$A$3:$AX$41,7,FALSE)","v":"A"},{"$f":"+VLOOKUP($A22,'Data Input'!$A$3:$AX$41,27,FALSE)","v":0},{"$f":"+VLOOKUP($A22,'Data Input'!$A$3:$AX$41,28,FALSE)","v":0},{"$f":"+VLOOKUP($A22,'Data Input'!$A$3:$AX$41,29,FALSE)","v":0},null,{"$f":"+VLOOKUP($A22,'Data Input'!$A$3:$AX$41,31,FALSE)","v":0}]
[{"$f":"'Data Input'!A23","v":224},{"$f":"+VLOOKUP(+$A23,'Data Input'!$A$3:$AX$41,2,FALSE)","v":"Anna"},{"$f":"+VLOOKUP(+$A23,'Data Input'!$A$3:$AX$41,3,FALSE)","v":"R&D Branscombe"},{"$f":"+VLOOKUP(+$A23,'Data Input'!$A$3:$AX$41,4,FALSE)","v":25},{"$f":"+VLOOKUP(+$A23,'Data Input'!$A$3:$AX$41,5,FALSE)","v":-10},{"$f":"+VLOOKUP(+$A23,'Data Input'!$A$3:$AX$41,6,FALSE)","v":0},{"$f":"+VLOOKUP(+$A23,'Data Input'!$A$3:$AX$41,7,FALSE)","v":"B"},{"$f":"+VLOOKUP($A23,'Data Input'!$A$3:$AX$41,27,FALSE)","v":0},{"$f":"+VLOOKUP($A23,'Data Input'!$A$3:$AX$41,28,FALSE)","v":0},{"$f":"+VLOOKUP($A23,'Data Input'!$A$3:$AX$41,29,FALSE)","v":0},null,{"$f":"+VLOOKUP($A23,'Data Input'!$A$3:$AX$41,31,FALSE)","v":0}]
[{"$f":"'Data Input'!A24","v":250},{"$f":"+VLOOKUP(+$A24,'Data Input'!$A$3:$AX$41,2,FALSE)","v":"Storm"},{"$f":"+VLOOKUP(+$A24,'Data Input'!$A$3:$AX$41,3,FALSE)","v":"Matthew Thwaites"},{"$f":"+VLOOKUP(+$A24,'Data Input'!$A$3:$AX$41,4,FALSE)","v":35},{"$f":"+VLOOKUP(+$A24,'Data Input'!$A$3:$AX$41,5,FALSE)","v":16},{"$f":"+VLOOKUP(+$A24,'Data Input'!$A$3:$AX$41,6,FALSE)","v":0},{"$f":"+VLOOKUP(+$A24,'Data Input'!$A$3:$AX$41,7,FALSE)","v":"A"},{"$f":"+VLOOKUP($A24,'Data Input'!$A$3:$AX$41,27,FALSE)","v":0},{"$f":"+VLOOKUP($A24,'Data Input'!$A$3:$AX$41,28,FALSE)","v":0},{"$f":"+VLOOKUP($A24,'Data Input'!$A$3:$AX$41,29,FALSE)","v":0},null,{"$f":"+VLOOKUP($A24,'Data Input'!$A$3:$AX$41,31,FALSE)","v":0}]
[{"$f":"'Data Input'!A25","v":262},{"$f":"+VLOOKUP(+$A25,'Data Input'!$A$3:$AX$41,2,FALSE)","v":"Jessie May"},{"$f":"+VLOOKUP(+$A25,'Data Input'!$A$3:$AX$41,3,FALSE)","v":"Sally Dugdale"},{"$f":"+VLOOKUP(+$A25,'Data Input'!$A$3:$AX$41,4,FALSE)","v":"27 11"},{"$f":"+VLOOKUP(+$A25,'Data Input'!$A$3:$AX$41,5,FALSE)","v":-5},{"$f":"+VLOOKUP(+$A25,'Data Input'!$A$3:$AX$41,6,FALSE)","v":0},{"$f":"+VLOOKUP(+$A25,'Data Input'!$A$3:$AX$41,7,FALSE)","v":"A"},{"$f":"+VLOOKUP($A25,'Data Input'!$A$3:$AX$41,27,FALSE)","v":0},{"$f":"+VLOOKUP($A25,'Data Input'!$A$3:$AX$41,28,FALSE)","v":0},{"$f":"+VLOOKUP($A25,'Data Input'!$A$3:$AX$41,29,FALSE)","v":0},null,{"$f":"+VLOOKUP($A25,'Data Input'!$A$3:$AX$41,31,FALSE)","v":0}]
[{"$f":"'Data Input'!A26","v":303},{"$f":"+VLOOKUP(+$A26,'Data Input'!$A$3:$AX$41,2,FALSE)","v":"Nutcracker"},{"$f":"+VLOOKUP(+$A26,'Data Input'!$A$3:$AX$41,3,FALSE)","v":"Phil Davies"},{"$f":"+VLOOKUP(+$A26,'Data Input'!$A$3:$AX$41,4,FALSE)","v":25},{"$f":"+VLOOKUP(+$A26,'Data Input'!$A$3:$AX$41,5,FALSE)","v":-11},{"$f":"+VLOOKUP(+$A26,'Data Input'!$A$3:$AX$41,6,FALSE)","v":0},{"$f":"+VLOOKUP(+$A26,'Data Input'!$A$3:$AX$41,7,FALSE)","v":"B"},{"$f":"+VLOOKUP($A26,'Data Input'!$A$3:$AX$41,27,FALSE)","v":0},{"$f":"+VLOOKUP($A26,'Data Input'!$A$3:$AX$41,28,FALSE)","v":0},{"$f":"+VLOOKUP($A26,'Data Input'!$A$3:$AX$41,29,FALSE)","v":0},null,{"$f":"+VLOOKUP($A26,'Data Input'!$A$3:$AX$41,31,FALSE)","v":0}]
[{"$f":"'Data Input'!A27","v":314},{"$f":"+VLOOKUP(+$A27,'Data Input'!$A$3:$AX$41,2,FALSE)","v":"Whisper"},{"$f":"+VLOOKUP(+$A27,'Data Input'!$A$3:$AX$41,3,FALSE)","v":"Johnnie Kerridge"},{"$f":"+VLOOKUP(+$A27,'Data Input'!$A$3:$AX$41,4,FALSE)","v":25},{"$f":"+VLOOKUP(+$A27,'Data Input'!$A$3:$AX$41,5,FALSE)","v":-3},{"$f":"+VLOOKUP(+$A27,'Data Input'!$A$3:$AX$41,6,FALSE)","v":0},{"$f":"+VLOOKUP(+$A27,'Data Input'!$A$3:$AX$41,7,FALSE)","v":"B"},{"$f":"+VLOOKUP($A27,'Data Input'!$A$3:$AX$41,27,FALSE)","v":0},{"$f":"+VLOOKUP($A27,'Data Input'!$A$3:$AX$41,28,FALSE)","v":0},{"$f":"+VLOOKUP($A27,'Data Input'!$A$3:$AX$41,29,FALSE)","v":0},null,{"$f":"+VLOOKUP($A27,'Data Input'!$A$3:$AX$41,31,FALSE)","v":0}]
[{"$f":"'Data Input'!A28","v":323},{"$f":"+VLOOKUP(+$A28,'Data Input'!$A$3:$AX$41,2,FALSE)","v":"Starlight Lady"},{"$f":"+VLOOKUP(+$A28,'Data Input'!$A$3:$AX$41,3,FALSE)","v":"Nick Matthews"},{"$f":"+VLOOKUP(+$A28,'Data Input'!$A$3:$AX$41,4,FALSE)","v":30},{"$f":"+VLOOKUP(+$A28,'Data Input'!$A$3:$AX$41,5,FALSE)","v":12},{"$f":"+VLOOKUP(+$A28,'Data Input'!$A$3:$AX$41,6,FALSE)","v":0},{"$f":"+VLOOKUP(+$A28,'Data Input'!$A$3:$AX$41,7,FALSE)","v":"A"},{"$f":"+VLOOKUP($A28,'Data Input'!$A$3:$AX$41,27,FALSE)","v":0},{"$f":"+VLOOKUP($A28,'Data Input'!$A$3:$AX$41,28,FALSE)","v":0},{"$f":"+VLOOKUP($A28,'Data Input'!$A$3:$AX$41,29,FALSE)","v":0},null,{"$f":"+VLOOKUP($A28,'Data Input'!$A$3:$AX$41,31,FALSE)","v":0}]
[{"$f":"'Data Input'!A29","v":338},{"$f":"+VLOOKUP(+$A29,'Data Input'!$A$3:$AX$41,2,FALSE)","v":"Bewitched"},{"$f":"+VLOOKUP(+$A29,'Data Input'!$A$3:$AX$41,3,FALSE)","v":"Colin Chettleburgh"},{"$f":"+VLOOKUP(+$A29,'Data Input'!$A$3:$AX$41,4,FALSE)","v":30},{"$f":"+VLOOKUP(+$A29,'Data Input'!$A$3:$AX$41,5,FALSE)","v":-4},{"$f":"+VLOOKUP(+$A29,'Data Input'!$A$3:$AX$41,6,FALSE)","v":0},{"$f":"+VLOOKUP(+$A29,'Data Input'!$A$3:$AX$41,7,FALSE)","v":"A"},{"$f":"+VLOOKUP($A29,'Data Input'!$A$3:$AX$41,27,FALSE)","v":0},{"$f":"+VLOOKUP($A29,'Data Input'!$A$3:$AX$41,28,FALSE)","v":0},{"$f":"+VLOOKUP($A29,'Data Input'!$A$3:$AX$41,29,FALSE)","v":0},null,{"$f":"+VLOOKUP($A29,'Data Input'!$A$3:$AX$41,31,FALSE)","v":0}]
[{"$f":"'Data Input'!A30","v":348},{"$f":"+VLOOKUP(+$A30,'Data Input'!$A$3:$AX$41,2,FALSE)","v":"Alchemy"},{"$f":"+VLOOKUP(+$A30,'Data Input'!$A$3:$AX$41,3,FALSE)","v":"Richard Smith"},{"$f":"+VLOOKUP(+$A30,'Data Input'!$A$3:$AX$41,4,FALSE)","v":"22 6"},{"$f":"+VLOOKUP(+$A30,'Data Input'!$A$3:$AX$41,5,FALSE)","v":-14},{"$f":"+VLOOKUP(+$A30,'Data Input'!$A$3:$AX$41,6,FALSE)","v":0},{"$f":"+VLOOKUP(+$A30,'Data Input'!$A$3:$AX$41,7,FALSE)","v":"A"},{"$f":"+VLOOKUP($A30,'Data Input'!$A$3:$AX$41,27,FALSE)","v":0},{"$f":"+VLOOKUP($A30,'Data Input'!$A$3:$AX$41,28,FALSE)","v":0},{"$f":"+VLOOKUP($A30,'Data Input'!$A$3:$AX$41,29,FALSE)","v":0},null,{"$f":"+VLOOKUP($A30,'Data Input'!$A$3:$AX$41,31,FALSE)","v":0}]
[{"$f":"'Data Input'!A31","v":370},{"$f":"+VLOOKUP(+$A31,'Data Input'!$A$3:$AX$41,2,FALSE)","v":"Glory"},{"$f":"+VLOOKUP(+$A31,'Data Input'!$A$3:$AX$41,3,FALSE)","v":"Colin Brown"},{"$f":"+VLOOKUP(+$A31,'Data Input'!$A$3:$AX$41,4,FALSE)","v":35},{"$f":"+VLOOKUP(+$A31,'Data Input'!$A$3:$AX$41,5,FALSE)","v":-6},{"$f":"+VLOOKUP(+$A31,'Data Input'!$A$3:$AX$41,6,FALSE)","v":0},{"$f":"+VLOOKUP(+$A31,'Data Input'!$A$3:$AX$41,7,FALSE)","v":"A"},{"$f":"+VLOOKUP($A31,'Data Input'!$A$3:$AX$41,27,FALSE)","v":0},{"$f":"+VLOOKUP($A31,'Data Input'!$A$3:$AX$41,28,FALSE)","v":0},{"$f":"+VLOOKUP($A31,'Data Input'!$A$3:$AX$41,29,FALSE)","v":0},null,{"$f":"+VLOOKUP($A31,'Data Input'!$A$3:$AX$41,31,FALSE)","v":0}]
[{"$f":"'Data Input'!A32","v":373},{"$f":"+VLOOKUP(+$A32,'Data Input'!$A$3:$AX$41,2,FALSE)","v":"Meggie"},{"$f":"+VLOOKUP(+$A32,'Data Input'!$A$3:$AX$41,3,FALSE)","v":"Mark Tansley"},{"$f":"+VLOOKUP(+$A32,'Data Input'!$A$3:$AX$41,4,FALSE)","v":"34 5"},{"$f":"+VLOOKUP(+$A32,'Data Input'!$A$3:$AX$41,5,FALSE)","v":14},{"$f":"+VLOOKUP(+$A32,'Data Input'!$A$3:$AX$41,6,FALSE)","v":0},{"$f":"+VLOOKUP(+$A32,'Data Input'!$A$3:$AX$41,7,FALSE)","v":"A"},{"$f":"+VLOOKUP($A32,'Data Input'!$A$3:$AX$41,27,FALSE)","v":0},{"$f":"+VLOOKUP($A32,'Data Input'!$A$3:$AX$41,28,FALSE)","v":0},{"$f":"+VLOOKUP($A32,'Data Input'!$A$3:$AX$41,29,FALSE)","v":0},null,{"$f":"+VLOOKUP($A32,'Data Input'!$A$3:$AX$41,31,FALSE)","v":0}]
[{"$f":"'Data Input'!A33","v":416},{"$f":"+VLOOKUP(+$A33,'Data Input'!$A$3:$AX$41,2,FALSE)","v":"Alice Rose"},{"$f":"+VLOOKUP(+$A33,'Data Input'!$A$3:$AX$41,3,FALSE)","v":"Steve Burton"},{"$f":"+VLOOKUP(+$A33,'Data Input'!$A$3:$AX$41,4,FALSE)","v":"28 6"},{"$f":"+VLOOKUP(+$A33,'Data Input'!$A$3:$AX$41,5,FALSE)","v":-7},{"$f":"+VLOOKUP(+$A33,'Data Input'!$A$3:$AX$41,6,FALSE)","v":0},{"$f":"+VLOOKUP(+$A33,'Data Input'!$A$3:$AX$41,7,FALSE)","v":"A"},{"$f":"+VLOOKUP($A33,'Data Input'!$A$3:$AX$41,27,FALSE)","v":0},{"$f":"+VLOOKUP($A33,'Data Input'!$A$3:$AX$41,28,FALSE)","v":0},{"$f":"+VLOOKUP($A33,'Data Input'!$A$3:$AX$41,29,FALSE)","v":0},null,{"$f":"+VLOOKUP($A33,'Data Input'!$A$3:$AX$41,31,FALSE)","v":0}]
[{"$f":"'Data Input'!A34","v":417},{"$f":"+VLOOKUP(+$A34,'Data Input'!$A$3:$AX$41,2,FALSE)","v":"Stellar"},{"$f":"+VLOOKUP(+$A34,'Data Input'!$A$3:$AX$41,3,FALSE)","v":"Tim Frary"},{"$f":"+VLOOKUP(+$A34,'Data Input'!$A$3:$AX$41,4,FALSE)","v":"31 4"},{"$f":"+VLOOKUP(+$A34,'Data Input'!$A$3:$AX$41,5,FALSE)","v":16},{"$f":"+VLOOKUP(+$A34,'Data Input'!$A$3:$AX$41,6,FALSE)","v":0},{"$f":"+VLOOKUP(+$A34,'Data Input'!$A$3:$AX$41,7,FALSE)","v":"A"},{"$f":"+VLOOKUP($A34,'Data Input'!$A$3:$AX$41,27,FALSE)","v":0},{"$f":"+VLOOKUP($A34,'Data Input'!$A$3:$AX$41,28,FALSE)","v":0},{"$f":"+VLOOKUP($A34,'Data Input'!$A$3:$AX$41,29,FALSE)","v":0},null,{"$f":"+VLOOKUP($A34,'Data Input'!$A$3:$AX$41,31,FALSE)","v":0}]
[{"$f":"'Data Input'!A35","v":418},{"$f":"+VLOOKUP(+$A35,'Data Input'!$A$3:$AX$41,2,FALSE)","v":"Tinkerbell"},{"$f":"+VLOOKUP(+$A35,'Data Input'!$A$3:$AX$41,3,FALSE)","v":"Adrian Lincoln"},{"$f":"+VLOOKUP(+$A35,'Data Input'!$A$3:$AX$41,4,FALSE)","v":"25 10"},{"$f":"+VLOOKUP(+$A35,'Data Input'!$A$3:$AX$41,5,FALSE)","v":-8},{"$f":"+VLOOKUP(+$A35,'Data Input'!$A$3:$AX$41,6,FALSE)","v":0},{"$f":"+VLOOKUP(+$A35,'Data Input'!$A$3:$AX$41,7,FALSE)","v":"A"},{"$f":"+VLOOKUP($A35,'Data Input'!$A$3:$AX$41,27,FALSE)","v":0},{"$f":"+VLOOKUP($A35,'Data Input'!$A$3:$AX$41,28,FALSE)","v":0},{"$f":"+VLOOKUP($A35,'Data Input'!$A$3:$AX$41,29,FALSE)","v":0},null,{"$f":"+VLOOKUP($A35,'Data Input'!$A$3:$AX$41,31,FALSE)","v":0}]
[{"$f":"'Data Input'!A36","v":419},{"$f":"+VLOOKUP(+$A36,'Data Input'!$A$3:$AX$41,2,FALSE)","v":"Skylark"},{"$f":"+VLOOKUP(+$A36,'Data Input'!$A$3:$AX$41,3,FALSE)","v":"Will Pank"},{"$f":"+VLOOKUP(+$A36,'Data Input'!$A$3:$AX$41,4,FALSE)","v":30},{"$f":"+VLOOKUP(+$A36,'Data Input'!$A$3:$AX$41,5,FALSE)","v":2},{"$f":"+VLOOKUP(+$A36,'Data Input'!$A$3:$AX$41,6,FALSE)","v":0},{"$f":"+VLOOKUP(+$A36,'Data Input'!$A$3:$AX$41,7,FALSE)","v":"A"},{"$f":"+VLOOKUP($A36,'Data Input'!$A$3:$AX$41,27,FALSE)","v":0},{"$f":"+VLOOKUP($A36,'Data Input'!$A$3:$AX$41,28,FALSE)","v":0},{"$f":"+VLOOKUP($A36,'Data Input'!$A$3:$AX$41,29,FALSE)","v":0},null,{"$f":"+VLOOKUP($A36,'Data Input'!$A$3:$AX$41,31,FALSE)","v":0}]
[{"$f":"'Data Input'!A37","v":420},{"$f":"+VLOOKUP(+$A37,'Data Input'!$A$3:$AX$41,2,FALSE)","v":"Lyra"},{"$f":"+VLOOKUP(+$A37,'Data Input'!$A$3:$AX$41,3,FALSE)","v":"Paul Carrington"},{"$f":"+VLOOKUP(+$A37,'Data Input'!$A$3:$AX$41,4,FALSE)","v":30},{"$f":"+VLOOKUP(+$A37,'Data Input'!$A$3:$AX$41,5,FALSE)","v":16},{"$f":"+VLOOKUP(+$A37,'Data Input'!$A$3:$AX$41,6,FALSE)","v":0},{"$f":"+VLOOKUP(+$A37,'Data Input'!$A$3:$AX$41,7,FALSE)","v":"A"},{"$f":"+VLOOKUP($A37,'Data Input'!$A$3:$AX$41,27,FALSE)","v":0},{"$f":"+VLOOKUP($A37,'Data Input'!$A$3:$AX$41,28,FALSE)","v":0},{"$f":"+VLOOKUP($A37,'Data Input'!$A$3:$AX$41,29,FALSE)","v":0},null,{"$f":"+VLOOKUP($A37,'Data Input'!$A$3:$AX$41,31,FALSE)","v":0}]
[{"$f":"'Data Input'!A38","v":423},{"$f":"+VLOOKUP(+$A38,'Data Input'!$A$3:$AX$41,2,FALSE)","v":"Valkyrie II"},{"$f":"+VLOOKUP(+$A38,'Data Input'!$A$3:$AX$41,3,FALSE)","v":"Nigel Kippen"},{"$f":"+VLOOKUP(+$A38,'Data Input'!$A$3:$AX$41,4,FALSE)","v":30},{"$f":"+VLOOKUP(+$A38,'Data Input'!$A$3:$AX$41,5,FALSE)","v":-25},{"$f":"+VLOOKUP(+$A38,'Data Input'!$A$3:$AX$41,6,FALSE)","v":"P"},{"$f":"+VLOOKUP(+$A38,'Data Input'!$A$3:$AX$41,7,FALSE)","v":"A"},{"$f":"+VLOOKUP($A38,'Data Input'!$A$3:$AX$41,27,FALSE)","v":0},{"$f":"+VLOOKUP($A38,'Data Input'!$A$3:$AX$41,28,FALSE)","v":0},{"$f":"+VLOOKUP($A38,'Data Input'!$A$3:$AX$41,29,FALSE)","v":0},null,{"$f":"+VLOOKUP($A38,'Data Input'!$A$3:$AX$41,31,FALSE)","v":0}]
[{"$f":"'Data Input'!A39","v":429},{"$f":"+VLOOKUP(+$A39,'Data Input'!$A$3:$AX$41,2,FALSE)","v":"Pickle"},{"$f":"+VLOOKUP(+$A39,'Data Input'!$A$3:$AX$41,3,FALSE)","v":"Phil Montague"},{"$f":"+VLOOKUP(+$A39,'Data Input'!$A$3:$AX$41,4,FALSE)","v":"22 6"},{"$f":"+VLOOKUP(+$A39,'Data Input'!$A$3:$AX$41,5,FALSE)","v":-16},{"$f":"+VLOOKUP(+$A39,'Data Input'!$A$3:$AX$41,6,FALSE)","v":0},{"$f":"+VLOOKUP(+$A39,'Data Input'!$A$3:$AX$41,7,FALSE)","v":"A"},{"$f":"+VLOOKUP($A39,'Data Input'!$A$3:$AX$41,27,FALSE)","v":0},{"$f":"+VLOOKUP($A39,'Data Input'!$A$3:$AX$41,28,FALSE)","v":0},{"$f":"+VLOOKUP($A39,'Data Input'!$A$3:$AX$41,29,FALSE)","v":0},null,{"$f":"+VLOOKUP($A39,'Data Input'!$A$3:$AX$41,31,FALSE)","v":0}]
[{"$f":"'Data Input'!A40","v":0},{"$f":"+VLOOKUP(+$A40,'Data Input'!$A$3:$AX$41,2,FALSE)","v":0},{"$f":"+VLOOKUP(+$A40,'Data Input'!$A$3:$AX$41,3,FALSE)","v":0},{"$f":"+VLOOKUP(+$A40,'Data Input'!$A$3:$AX$41,4,FALSE)","v":0},{"$f":"+VLOOKUP(+$A40,'Data Input'!$A$3:$AX$41,5,FALSE)","v":0},{"$f":"+VLOOKUP(+$A40,'Data Input'!$A$3:$AX$41,6,FALSE)","v":0},{"$f":"+VLOOKUP(+$A40,'Data Input'!$A$3:$AX$41,7,FALSE)","v":""},{"$f":"+VLOOKUP($A40,'Data Input'!$A$3:$AX$41,27,FALSE)","v":0},{"$f":"+VLOOKUP($A40,'Data Input'!$A$3:$AX$41,28,FALSE)","v":0},{"$f":"+VLOOKUP($A40,'Data Input'!$A$3:$AX$41,29,FALSE)","v":0},null,{"$f":"+VLOOKUP($A40,'Data Input'!$A$3:$AX$41,31,FALSE)","v":0}]
[{"$f":"'Data Input'!A41","v":0},{"$f":"+VLOOKUP(+$A41,'Data Input'!$A$3:$AX$41,2,FALSE)","v":0},{"$f":"+VLOOKUP(+$A41,'Data Input'!$A$3:$AX$41,3,FALSE)","v":0},{"$f":"+VLOOKUP(+$A41,'Data Input'!$A$3:$AX$41,4,FALSE)","v":0},{"$f":"+VLOOKUP(+$A41,'Data Input'!$A$3:$AX$41,5,FALSE)","v":0},{"$f":"+VLOOKUP(+$A41,'Data Input'!$A$3:$AX$41,6,FALSE)","v":0},{"$f":"+VLOOKUP(+$A41,'Data Input'!$A$3:$AX$41,7,FALSE)","v":""},{"$f":"+VLOOKUP($A41,'Data Input'!$A$3:$AX$41,27,FALSE)","v":0},{"$f":"+VLOOKUP($A41,'Data Input'!$A$3:$AX$41,28,FALSE)","v":0},{"$f":"+VLOOKUP($A41,'Data Input'!$A$3:$AX$41,29,FALSE)","v":0},null,{"$f":"+VLOOKUP($A41,'Data Input'!$A$3:$AX$41,31,FALSE)","v":0}]
[{"$f":"COUNT(A3:A41)","v":39}]

{"sheet":"Classes","index":4,"n_rows":42,"n_cols":15,"rows_kept":42,"cut":false,"hidden":false,"merged":[]}
[null,null,null,null,null,null,null,null,"Corrected",null,null,null,null,null,"Don’t use filters on this page"]
["No","Yacht","Skipper","Length","H/C","P","Class","H","M","S",null,"Pos"," ",null,"Sort will place into clases and then order.  You can then insert rows with Trophy Name before printing"]
[{"$f":"'Data Input'!A3","v":7},{"$f":"+VLOOKUP(+$A3,'Data Input'!$A$3:$AX$41,2,FALSE)","v":"Forester"},{"$f":"+VLOOKUP(+$A3,'Data Input'!$A$3:$AX$41,3,FALSE)","v":"Will Bentall"},{"$f":"+VLOOKUP(+$A3,'Data Input'!$A$3:$AX$41,4,FALSE)","v":"32 6"},{"$f":"+VLOOKUP(+$A3,'Data Input'!$A$3:$AX$41,5,FALSE)","v":-8},{"$f":"+VLOOKUP(+$A3,'Data Input'!$A$3:$AX$41,6,FALSE)","v":0},{"$f":"+VLOOKUP(+$A3,'Data Input'!$A$3:$AX$41,7,FALSE)","v":"A"},{"$f":"+VLOOKUP($A3,'Data Input'!$A$3:$AX$41,33,FALSE)","v":0},{"$f":"+VLOOKUP($A3,'Data Input'!$A$3:$AX$41,34,FALSE)","v":0},{"$f":"+VLOOKUP($A3,'Data Input'!$A$3:$AX$41,35,FALSE)","v":0},null,{"$f":"+VLOOKUP($A3,'Data Input'!$A$3:$AX$41,37,FALSE)","v":0},null,null,"Starlight Lady"]
[{"$f":"'Data Input'!A4","v":10},{"$f":"+VLOOKUP(+$A4,'Data Input'!$A$3:$AX$41,2,FALSE)","v":"Flight"},{"$f":"+VLOOKUP(+$A4,'Data Input'!$A$3:$AX$41,3,FALSE)","v":"Joe Farrow"},{"$f":"+VLOOKUP(+$A4,'Data Input'!$A$3:$AX$41,4,FALSE)","v":"29 11"},{"$f":"+VLOOKUP(+$A4,'Data Input'!$A$3:$AX$41,5,FALSE)","v":-9},{"$f":"+VLOOKUP(+$A4,'Data Input'!$A$3:$AX$41,6,FALSE)","v":0},{"$f":"+VLOOKUP(+$A4,'Data Input'!$A$3:$AX$41,7,FALSE)","v":"A"},{"$f":"+VLOOKUP($A4,'Data Input'!$A$3:$AX$41,33,FALSE)","v":0},{"$f":"+VLOOKUP($A4,'Data Input'!$A$3:$AX$41,34,FALSE)","v":0},{"$f":"+VLOOKUP($A4,'Data Input'!$A$3:$AX$41,35,FALSE)","v":0},null,{"$f":"+VLOOKUP($A4,'Data Input'!$A$3:$AX$41,37,FALSE)","v":0},null,null,"Jeckells"]
[{"$f":"'Data Input'!A5","v":13},{"$f":"+VLOOKUP(+$A5,'Data Input'!$A$3:$AX$41,2,FALSE)","v":"Ladybird"},{"$f":"+VLOOKUP(+$A5,'Data Input'!$A$3:$AX$41,3,FALSE)","v":"Ben Knight"},{"$f":"+VLOOKUP(+$A5,'Data Input'!$A$3:$AX$41,4,FALSE)","v":34},{"$f":"+VLOOKUP(+$A5,'Data Input'!$A$3:$AX$41,5,FALSE)","v":1},{"$f":"+VLOOKUP(+$A5,'Data Input'!$A$3:$AX$41,6,FALSE)","v":0},{"$f":"+VLOOKUP(+$A5,'Data Input'!$A$3:$AX$41,7,FALSE)","v":"A"},{"$f":"+VLOOKUP($A5,'Data Input'!$A$3:$AX$41,33,FALSE)","v":0},{"$f":"+VLOOKUP($A5,'Data Input'!$A$3:$AX$41,34,FALSE)","v":0},{"$f":"+VLOOKUP($A5,'Data Input'!$A$3:$AX$41,35,FALSE)","v":0},null,{"$f":"+VLOOKUP($A5,'Data Input'!$A$3:$AX$41,37,FALSE)","v":0},null,null,"Wilberforce Smith"]
[{"$f":"'Data Input'!A6","v":15},{"$f":"+VLOOKUP(+$A6,'Data Input'!$A$3:$AX$41,2,FALSE)","v":"Pirate"},{"$f":"+VLOOKUP(+$A6,'Data Input'!$A$3:$AX$41,3,FALSE)","v":"Kevin Thomas"},{"$f":"+VLOOKUP(+$A6,'Data Input'!$A$3:$AX$41,4,FALSE)","v":29},{"$f":"+VLOOKUP(+$A6,'Data Input'!$A$3:$AX$41,5,FALSE)","v":-7},{"$f":"+VLOOKUP(+$A6,'Data Input'!$A$3:$AX$41,6,FALSE)","v":0},{"$f":"+VLOOKUP(+$A6,'Data Input'!$A$3:$AX$41,7,FALSE)","v":"A"},{"$f":"+VLOOKUP($A6,'Data Input'!$A$3:$AX$41,33,FALSE)","v":0},{"$f":"+VLOOKUP($A6,'Data Input'!$A$3:$AX$41,34,FALSE)","v":0},{"$f":"+VLOOKUP($A6,'Data Input'!$A$3:$AX$41,35,FALSE)","v":0},null,{"$f":"+VLOOKUP($A6,'Data Input'!$A$3:$AX$41,37,FALSE)","v":0}]
[{"$f":"'Data Input'!A7","v":22},{"$f":"+VLOOKUP(+$A7,'Data Input'!$A$3:$AX$41,2,FALSE)","v":"Moonraker"},{"$f":"+VLOOKUP(+$A7,'Data Input'!$A$3:$AX$41,3,FALSE)","v":"Peter Jeckells"},{"$f":"+VLOOKUP(+$A7,'Data Input'!$A$3:$AX$41,4,FALSE)","v":"29 6"},{"$f":"+VLOOKUP(+$A7,'Data Input'!$A$3:$AX$41,5,FALSE)","v":2},{"$f":"+VLOOKUP(+$A7,'Data Input'!$A$3:$AX$41,6,FALSE)","v":0},{"$f":"+VLOOKUP(+$A7,'Data Input'!$A$3:$AX$41,7,FALSE)","v":"A"},{"$f":"+VLOOKUP($A7,'Data Input'!$A$3:$AX$41,33,FALSE)","v":0},{"$f":"+VLOOKUP($A7,'Data Input'!$A$3:$AX$41,34,FALSE)","v":0},{"$f":"+VLOOKUP($A7,'Data Input'!$A$3:$AX$41,35,FALSE)","v":0},null,{"$f":"+VLOOKUP($A7,'Data Input'!$A$3:$AX$41,37,FALSE)","v":0}]
[{"$f":"'Data Input'!A8","v":25},{"$f":"+VLOOKUP(+$A8,'Data Input'!$A$3:$AX$41,2,FALSE)","v":"Melody"},{"$f":"+VLOOKUP(+$A8,'Data Input'!$A$3:$AX$41,3,FALSE)","v":"Mark Wells"},{"$f":"+VLOOKUP(+$A8,'Data Input'!$A$3:$AX$41,4,FALSE)","v":26},{"$f":"+VLOOKUP(+$A8,'Data Input'!$A$3:$AX$41,5,FALSE)","v":-11},{"$f":"+VLOOKUP(+$A8,'Data Input'!$A$3:$AX$41,6,FALSE)","v":0},{"$f":"+VLOOKUP(+$A8,'Data Input'!$A$3:$AX$41,7,FALSE)","v":"B"},{"$f":"+VLOOKUP($A8,'Data Input'!$A$3:$AX$41,33,FALSE)","v":0},{"$f":"+VLOOKUP($A8,'Data Input'!$A$3:$AX$41,34,FALSE)","v":0},{"$f":"+VLOOKUP($A8,'Data Input'!$A$3:$AX$41,35,FALSE)","v":0},null,{"$f":"+VLOOKUP($A8,'Data Input'!$A$3:$AX$41,37,FALSE)","v":0}]
[{"$f":"'Data Input'!A9","v":37},{"$f":"+VLOOKUP(+$A9,'Data Input'!$A$3:$AX$41,2,FALSE)","v":"Harrier"},{"$f":"+VLOOKUP(+$A9,'Data Input'!$A$3:$AX$41,3,FALSE)","v":"Jack Copping"},{"$f":"+VLOOKUP(+$A9,'Data Input'!$A$3:$AX$41,4,FALSE)","v":27},{"$f":"+VLOOKUP(+$A9,'Data Input'!$A$3:$AX$41,5,FALSE)","v":-20},{"$f":"+VLOOKUP(+$A9,'Data Input'!$A$3:$AX$41,6,FALSE)","v":0},{"$f":"+VLOOKUP(+$A9,'Data Input'!$A$3:$AX$41,7,FALSE)","v":"B"},{"$f":"+VLOOKUP($A9,'Data Input'!$A$3:$AX$41,33,FALSE)","v":0},{"$f":"+VLOOKUP($A9,'Data Input'!$A$3:$AX$41,34,FALSE)","v":0},{"$f":"+VLOOKUP($A9,'Data Input'!$A$3:$AX$41,35,FALSE)","v":0},null,{"$f":"+VLOOKUP($A9,'Data Input'!$A$3:$AX$41,37,FALSE)","v":0}]
[{"$f":"'Data Input'!A10","v":48},{"$f":"+VLOOKUP(+$A10,'Data Input'!$A$3:$AX$41,2,FALSE)","v":"Sparklet"},{"$f":"+VLOOKUP(+$A10,'Data Input'!$A$3:$AX$41,3,FALSE)","v":"Mike Barnes"},{"$f":"+VLOOKUP(+$A10,'Data Input'!$A$3:$AX$41,4,FALSE)","v":41},{"$f":"+VLOOKUP(+$A10,'Data Input'!$A$3:$AX$41,5,FALSE)","v":9},{"$f":"+VLOOKUP(+$A10,'Data Input'!$A$3:$AX$41,6,FALSE)","v":0},{"$f":"+VLOOKUP(+$A10,'Data Input'!$A$3:$AX$41,7,FALSE)","v":"A"},{"$f":"+VLOOKUP($A10,'Data Input'!$A$3:$AX$41,33,FALSE)","v":0},{"$f":"+VLOOKUP($A10,'Data Input'!$A$3:$AX$41,34,FALSE)","v":0},{"$f":"+VLOOKUP($A10,'Data Input'!$A$3:$AX$41,35,FALSE)","v":0},null,{"$f":"+VLOOKUP($A10,'Data Input'!$A$3:$AX$41,37,FALSE)","v":0}]
[{"$f":"'Data Input'!A11","v":79},{"$f":"+VLOOKUP(+$A11,'Data Input'!$A$3:$AX$41,2,FALSE)","v":"Daisy"},{"$f":"+VLOOKUP(+$A11,'Data Input'!$A$3:$AX$41,3,FALSE)","v":"Tim Ford"},{"$f":"+VLOOKUP(+$A11,'Data Input'!$A$3:$AX$41,4,FALSE)","v":22},{"$f":"+VLOOKUP(+$A11,'Data Input'!$A$3:$AX$41,5,FALSE)","v":-26},{"$f":"+VLOOKUP(+$A11,'Data Input'!$A$3:$AX$41,6,FALSE)","v":0},{"$f":"+VLOOKUP(+$A11,'Data Input'!$A$3:$AX$41,7,FALSE)","v":"C"},{"$f":"+VLOOKUP($A11,'Data Input'!$A$3:$AX$41,33,FALSE)","v":0},{"$f":"+VLOOKUP($A11,'Data Input'!$A$3:$AX$41,34,FALSE)","v":0},{"$f":"+VLOOKUP($A11,'Data Input'!$A$3:$AX$41,35,FALSE)","v":0},null,{"$f":"+VLOOKUP($A11,'Data Input'!$A$3:$AX$41,37,FALSE)","v":0}]
[{"$f":"'Data Input'!A12","v":87},{"$f":"+VLOOKUP(+$A12,'Data Input'!$A$3:$AX$41,2,FALSE)","v":"Modwena"},{"$f":"+VLOOKUP(+$A12,'Data Input'!$A$3:$AX$41,3,FALSE)","v":"Mark Cassidy"},{"$f":"+VLOOKUP(+$A12,'Data Input'!$A$3:$AX$41,4,FALSE)","v":"24 11"},{"$f":"+VLOOKUP(+$A12,'Data Input'!$A$3:$AX$41,5,FALSE)","v":-19},{"$f":"+VLOOKUP(+$A12,'Data Input'!$A$3:$AX$41,6,FALSE)","v":0},{"$f":"+VLOOKUP(+$A12,'Data Input'!$A$3:$AX$41,7,FALSE)","v":"A"},{"$f":"+VLOOKUP($A12,'Data Input'!$A$3:$AX$41,33,FALSE)","v":0},{"$f":"+VLOOKUP($A12,'Data Input'!$A$3:$AX$41,34,FALSE)","v":0},{"$f":"+VLOOKUP($A12,'Data Input'!$A$3:$AX$41,35,FALSE)","v":0},null,{"$f":"+VLOOKUP($A12,'Data Input'!$A$3:$AX$41,37,FALSE)","v":0}]
[{"$f":"'Data Input'!A13","v":98},{"$f":"+VLOOKUP(+$A13,'Data Input'!$A$3:$AX$41,2,FALSE)","v":"Force Four"},{"$f":"+VLOOKUP(+$A13,'Data Input'!$A$3:$AX$41,3,FALSE)","v":"JD Winterton"},{"$f":"+VLOOKUP(+$A13,'Data Input'!$A$3:$AX$41,4,FALSE)","v":"31 6"},{"$f":"+VLOOKUP(+$A13,'Data Input'!$A$3:$AX$41,5,FALSE)","v":-21},{"$f":"+VLOOKUP(+$A13,'Data Input'!$A$3:$AX$41,6,FALSE)","v":"P"},{"$f":"+VLOOKUP(+$A13,'Data Input'!$A$3:$AX$41,7,FALSE)","v":"A"},{"$f":"+VLOOKUP($A13,'Data Input'!$A$3:$AX$41,33,FALSE)","v":0},{"$f":"+VLOOKUP($A13,'Data Input'!$A$3:$AX$41,34,FALSE)","v":0},{"$f":"+VLOOKUP($A13,'Data Input'!$A$3:$AX$41,35,FALSE)","v":0},null,{"$f":"+VLOOKUP($A13,'Data Input'!$A$3:$AX$41,37,FALSE)","v":"P"}]
[{"$f":"'Data Input'!A14","v":141},{"$f":"+VLOOKUP(+$A14,'Data Input'!$A$3:$AX$41,2,FALSE)","v":"Nirvana"},{"$f":"+VLOOKUP(+$A14,'Data Input'!$A$3:$AX$41,3,FALSE)","v":"Dr Michael Claridge"},{"$f":"+VLOOKUP(+$A14,'Data Input'!$A$3:$AX$41,4,FALSE)","v":19},{"$f":"+VLOOKUP(+$A14,'Data Input'!$A$3:$AX$41,5,FALSE)","v":-23},{"$f":"+VLOOKUP(+$A14,'Data Input'!$A$3:$AX$41,6,FALSE)","v":"P"},{"$f":"+VLOOKUP(+$A14,'Data Input'!$A$3:$AX$41,7,FALSE)","v":"C"},{"$f":"+VLOOKUP($A14,'Data Input'!$A$3:$AX$41,33,FALSE)","v":0},{"$f":"+VLOOKUP($A14,'Data Input'!$A$3:$AX$41,34,FALSE)","v":0},{"$f":"+VLOOKUP($A14,'Data Input'!$A$3:$AX$41,35,FALSE)","v":0},null,{"$f":"+VLOOKUP($A14,'Data Input'!$A$3:$AX$41,37,FALSE)","v":"P"}]
[{"$f":"'Data Input'!A15","v":152},{"$f":"+VLOOKUP(+$A15,'Data Input'!$A$3:$AX$41,2,FALSE)","v":"Sabrina 2"},{"$f":"+VLOOKUP(+$A15,'Data Input'!$A$3:$AX$41,3,FALSE)","v":"John Holmes"},{"$f":"+VLOOKUP(+$A15,'Data Input'!$A$3:$AX$41,4,FALSE)","v":29},{"$f":"+VLOOKUP(+$A15,'Data Input'!$A$3:$AX$41,5,FALSE)","v":-5},{"$f":"+VLOOKUP(+$A15,'Data Input'!$A$3:$AX$41,6,FALSE)","v":0},{"$f":"+VLOOKUP(+$A15,'Data Input'!$A$3:$AX$41,7,FALSE)","v":"A"},{"$f":"+VLOOKUP($A15,'Data Input'!$A$3:$AX$41,33,FALSE)","v":0},{"$f":"+VLOOKUP($A15,'Data Input'!$A$3:$AX$41,34,FALSE)","v":0},{"$f":"+VLOOKUP($A15,'Data Input'!$A$3:$AX$41,35,FALSE)","v":0},null,{"$f":"+VLOOKUP($A15,'Data Input'!$A$3:$AX$41,37,FALSE)","v":0}]
[{"$f":"'Data Input'!A16","v":155},{"$f":"+VLOOKUP(+$A16,'Data Input'!$A$3:$AX$41,2,FALSE)","v":"Stratus"},{"$f":"+VLOOKUP(+$A16,'Data Input'!$A$3:$AX$41,3,FALSE)","v":"Rhiannon Alger"},{"$f":"+VLOOKUP(+$A16,'Data Input'!$A$3:$AX$41,4,FALSE)","v":"22 10"},{"$f":"+VLOOKUP(+$A16,'Data Input'!$A$3:$AX$41,5,FALSE)","v":-16},{"$f":"+VLOOKUP(+$A16,'Data Input'!$A$3:$AX$41,6,FALSE)","v":0},{"$f":"+VLOOKUP(+$A16,'Data Input'!$A$3:$AX$41,7,FALSE)","v":"A"},{"$f":"+VLOOKUP($A16,'Data Input'!$A$3:$AX$41,33,FALSE)","v":0},{"$f":"+VLOOKUP($A16,'Data Input'!$A$3:$AX$41,34,FALSE)","v":0},{"$f":"+VLOOKUP($A16,'Data Input'!$A$3:$AX$41,35,FALSE)","v":0},null,{"$f":"+VLOOKUP($A16,'Data Input'!$A$3:$AX$41,37,FALSE)","v":0}]
[{"$f":"'Data Input'!A17","v":179},{"$f":"+VLOOKUP(+$A17,'Data Input'!$A$3:$AX$41,2,FALSE)","v":"Waxwing"},{"$f":"+VLOOKUP(+$A17,'Data Input'!$A$3:$AX$41,3,FALSE)","v":"Robin Clayton"},{"$f":"+VLOOKUP(+$A17,'Data Input'!$A$3:$AX$41,4,FALSE)","v":27},{"$f":"+VLOOKUP(+$A17,'Data Input'!$A$3:$AX$41,5,FALSE)","v":-8},{"$f":"+VLOOKUP(+$A17,'Data Input'!$A$3:$AX$41,6,FALSE)","v":0},{"$f":"+VLOOKUP(+$A17,'Data Input'!$A$3:$AX$41,7,FALSE)","v":"B"},{"$f":"+VLOOKUP($A17,'Data Input'!$A$3:$AX$41,33,FALSE)","v":0},{"$f":"+VLOOKUP($A17,'Data Input'!$A$3:$AX$41,34,FALSE)","v":0},{"$f":"+VLOOKUP($A17,'Data Input'!$A$3:$AX$41,35,FALSE)","v":0},null,{"$f":"+VLOOKUP($A17,'Data Input'!$A$3:$AX$41,37,FALSE)","v":0}]
[{"$f":"'Data Input'!A18","v":199},{"$f":"+VLOOKUP(+$A18,'Data Input'!$A$3:$AX$41,2,FALSE)","v":"Morning Calm"},{"$f":"+VLOOKUP(+$A18,'Data Input'!$A$3:$AX$41,3,FALSE)","v":"Bill Clarke"},{"$f":"+VLOOKUP(+$A18,'Data Input'!$A$3:$AX$41,4,FALSE)","v":26},{"$f":"+VLOOKUP(+$A18,'Data Input'!$A$3:$AX$41,5,FALSE)","v":-8},{"$f":"+VLOOKUP(+$A18,'Data Input'!$A$3:$AX$41,6,FALSE)","v":0},{"$f":"+VLOOKUP(+$A18,'Data Input'!$A$3:$AX$41,7,FALSE)","v":"B"},{"$f":"+VLOOKUP($A18,'Data Input'!$A$3:$AX$41,33,FALSE)","v":0},{"$f":"+VLOOKUP($A18,'Data Input'!$A$3:$AX$41,34,FALSE)","v":0},{"$f":"+VLOOKUP($A18,'Data Input'!$A$3:$AX$41,35,FALSE)","v":0},null,{"$f":"+VLOOKUP($A18,'Data Input'!$A$3:$AX$41,37,FALSE)","v":0}]
[{"$f":"'Data Input'!A19","v":216},{"$f":"+VLOOKUP(+$A19,'Data Input'!$A$3:$AX$41,2,FALSE)","v":"Tamara"},{"$f":"+VLOOKUP(+$A19,'Data Input'!$A$3:$AX$41,3,FALSE)","v":"Nick Heath"},{"$f":"+VLOOKUP(+$A19,'Data Input'!$A$3:$AX$41,4,FALSE)","v":"24 8"},{"$f":"+VLOOKUP(+$A19,'Data Input'!$A$3:$AX$41,5,FALSE)","v":-16},{"$f":"+VLOOKUP(+$A19,'Data Input'!$A$3:$AX$41,6,FALSE)","v":0},{"$f":"+VLOOKUP(+$A19,'Data Input'!$A$3:$AX$41,7,FALSE)","v":"A"},{"$f":"+VLOOKUP($A19,'Data Input'!$A$3:$AX$41,33,FALSE)","v":0},{"$f":"+VLOOKUP($A19,'Data Input'!$A$3:$AX$41,34,FALSE)","v":0},{"$f":"+VLOOKUP($A19,'Data Input'!$A$3:$AX$41,35,FALSE)","v":0},null,{"$f":"+VLOOKUP($A19,'Data Input'!$A$3:$AX$41,37,FALSE)","v":0}]
[{"$f":"'Data Input'!A20","v":217},{"$f":"+VLOOKUP(+$A20,'Data Input'!$A$3:$AX$41,2,FALSE)","v":"Melinda"},{"$f":"+VLOOKUP(+$A20,'Data Input'!$A$3:$AX$41,3,FALSE)","v":"Paul Howes"},{"$f":"+VLOOKUP(+$A20,'Data Input'!$A$3:$AX$41,4,FALSE)","v":"27 11"},{"$f":"+VLOOKUP(+$A20,'Data Input'!$A$3:$AX$41,5,FALSE)","v":1},{"$f":"+VLOOKUP(+$A20,'Data Input'!$A$3:$AX$41,6,FALSE)","v":0},{"$f":"+VLOOKUP(+$A20,'Data Input'!$A$3:$AX$41,7,FALSE)","v":"A"},{"$f":"+VLOOKUP($A20,'Data Input'!$A$3:$AX$41,33,FALSE)","v":0},{"$f":"+VLOOKUP($A20,'Data Input'!$A$3:$AX$41,34,FALSE)","v":0},{"$f":"+VLOOKUP($A20,'Data Input'!$A$3:$AX$41,35,FALSE)","v":0},null,{"$f":"+VLOOKUP($A20,'Data Input'!$A$3:$AX$41,37,FALSE)","v":0}]
[{"$f":"'Data Input'!A21","v":218},{"$f":"+VLOOKUP(+$A21,'Data Input'!$A$3:$AX$41,2,FALSE)","v":"Mystery"},{"$f":"+VLOOKUP(+$A21,'Data Input'!$A$3:$AX$41,3,FALSE)","v":"Matt Ford"},{"$f":"+VLOOKUP(+$A21,'Data Input'!$A$3:$AX$41,4,FALSE)","v":26},{"$f":"+VLOOKUP(+$A21,'Data Input'!$A$3:$AX$41,5,FALSE)","v":-8},{"$f":"+VLOOKUP(+$A21,'Data Input'!$A$3:$AX$41,6,FALSE)","v":0},{"$f":"+VLOOKUP(+$A21,'Data Input'!$A$3:$AX$41,7,FALSE)","v":"B"},{"$f":"+VLOOKUP($A21,'Data Input'!$A$3:$AX$41,33,FALSE)","v":0},{"$f":"+VLOOKUP($A21,'Data Input'!$A$3:$AX$41,34,FALSE)","v":0},{"$f":"+VLOOKUP($A21,'Data Input'!$A$3:$AX$41,35,FALSE)","v":0},null,{"$f":"+VLOOKUP($A21,'Data Input'!$A$3:$AX$41,37,FALSE)","v":0}]
[{"$f":"'Data Input'!A22","v":219},{"$f":"+VLOOKUP(+$A22,'Data Input'!$A$3:$AX$41,2,FALSE)","v":"Farthing"},{"$f":"+VLOOKUP(+$A22,'Data Input'!$A$3:$AX$41,3,FALSE)","v":"Melanie Farrar"},{"$f":"+VLOOKUP(+$A22,'Data Input'!$A$3:$AX$41,4,FALSE)","v":36},{"$f":"+VLOOKUP(+$A22,'Data Input'!$A$3:$AX$41,5,FALSE)","v":3},{"$f":"+VLOOKUP(+$A22,'Data Input'!$A$3:$AX$41,6,FALSE)","v":0},{"$f":"+VLOOKUP(+$A22,'Data Input'!$A$3:$AX$41,7,FALSE)","v":"A"},{"$f":"+VLOOKUP($A22,'Data Input'!$A$3:$AX$41,33,FALSE)","v":0},{"$f":"+VLOOKUP($A22,'Data Input'!$A$3:$AX$41,34,FALSE)","v":0},{"$f":"+VLOOKUP($A22,'Data Input'!$A$3:$AX$41,35,FALSE)","v":0},null,{"$f":"+VLOOKUP($A22,'Data Input'!$A$3:$AX$41,37,FALSE)","v":0}]
[{"$f":"'Data Input'!A23","v":224},{"$f":"+VLOOKUP(+$A23,'Data Input'!$A$3:$AX$41,2,FALSE)","v":"Anna"},{"$f":"+VLOOKUP(+$A23,'Data Input'!$A$3:$AX$41,3,FALSE)","v":"R&D Branscombe"},{"$f":"+VLOOKUP(+$A23,'Data Input'!$A$3:$AX$41,4,FALSE)","v":25},{"$f":"+VLOOKUP(+$A23,'Data Input'!$A$3:$AX$41,5,FALSE)","v":-10},{"$f":"+VLOOKUP(+$A23,'Data Input'!$A$3:$AX$41,6,FALSE)","v":0},{"$f":"+VLOOKUP(+$A23,'Data Input'!$A$3:$AX$41,7,FALSE)","v":"B"},{"$f":"+VLOOKUP($A23,'Data Input'!$A$3:$AX$41,33,FALSE)","v":0},{"$f":"+VLOOKUP($A23,'Data Input'!$A$3:$AX$41,34,FALSE)","v":0},{"$f":"+VLOOKUP($A23,'Data Input'!$A$3:$AX$41,35,FALSE)","v":0},null,{"$f":"+VLOOKUP($A23,'Data Input'!$A$3:$AX$41,37,FALSE)","v":0}]
[{"$f":"'Data Input'!A24","v":250},{"$f":"+VLOOKUP(+$A24,'Data Input'!$A$3:$AX$41,2,FALSE)","v":"Storm"},{"$f":"+VLOOKUP(+$A24,'Data Input'!$A$3:$AX$41,3,FALSE)","v":"Matthew Thwaites"},{"$f":"+VLOOKUP(+$A24,'Data Input'!$A$3:$AX$41,4,FALSE)","v":35},{"$f":"+VLOOKUP(+$A24,'Data Input'!$A$3:$AX$41,5,FALSE)","v":16},{"$f":"+VLOOKUP(+$A24,'Data Input'!$A$3:$AX$41,6,FALSE)","v":0},{"$f":"+VLOOKUP(+$A24,'Data Input'!$A$3:$AX$41,7,FALSE)","v":"A"},{"$f":"+VLOOKUP($A24,'Data Input'!$A$3:$AX$41,33,FALSE)","v":0},{"$f":"+VLOOKUP($A24,'Data Input'!$A$3:$AX$41,34,FALSE)","v":0},{"$f":"+VLOOKUP($A24,'Data Input'!$A$3:$AX$41,35,FALSE)","v":0},null,{"$f":"+VLOOKUP($A24,'Data Input'!$A$3:$AX$41,37,FALSE)","v":0}]
[{"$f":"'Data Input'!A25","v":262},{"$f":"+VLOOKUP(+$A25,'Data Input'!$A$3:$AX$41,2,FALSE)","v":"Jessie May"},{"$f":"+VLOOKUP(+$A25,'Data Input'!$A$3:$AX$41,3,FALSE)","v":"Sally Dugdale"},{"$f":"+VLOOKUP(+$A25,'Data Input'!$A$3:$AX$41,4,FALSE)","v":"27 11"},{"$f":"+VLOOKUP(+$A25,'Data Input'!$A$3:$AX$41,5,FALSE)","v":-5},{"$f":"+VLOOKUP(+$A25,'Data Input'!$A$3:$AX$41,6,FALSE)","v":0},{"$f":"+VLOOKUP(+$A25,'Data Input'!$A$3:$AX$41,7,FALSE)","v":"A"},{"$f":"+VLOOKUP($A25,'Data Input'!$A$3:$AX$41,33,FALSE)","v":0},{"$f":"+VLOOKUP($A25,'Data Input'!$A$3:$AX$41,34,FALSE)","v":0},{"$f":"+VLOOKUP($A25,'Data Input'!$A$3:$AX$41,35,FALSE)","v":0},null,{"$f":"+VLOOKUP($A25,'Data Input'!$A$3:$AX$41,37,FALSE)","v":0}]
[{"$f":"'Data Input'!A26","v":303},{"$f":"+VLOOKUP(+$A26,'Data Input'!$A$3:$AX$41,2,FALSE)","v":"Nutcracker"},{"$f":"+VLOOKUP(+$A26,'Data Input'!$A$3:$AX$41,3,FALSE)","v":"Phil Davies"},{"$f":"+VLOOKUP(+$A26,'Data Input'!$A$3:$AX$41,4,FALSE)","v":25},{"$f":"+VLOOKUP(+$A26,'Data Input'!$A$3:$AX$41,5,FALSE)","v":-11},{"$f":"+VLOOKUP(+$A26,'Data Input'!$A$3:$AX$41,6,FALSE)","v":0},{"$f":"+VLOOKUP(+$A26,'Data Input'!$A$3:$AX$41,7,FALSE)","v":"B"},{"$f":"+VLOOKUP($A26,'Data Input'!$A$3:$AX$41,33,FALSE)","v":0},{"$f":"+VLOOKUP($A26,'Data Input'!$A$3:$AX$41,34,FALSE)","v":0},{"$f":"+VLOOKUP($A26,'Data Input'!$A$3:$AX$41,35,FALSE)","v":0},null,{"$f":"+VLOOKUP($A26,'Data Input'!$A$3:$AX$41,37,FALSE)","v":0}]
[{"$f":"'Data Input'!A27","v":314},{"$f":"+VLOOKUP(+$A27,'Data Input'!$A$3:$AX$41,2,FALSE)","v":"Whisper"},{"$f":"+VLOOKUP(+$A27,'Data Input'!$A$3:$AX$41,3,FALSE)","v":"Johnnie Kerridge"},{"$f":"+VLOOKUP(+$A27,'Data Input'!$A$3:$AX$41,4,FALSE)","v":25},{"$f":"+VLOOKUP(+$A27,'Data Input'!$A$3:$AX$41,5,FALSE)","v":-3},{"$f":"+VLOOKUP(+$A27,'Data Input'!$A$3:$AX$41,6,FALSE)","v":0},{"$f":"+VLOOKUP(+$A27,'Data Input'!$A$3:$AX$41,7,FALSE)","v":"B"},{"$f":"+VLOOKUP($A27,'Data Input'!$A$3:$AX$41,33,FALSE)","v":0},{"$f":"+VLOOKUP($A27,'Data Input'!$A$3:$AX$41,34,FALSE)","v":0},{"$f":"+VLOOKUP($A27,'Data Input'!$A$3:$AX$41,35,FALSE)","v":0},null,{"$f":"+VLOOKUP($A27,'Data Input'!$A$3:$AX$41,37,FALSE)","v":0}]
[{"$f":"'Data Input'!A28","v":323},{"$f":"+VLOOKUP(+$A28,'Data Input'!$A$3:$AX$41,2,FALSE)","v":"Starlight Lady"},{"$f":"+VLOOKUP(+$A28,'Data Input'!$A$3:$AX$41,3,FALSE)","v":"Nick Matthews"},{"$f":"+VLOOKUP(+$A28,'Data Input'!$A$3:$AX$41,4,FALSE)","v":30},{"$f":"+VLOOKUP(+$A28,'Data Input'!$A$3:$AX$41,5,FALSE)","v":12},{"$f":"+VLOOKUP(+$A28,'Data Input'!$A$3:$AX$41,6,FALSE)","v":0},{"$f":"+VLOOKUP(+$A28,'Data Input'!$A$3:$AX$41,7,FALSE)","v":"A"},{"$f":"+VLOOKUP($A28,'Data Input'!$A$3:$AX$41,33,FALSE)","v":0},{"$f":"+VLOOKUP($A28,'Data Input'!$A$3:$AX$41,34,FALSE)","v":0},{"$f":"+VLOOKUP($A28,'Data Input'!$A$3:$AX$41,35,FALSE)","v":0},null,{"$f":"+VLOOKUP($A28,'Data Input'!$A$3:$AX$41,37,FALSE)","v":0}]
[{"$f":"'Data Input'!A29","v":338},{"$f":"+VLOOKUP(+$A29,'Data Input'!$A$3:$AX$41,2,FALSE)","v":"Bewitched"},{"$f":"+VLOOKUP(+$A29,'Data Input'!$A$3:$AX$41,3,FALSE)","v":"Colin Chettleburgh"},{"$f":"+VLOOKUP(+$A29,'Data Input'!$A$3:$AX$41,4,FALSE)","v":30},{"$f":"+VLOOKUP(+$A29,'Data Input'!$A$3:$AX$41,5,FALSE)","v":-4},{"$f":"+VLOOKUP(+$A29,'Data Input'!$A$3:$AX$41,6,FALSE)","v":0},{"$f":"+VLOOKUP(+$A29,'Data Input'!$A$3:$AX$41,7,FALSE)","v":"A"},{"$f":"+VLOOKUP($A29,'Data Input'!$A$3:$AX$41,33,FALSE)","v":0},{"$f":"+VLOOKUP($A29,'Data Input'!$A$3:$AX$41,34,FALSE)","v":0},{"$f":"+VLOOKUP($A29,'Data Input'!$A$3:$AX$41,35,FALSE)","v":0},null,{"$f":"+VLOOKUP($A29,'Data Input'!$A$3:$AX$41,37,FALSE)","v":0}]
[{"$f":"'Data Input'!A30","v":348},{"$f":"+VLOOKUP(+$A30,'Data Input'!$A$3:$AX$41,2,FALSE)","v":"Alchemy"},{"$f":"+VLOOKUP(+$A30,'Data Input'!$A$3:$AX$41,3,FALSE)","v":"Richard Smith"},{"$f":"+VLOOKUP(+$A30,'Data Input'!$A$3:$AX$41,4,FALSE)","v":"22 6"},{"$f":"+VLOOKUP(+$A30,'Data Input'!$A$3:$AX$41,5,FALSE)","v":-14},{"$f":"+VLOOKUP(+$A30,'Data Input'!$A$3:$AX$41,6,FALSE)","v":0},{"$f":"+VLOOKUP(+$A30,'Data Input'!$A$3:$AX$41,7,FALSE)","v":"A"},{"$f":"+VLOOKUP($A30,'Data Input'!$A$3:$AX$41,33,FALSE)","v":0},{"$f":"+VLOOKUP($A30,'Data Input'!$A$3:$AX$41,34,FALSE)","v":0},{"$f":"+VLOOKUP($A30,'Data Input'!$A$3:$AX$41,35,FALSE)","v":0},null,{"$f":"+VLOOKUP($A30,'Data Input'!$A$3:$AX$41,37,FALSE)","v":0}]
[{"$f":"'Data Input'!A31","v":370},{"$f":"+VLOOKUP(+$A31,'Data Input'!$A$3:$AX$41,2,FALSE)","v":"Glory"},{"$f":"+VLOOKUP(+$A31,'Data Input'!$A$3:$AX$41,3,FALSE)","v":"Colin Brown"},{"$f":"+VLOOKUP(+$A31,'Data Input'!$A$3:$AX$41,4,FALSE)","v":35},{"$f":"+VLOOKUP(+$A31,'Data Input'!$A$3:$AX$41,5,FALSE)","v":-6},{"$f":"+VLOOKUP(+$A31,'Data Input'!$A$3:$AX$41,6,FALSE)","v":0},{"$f":"+VLOOKUP(+$A31,'Data Input'!$A$3:$AX$41,7,FALSE)","v":"A"},{"$f":"+VLOOKUP($A31,'Data Input'!$A$3:$AX$41,33,FALSE)","v":0},{"$f":"+VLOOKUP($A31,'Data Input'!$A$3:$AX$41,34,FALSE)","v":0},{"$f":"+VLOOKUP($A31,'Data Input'!$A$3:$AX$41,35,FALSE)","v":0},null,{"$f":"+VLOOKUP($A31,'Data Input'!$A$3:$AX$41,37,FALSE)","v":0}]
[{"$f":"'Data Input'!A32","v":373},{"$f":"+VLOOKUP(+$A32,'Data Input'!$A$3:$AX$41,2,FALSE)","v":"Meggie"},{"$f":"+VLOOKUP(+$A32,'Data Input'!$A$3:$AX$41,3,FALSE)","v":"Mark Tansley"},{"$f":"+VLOOKUP(+$A32,'Data Input'!$A$3:$AX$41,4,FALSE)","v":"34 5"},{"$f":"+VLOOKUP(+$A32,'Data Input'!$A$3:$AX$41,5,FALSE)","v":14},{"$f":"+VLOOKUP(+$A32,'Data Input'!$A$3:$AX$41,6,FALSE)","v":0},{"$f":"+VLOOKUP(+$A32,'Data Input'!$A$3:$AX$41,7,FALSE)","v":"A"},{"$f":"+VLOOKUP($A32,'Data Input'!$A$3:$AX$41,33,FALSE)","v":0},{"$f":"+VLOOKUP($A32,'Data Input'!$A$3:$AX$41,34,FALSE)","v":0},{"$f":"+VLOOKUP($A32,'Data Input'!$A$3:$AX$41,35,FALSE)","v":0},null,{"$f":"+VLOOKUP($A32,'Data Input'!$A$3:$AX$41,37,FALSE)","v":0}]
[{"$f":"'Data Input'!A33","v":416},{"$f":"+VLOOKUP(+$A33,'Data Input'!$A$3:$AX$41,2,FALSE)","v":"Alice Rose"},{"$f":"+VLOOKUP(+$A33,'Data Input'!$A$3:$AX$41,3,FALSE)","v":"Steve Burton"},{"$f":"+VLOOKUP(+$A33,'Data Input'!$A$3:$AX$41,4,FALSE)","v":"28 6"},{"$f":"+VLOOKUP(+$A33,'Data Input'!$A$3:$AX$41,5,FALSE)","v":-7},{"$f":"+VLOOKUP(+$A33,'Data Input'!$A$3:$AX$41,6,FALSE)","v":0},{"$f":"+VLOOKUP(+$A33,'Data Input'!$A$3:$AX$41,7,FALSE)","v":"A"},{"$f":"+VLOOKUP($A33,'Data Input'!$A$3:$AX$41,33,FALSE)","v":0},{"$f":"+VLOOKUP($A33,'Data Input'!$A$3:$AX$41,34,FALSE)","v":0},{"$f":"+VLOOKUP($A33,'Data Input'!$A$3:$AX$41,35,FALSE)","v":0},null,{"$f":"+VLOOKUP($A33,'Data Input'!$A$3:$AX$41,37,FALSE)","v":0}]
[{"$f":"'Data Input'!A34","v":417},{"$f":"+VLOOKUP(+$A34,'Data Input'!$A$3:$AX$41,2,FALSE)","v":"Stellar"},{"$f":"+VLOOKUP(+$A34,'Data Input'!$A$3:$AX$41,3,FALSE)","v":"Tim Frary"},{"$f":"+VLOOKUP(+$A34,'Data Input'!$A$3:$AX$41,4,FALSE)","v":"31 4"},{"$f":"+VLOOKUP(+$A34,'Data Input'!$A$3:$AX$41,5,FALSE)","v":16},{"$f":"+VLOOKUP(+$A34,'Data Input'!$A$3:$AX$41,6,FALSE)","v":0},{"$f":"+VLOOKUP(+$A34,'Data Input'!$A$3:$AX$41,7,FALSE)","v":"A"},{"$f":"+VLOOKUP($A34,'Data Input'!$A$3:$AX$41,33,FALSE)","v":0},{"$f":"+VLOOKUP($A34,'Data Input'!$A$3:$AX$41,34,FALSE)","v":0},{"$f":"+VLOOKUP($A34,'Data Input'!$A$3:$AX$41,35,FALSE)","v":0},null,{"$f":"+VLOOKUP($A34,'Data Input'!$A$3:$AX$41,37,FALSE)","v":0}]
[{"$f":"'Data Input'!A35","v":418},{"$f":"+VLOOKUP(+$A35,'Data Input'!$A$3:$AX$41,2,FALSE)","v":"Tinkerbell"},{"$f":"+VLOOKUP(+$A35,'Data Input'!$A$3:$AX$41,3,FALSE)","v":"Adrian Lincoln"},{"$f":"+VLOOKUP(+$A35,'Data Input'!$A$3:$AX$41,4,FALSE)","v":"25 10"},{"$f":"+VLOOKUP(+$A35,'Data Input'!$A$3:$AX$41,5,FALSE)","v":-8},{"$f":"+VLOOKUP(+$A35,'Data Input'!$A$3:$AX$41,6,FALSE)","v":0},{"$f":"+VLOOKUP(+$A35,'Data Input'!$A$3:$AX$41,7,FALSE)","v":"A"},{"$f":"+VLOOKUP($A35,'Data Input'!$A$3:$AX$41,33,FALSE)","v":0},{"$f":"+VLOOKUP($A35,'Data Input'!$A$3:$AX$41,34,FALSE)","v":0},{"$f":"+VLOOKUP($A35,'Data Input'!$A$3:$AX$41,35,FALSE)","v":0},null,{"$f":"+VLOOKUP($A35,'Data Input'!$A$3:$AX$41,37,FALSE)","v":0}]
[{"$f":"'Data Input'!A36","v":419},{"$f":"+VLOOKUP(+$A36,'Data Input'!$A$3:$AX$41,2,FALSE)","v":"Skylark"},{"$f":"+VLOOKUP(+$A36,'Data Input'!$A$3:$AX$41,3,FALSE)","v":"Will Pank"},{"$f":"+VLOOKUP(+$A36,'Data Input'!$A$3:$AX$41,4,FALSE)","v":30},{"$f":"+VLOOKUP(+$A36,'Data Input'!$A$3:$AX$41,5,FALSE)","v":2},{"$f":"+VLOOKUP(+$A36,'Data Input'!$A$3:$AX$41,6,FALSE)","v":0},{"$f":"+VLOOKUP(+$A36,'Data Input'!$A$3:$AX$41,7,FALSE)","v":"A"},{"$f":"+VLOOKUP($A36,'Data Input'!$A$3:$AX$41,33,FALSE)","v":0},{"$f":"+VLOOKUP($A36,'Data Input'!$A$3:$AX$41,34,FALSE)","v":0},{"$f":"+VLOOKUP($A36,'Data Input'!$A$3:$AX$41,35,FALSE)","v":0},null,{"$f":"+VLOOKUP($A36,'Data Input'!$A$3:$AX$41,37,FALSE)","v":0}]
[{"$f":"'Data Input'!A37","v":420},{"$f":"+VLOOKUP(+$A37,'Data Input'!$A$3:$AX$41,2,FALSE)","v":"Lyra"},{"$f":"+VLOOKUP(+$A37,'Data Input'!$A$3:$AX$41,3,FALSE)","v":"Paul Carrington"},{"$f":"+VLOOKUP(+$A37,'Data Input'!$A$3:$AX$41,4,FALSE)","v":30},{"$f":"+VLOOKUP(+$A37,'Data Input'!$A$3:$AX$41,5,FALSE)","v":16},{"$f":"+VLOOKUP(+$A37,'Data Input'!$A$3:$AX$41,6,FALSE)","v":0},{"$f":"+VLOOKUP(+$A37,'Data Input'!$A$3:$AX$41,7,FALSE)","v":"A"},{"$f":"+VLOOKUP($A37,'Data Input'!$A$3:$AX$41,33,FALSE)","v":0},{"$f":"+VLOOKUP($A37,'Data Input'!$A$3:$AX$41,34,FALSE)","v":0},{"$f":"+VLOOKUP($A37,'Data Input'!$A$3:$AX$41,35,FALSE)","v":0},null,{"$f":"+VLOOKUP($A37,'Data Input'!$A$3:$AX$41,37,FALSE)","v":0}]
[{"$f":"'Data Input'!A38","v":423},{"$f":"+VLOOKUP(+$A38,'Data Input'!$A$3:$AX$41,2,FALSE)","v":"Valkyrie II"},{"$f":"+VLOOKUP(+$A38,'Data Input'!$A$3:$AX$41,3,FALSE)","v":"Nigel Kippen"},{"$f":"+VLOOKUP(+$A38,'Data Input'!$A$3:$AX$41,4,FALSE)","v":30},{"$f":"+VLOOKUP(+$A38,'Data Input'!$A$3:$AX$41,5,FALSE)","v":-25},{"$f":"+VLOOKUP(+$A38,'Data Input'!$A$3:$AX$41,6,FALSE)","v":"P"},{"$f":"+VLOOKUP(+$A38,'Data Input'!$A$3:$AX$41,7,FALSE)","v":"A"},{"$f":"+VLOOKUP($A38,'Data Input'!$A$3:$AX$41,33,FALSE)","v":0},{"$f":"+VLOOKUP($A38,'Data Input'!$A$3:$AX$41,34,FALSE)","v":0},{"$f":"+VLOOKUP($A38,'Data Input'!$A$3:$AX$41,35,FALSE)","v":0},null,{"$f":"+VLOOKUP($A38,'Data Input'!$A$3:$AX$41,37,FALSE)","v":0}]
[{"$f":"'Data Input'!A39","v":429},{"$f":"+VLOOKUP(+$A39,'Data Input'!$A$3:$AX$41,2,FALSE)","v":"Pickle"},{"$f":"+VLOOKUP(+$A39,'Data Input'!$A$3:$AX$41,3,FALSE)","v":"Phil Montague"},{"$f":"+VLOOKUP(+$A39,'Data Input'!$A$3:$AX$41,4,FALSE)","v":"22 6"},{"$f":"+VLOOKUP(+$A39,'Data Input'!$A$3:$AX$41,5,FALSE)","v":-16},{"$f":"+VLOOKUP(+$A39,'Data Input'!$A$3:$AX$41,6,FALSE)","v":0},{"$f":"+VLOOKUP(+$A39,'Data Input'!$A$3:$AX$41,7,FALSE)","v":"A"},{"$f":"+VLOOKUP($A39,'Data Input'!$A$3:$AX$41,33,FALSE)","v":0},{"$f":"+VLOOKUP($A39,'Data Input'!$A$3:$AX$41,34,FALSE)","v":0},{"$f":"+VLOOKUP($A39,'Data Input'!$A$3:$AX$41,35,FALSE)","v":0},null,{"$f":"+VLOOKUP($A39,'Data Input'!$A$3:$AX$41,37,FALSE)","v":0}]
[{"$f":"'Data Input'!A40","v":0},{"$f":"+VLOOKUP(+$A40,'Data Input'!$A$3:$AX$41,2,FALSE)","v":0},{"$f":"+VLOOKUP(+$A40,'Data Input'!$A$3:$AX$41,3,FALSE)","v":0},{"$f":"+VLOOKUP(+$A40,'Data Input'!$A$3:$AX$41,4,FALSE)","v":0},{"$f":"+VLOOKUP(+$A40,'Data Input'!$A$3:$AX$41,5,FALSE)","v":0},{"$f":"+VLOOKUP(+$A40,'Data Input'!$A$3:$AX$41,6,FALSE)","v":0},{"$f":"+VLOOKUP(+$A40,'Data Input'!$A$3:$AX$41,7,FALSE)","v":""},{"$f":"+VLOOKUP($A40,'Data Input'!$A$3:$AX$41,33,FALSE)","v":0},{"$f":"+VLOOKUP($A40,'Data Input'!$A$3:$AX$41,34,FALSE)","v":0},{"$f":"+VLOOKUP($A40,'Data Input'!$A$3:$AX$41,35,FALSE)","v":0},null,{"$f":"+VLOOKUP($A40,'Data Input'!$A$3:$AX$41,37,FALSE)","v":0}]
[{"$f":"'Data Input'!A41","v":0},{"$f":"+VLOOKUP(+$A41,'Data Input'!$A$3:$AX$41,2,FALSE)","v":0},{"$f":"+VLOOKUP(+$A41,'Data Input'!$A$3:$AX$41,3,FALSE)","v":0},{"$f":"+VLOOKUP(+$A41,'Data Input'!$A$3:$AX$41,4,FALSE)","v":0},{"$f":"+VLOOKUP(+$A41,'Data Input'!$A$3:$AX$41,5,FALSE)","v":0},{"$f":"+VLOOKUP(+$A41,'Data Input'!$A$3:$AX$41,6,FALSE)","v":0},{"$f":"+VLOOKUP(+$A41,'Data Input'!$A$3:$AX$41,7,FALSE)","v":""},{"$f":"+VLOOKUP($A41,'Data Input'!$A$3:$AX$41,33,FALSE)","v":0},{"$f":"+VLOOKUP($A41,'Data Input'!$A$3:$AX$41,34,FALSE)","v":0},{"$f":"+VLOOKUP($A41,'Data Input'!$A$3:$AX$41,35,FALSE)","v":0},null,{"$f":"+VLOOKUP($A41,'Data Input'!$A$3:$AX$41,37,FALSE)","v":0}]
[{"$f":"+COUNT(A3:A41)","v":39}]

{"sheet":"Classes A","index":5,"n_rows":25,"n_cols":14,"rows_kept":25,"cut":false,"hidden":false,"merged":[]}
["Starlight Lady",null,null,null,null,null,null,null,"Corrected"]
["No","Yacht","Skipper","Length","H/C","P","Class","H","M","S",null,"Pos"," "]
[{"$f":"Classes!A3","v":7},{"$f":"+VLOOKUP(+$A3,'Data Input'!$A$3:$AX$41,2,FALSE)","v":"Forester"},{"$f":"+VLOOKUP(+$A3,'Data Input'!$A$3:$AX$41,3,FALSE)","v":"Will Bentall"},{"$f":"+VLOOKUP(+$A3,'Data Input'!$A$3:$AX$41,4,FALSE)","v":"32 6"},{"$f":"+VLOOKUP(+$A3,'Data Input'!$A$3:$AX$41,5,FALSE)","v":-8},{"$f":"+VLOOKUP(+$A3,'Data Input'!$A$3:$AX$41,6,FALSE)","v":0},{"$f":"+VLOOKUP(+$A3,'Data Input'!$A$3:$AX$41,7,FALSE)","v":"A"},{"$f":"+VLOOKUP($A3,'Data Input'!$A$3:$AX$41,33,FALSE)","v":0},{"$f":"+VLOOKUP($A3,'Data Input'!$A$3:$AX$41,34,FALSE)","v":0},{"$f":"+VLOOKUP($A3,'Data Input'!$A$3:$AX$41,35,FALSE)","v":0},null,{"$f":"+VLOOKUP($A3,'Data Input'!$A$3:$AX$41,37,FALSE)","v":0},null,"FIRST"]
[{"$f":"Classes!A4","v":10},{"$f":"+VLOOKUP(+$A4,'Data Input'!$A$3:$AX$41,2,FALSE)","v":"Flight"},{"$f":"+VLOOKUP(+$A4,'Data Input'!$A$3:$AX$41,3,FALSE)","v":"Joe Farrow"},{"$f":"+VLOOKUP(+$A4,'Data Input'!$A$3:$AX$41,4,FALSE)","v":"29 11"},{"$f":"+VLOOKUP(+$A4,'Data Input'!$A$3:$AX$41,5,FALSE)","v":-9},{"$f":"+VLOOKUP(+$A4,'Data Input'!$A$3:$AX$41,6,FALSE)","v":0},{"$f":"+VLOOKUP(+$A4,'Data Input'!$A$3:$AX$41,7,FALSE)","v":"A"},{"$f":"+VLOOKUP($A4,'Data Input'!$A$3:$AX$41,33,FALSE)","v":0},{"$f":"+VLOOKUP($A4,'Data Input'!$A$3:$AX$41,34,FALSE)","v":0},{"$f":"+VLOOKUP($A4,'Data Input'!$A$3:$AX$41,35,FALSE)","v":0},null,{"$f":"+VLOOKUP($A4,'Data Input'!$A$3:$AX$41,37,FALSE)","v":0},null,"SECOND"]
[{"$f":"Classes!A5","v":13},{"$f":"+VLOOKUP(+$A5,'Data Input'!$A$3:$AX$41,2,FALSE)","v":"Ladybird"},{"$f":"+VLOOKUP(+$A5,'Data Input'!$A$3:$AX$41,3,FALSE)","v":"Ben Knight"},{"$f":"+VLOOKUP(+$A5,'Data Input'!$A$3:$AX$41,4,FALSE)","v":34},{"$f":"+VLOOKUP(+$A5,'Data Input'!$A$3:$AX$41,5,FALSE)","v":1},{"$f":"+VLOOKUP(+$A5,'Data Input'!$A$3:$AX$41,6,FALSE)","v":0},{"$f":"+VLOOKUP(+$A5,'Data Input'!$A$3:$AX$41,7,FALSE)","v":"A"},{"$f":"+VLOOKUP($A5,'Data Input'!$A$3:$AX$41,33,FALSE)","v":0},{"$f":"+VLOOKUP($A5,'Data Input'!$A$3:$AX$41,34,FALSE)","v":0},{"$f":"+VLOOKUP($A5,'Data Input'!$A$3:$AX$41,35,FALSE)","v":0},null,{"$f":"+VLOOKUP($A5,'Data Input'!$A$3:$AX$41,37,FALSE)","v":0},null,"THIRD"]
[{"$f":"Classes!A6","v":15},{"$f":"+VLOOKUP(+$A6,'Data Input'!$A$3:$AX$41,2,FALSE)","v":"Pirate"},{"$f":"+VLOOKUP(+$A6,'Data Input'!$A$3:$AX$41,3,FALSE)","v":"Kevin Thomas"},{"$f":"+VLOOKUP(+$A6,'Data Input'!$A$3:$AX$41,4,FALSE)","v":29},{"$f":"+VLOOKUP(+$A6,'Data Input'!$A$3:$AX$41,5,FALSE)","v":-7},{"$f":"+VLOOKUP(+$A6,'Data Input'!$A$3:$AX$41,6,FALSE)","v":0},{"$f":"+VLOOKUP(+$A6,'Data Input'!$A$3:$AX$41,7,FALSE)","v":"A"},{"$f":"+VLOOKUP($A6,'Data Input'!$A$3:$AX$41,33,FALSE)","v":0},{"$f":"+VLOOKUP($A6,'Data Input'!$A$3:$AX$41,34,FALSE)","v":0},{"$f":"+VLOOKUP($A6,'Data Input'!$A$3:$AX$41,35,FALSE)","v":0},null,{"$f":"+VLOOKUP($A6,'Data Input'!$A$3:$AX$41,37,FALSE)","v":0},null,4]
[{"$f":"Classes!A7","v":22},{"$f":"+VLOOKUP(+$A7,'Data Input'!$A$3:$AX$41,2,FALSE)","v":"Moonraker"},{"$f":"+VLOOKUP(+$A7,'Data Input'!$A$3:$AX$41,3,FALSE)","v":"Peter Jeckells"},{"$f":"+VLOOKUP(+$A7,'Data Input'!$A$3:$AX$41,4,FALSE)","v":"29 6"},{"$f":"+VLOOKUP(+$A7,'Data Input'!$A$3:$AX$41,5,FALSE)","v":2},{"$f":"+VLOOKUP(+$A7,'Data Input'!$A$3:$AX$41,6,FALSE)","v":0},{"$f":"+VLOOKUP(+$A7,'Data Input'!$A$3:$AX$41,7,FALSE)","v":"A"},{"$f":"+VLOOKUP($A7,'Data Input'!$A$3:$AX$41,33,FALSE)","v":0},{"$f":"+VLOOKUP($A7,'Data Input'!$A$3:$AX$41,34,FALSE)","v":0},{"$f":"+VLOOKUP($A7,'Data Input'!$A$3:$AX$41,35,FALSE)","v":0},null,{"$f":"+VLOOKUP($A7,'Data Input'!$A$3:$AX$41,37,FALSE)","v":0},null,{"$f":"N6+1","v":5}]
[{"$f":"Classes!A8","v":25},{"$f":"+VLOOKUP(+$A8,'Data Input'!$A$3:$AX$41,2,FALSE)","v":"Melody"},{"$f":"+VLOOKUP(+$A8,'Data Input'!$A$3:$AX$41,3,FALSE)","v":"Mark Wells"},{"$f":"+VLOOKUP(+$A8,'Data Input'!$A$3:$AX$41,4,FALSE)","v":26},{"$f":"+VLOOKUP(+$A8,'Data Input'!$A$3:$AX$41,5,FALSE)","v":-11},{"$f":"+VLOOKUP(+$A8,'Data Input'!$A$3:$AX$41,6,FALSE)","v":0},{"$f":"+VLOOKUP(+$A8,'Data Input'!$A$3:$AX$41,7,FALSE)","v":"B"},{"$f":"+VLOOKUP($A8,'Data Input'!$A$3:$AX$41,33,FALSE)","v":0},{"$f":"+VLOOKUP($A8,'Data Input'!$A$3:$AX$41,34,FALSE)","v":0},{"$f":"+VLOOKUP($A8,'Data Input'!$A$3:$AX$41,35,FALSE)","v":0},null,{"$f":"+VLOOKUP($A8,'Data Input'!$A$3:$AX$41,37,FALSE)","v":0},null,{"$f":"N7+1","v":6}]
[{"$f":"Classes!A9","v":37},{"$f":"+VLOOKUP(+$A9,'Data Input'!$A$3:$AX$41,2,FALSE)","v":"Harrier"},{"$f":"+VLOOKUP(+$A9,'Data Input'!$A$3:$AX$41,3,FALSE)","v":"Jack Copping"},{"$f":"+VLOOKUP(+$A9,'Data Input'!$A$3:$AX$41,4,FALSE)","v":27},{"$f":"+VLOOKUP(+$A9,'Data Input'!$A$3:$AX$41,5,FALSE)","v":-20},{"$f":"+VLOOKUP(+$A9,'Data Input'!$A$3:$AX$41,6,FALSE)","v":0},{"$f":"+VLOOKUP(+$A9,'Data Input'!$A$3:$AX$41,7,FALSE)","v":"B"},{"$f":"+VLOOKUP($A9,'Data Input'!$A$3:$AX$41,33,FALSE)","v":0},{"$f":"+VLOOKUP($A9,'Data Input'!$A$3:$AX$41,34,FALSE)","v":0},{"$f":"+VLOOKUP($A9,'Data Input'!$A$3:$AX$41,35,FALSE)","v":0},null,{"$f":"+VLOOKUP($A9,'Data Input'!$A$3:$AX$41,37,FALSE)","v":0},null,7]
[{"$f":"Classes!A10","v":48},{"$f":"+VLOOKUP(+$A10,'Data Input'!$A$3:$AX$41,2,FALSE)","v":"Sparklet"},{"$f":"+VLOOKUP(+$A10,'Data Input'!$A$3:$AX$41,3,FALSE)","v":"Mike Barnes"},{"$f":"+VLOOKUP(+$A10,'Data Input'!$A$3:$AX$41,4,FALSE)","v":41},{"$f":"+VLOOKUP(+$A10,'Data Input'!$A$3:$AX$41,5,FALSE)","v":9},{"$f":"+VLOOKUP(+$A10,'Data Input'!$A$3:$AX$41,6,FALSE)","v":0},{"$f":"+VLOOKUP(+$A10,'Data Input'!$A$3:$AX$41,7,FALSE)","v":"A"},{"$f":"+VLOOKUP($A10,'Data Input'!$A$3:$AX$41,33,FALSE)","v":0},{"$f":"+VLOOKUP($A10,'Data Input'!$A$3:$AX$41,34,FALSE)","v":0},{"$f":"+VLOOKUP($A10,'Data Input'!$A$3:$AX$41,35,FALSE)","v":0},null,{"$f":"+VLOOKUP($A10,'Data Input'!$A$3:$AX$41,37,FALSE)","v":0},null,8]
[{"$f":"Classes!A11","v":79},{"$f":"+VLOOKUP(+$A11,'Data Input'!$A$3:$AX$41,2,FALSE)","v":"Daisy"},{"$f":"+VLOOKUP(+$A11,'Data Input'!$A$3:$AX$41,3,FALSE)","v":"Tim Ford"},{"$f":"+VLOOKUP(+$A11,'Data Input'!$A$3:$AX$41,4,FALSE)","v":22},{"$f":"+VLOOKUP(+$A11,'Data Input'!$A$3:$AX$41,5,FALSE)","v":-26},{"$f":"+VLOOKUP(+$A11,'Data Input'!$A$3:$AX$41,6,FALSE)","v":0},{"$f":"+VLOOKUP(+$A11,'Data Input'!$A$3:$AX$41,7,FALSE)","v":"C"},{"$f":"+VLOOKUP($A11,'Data Input'!$A$3:$AX$41,33,FALSE)","v":0},{"$f":"+VLOOKUP($A11,'Data Input'!$A$3:$AX$41,34,FALSE)","v":0},{"$f":"+VLOOKUP($A11,'Data Input'!$A$3:$AX$41,35,FALSE)","v":0},null,{"$f":"+VLOOKUP($A11,'Data Input'!$A$3:$AX$41,37,FALSE)","v":0},null,9]
[{"$f":"Classes!A12","v":87},{"$f":"+VLOOKUP(+$A12,'Data Input'!$A$3:$AX$41,2,FALSE)","v":"Modwena"},{"$f":"+VLOOKUP(+$A12,'Data Input'!$A$3:$AX$41,3,FALSE)","v":"Mark Cassidy"},{"$f":"+VLOOKUP(+$A12,'Data Input'!$A$3:$AX$41,4,FALSE)","v":"24 11"},{"$f":"+VLOOKUP(+$A12,'Data Input'!$A$3:$AX$41,5,FALSE)","v":-19},{"$f":"+VLOOKUP(+$A12,'Data Input'!$A$3:$AX$41,6,FALSE)","v":0},{"$f":"+VLOOKUP(+$A12,'Data Input'!$A$3:$AX$41,7,FALSE)","v":"A"},{"$f":"+VLOOKUP($A12,'Data Input'!$A$3:$AX$41,33,FALSE)","v":0},{"$f":"+VLOOKUP($A12,'Data Input'!$A$3:$AX$41,34,FALSE)","v":0},{"$f":"+VLOOKUP($A12,'Data Input'!$A$3:$AX$41,35,FALSE)","v":0},null,{"$f":"+VLOOKUP($A12,'Data Input'!$A$3:$AX$41,37,FALSE)","v":0},null,10]
[{"$f":"Classes!A13","v":98},{"$f":"+VLOOKUP(+$A13,'Data Input'!$A$3:$AX$41,2,FALSE)","v":"Force Four"},{"$f":"+VLOOKUP(+$A13,'Data Input'!$A$3:$AX$41,3,FALSE)","v":"JD Winterton"},{"$f":"+VLOOKUP(+$A13,'Data Input'!$A$3:$AX$41,4,FALSE)","v":"31 6"},{"$f":"+VLOOKUP(+$A13,'Data Input'!$A$3:$AX$41,5,FALSE)","v":-21},{"$f":"+VLOOKUP(+$A13,'Data Input'!$A$3:$AX$41,6,FALSE)","v":"P"},{"$f":"+VLOOKUP(+$A13,'Data Input'!$A$3:$AX$41,7,FALSE)","v":"A"},{"$f":"+VLOOKUP($A13,'Data Input'!$A$3:$AX$41,33,FALSE)","v":0},{"$f":"+VLOOKUP($A13,'Data Input'!$A$3:$AX$41,34,FALSE)","v":0},{"$f":"+VLOOKUP($A13,'Data Input'!$A$3:$AX$41,35,FALSE)","v":0},null,{"$f":"+VLOOKUP($A13,'Data Input'!$A$3:$AX$41,37,FALSE)","v":"P"},null,11]
[{"$f":"Classes!A14","v":141},{"$f":"+VLOOKUP(+$A14,'Data Input'!$A$3:$AX$41,2,FALSE)","v":"Nirvana"},{"$f":"+VLOOKUP(+$A14,'Data Input'!$A$3:$AX$41,3,FALSE)","v":"Dr Michael Claridge"},{"$f":"+VLOOKUP(+$A14,'Data Input'!$A$3:$AX$41,4,FALSE)","v":19},{"$f":"+VLOOKUP(+$A14,'Data Input'!$A$3:$AX$41,5,FALSE)","v":-23},{"$f":"+VLOOKUP(+$A14,'Data Input'!$A$3:$AX$41,6,FALSE)","v":"P"},{"$f":"+VLOOKUP(+$A14,'Data Input'!$A$3:$AX$41,7,FALSE)","v":"C"},{"$f":"+VLOOKUP($A14,'Data Input'!$A$3:$AX$41,33,FALSE)","v":0},{"$f":"+VLOOKUP($A14,'Data Input'!$A$3:$AX$41,34,FALSE)","v":0},{"$f":"+VLOOKUP($A14,'Data Input'!$A$3:$AX$41,35,FALSE)","v":0},null,{"$f":"+VLOOKUP($A14,'Data Input'!$A$3:$AX$41,37,FALSE)","v":"P"},null,12]
[{"$f":"Classes!A15","v":152},{"$f":"+VLOOKUP(+$A15,'Data Input'!$A$3:$AX$41,2,FALSE)","v":"Sabrina 2"},{"$f":"+VLOOKUP(+$A15,'Data Input'!$A$3:$AX$41,3,FALSE)","v":"John Holmes"},{"$f":"+VLOOKUP(+$A15,'Data Input'!$A$3:$AX$41,4,FALSE)","v":29},{"$f":"+VLOOKUP(+$A15,'Data Input'!$A$3:$AX$41,5,FALSE)","v":-5},{"$f":"+VLOOKUP(+$A15,'Data Input'!$A$3:$AX$41,6,FALSE)","v":0},{"$f":"+VLOOKUP(+$A15,'Data Input'!$A$3:$AX$41,7,FALSE)","v":"A"},{"$f":"+VLOOKUP($A15,'Data Input'!$A$3:$AX$41,33,FALSE)","v":0},{"$f":"+VLOOKUP($A15,'Data Input'!$A$3:$AX$41,34,FALSE)","v":0},{"$f":"+VLOOKUP($A15,'Data Input'!$A$3:$AX$41,35,FALSE)","v":0},null,{"$f":"+VLOOKUP($A15,'Data Input'!$A$3:$AX$41,37,FALSE)","v":0},null,{"$f":"N14+1","v":13}]
[{"$f":"Classes!A16","v":155},{"$f":"+VLOOKUP(+$A16,'Data Input'!$A$3:$AX$41,2,FALSE)","v":"Stratus"},{"$f":"+VLOOKUP(+$A16,'Data Input'!$A$3:$AX$41,3,FALSE)","v":"Rhiannon Alger"},{"$f":"+VLOOKUP(+$A16,'Data Input'!$A$3:$AX$41,4,FALSE)","v":"22 10"},{"$f":"+VLOOKUP(+$A16,'Data Input'!$A$3:$AX$41,5,FALSE)","v":-16},{"$f":"+VLOOKUP(+$A16,'Data Input'!$A$3:$AX$41,6,FALSE)","v":0},{"$f":"+VLOOKUP(+$A16,'Data Input'!$A$3:$AX$41,7,FALSE)","v":"A"},{"$f":"+VLOOKUP($A16,'Data Input'!$A$3:$AX$41,33,FALSE)","v":0},{"$f":"+VLOOKUP($A16,'Data Input'!$A$3:$AX$41,34,FALSE)","v":0},{"$f":"+VLOOKUP($A16,'Data Input'!$A$3:$AX$41,35,FALSE)","v":0},null,{"$f":"+VLOOKUP($A16,'Data Input'!$A$3:$AX$41,37,FALSE)","v":0},null,14]
[{"$f":"Classes!A17","v":179},{"$f":"+VLOOKUP(+$A17,'Data Input'!$A$3:$AX$41,2,FALSE)","v":"Waxwing"},{"$f":"+VLOOKUP(+$A17,'Data Input'!$A$3:$AX$41,3,FALSE)","v":"Robin Clayton"},{"$f":"+VLOOKUP(+$A17,'Data Input'!$A$3:$AX$41,4,FALSE)","v":27},{"$f":"+VLOOKUP(+$A17,'Data Input'!$A$3:$AX$41,5,FALSE)","v":-8},{"$f":"+VLOOKUP(+$A17,'Data Input'!$A$3:$AX$41,6,FALSE)","v":0},{"$f":"+VLOOKUP(+$A17,'Data Input'!$A$3:$AX$41,7,FALSE)","v":"B"},{"$f":"+VLOOKUP($A17,'Data Input'!$A$3:$AX$41,33,FALSE)","v":0},{"$f":"+VLOOKUP($A17,'Data Input'!$A$3:$AX$41,34,FALSE)","v":0},{"$f":"+VLOOKUP($A17,'Data Input'!$A$3:$AX$41,35,FALSE)","v":0},null,{"$f":"+VLOOKUP($A17,'Data Input'!$A$3:$AX$41,37,FALSE)","v":0},null,15]
[{"$f":"Classes!A18","v":199},{"$f":"+VLOOKUP(+$A18,'Data Input'!$A$3:$AX$41,2,FALSE)","v":"Morning Calm"},{"$f":"+VLOOKUP(+$A18,'Data Input'!$A$3:$AX$41,3,FALSE)","v":"Bill Clarke"},{"$f":"+VLOOKUP(+$A18,'Data Input'!$A$3:$AX$41,4,FALSE)","v":26},{"$f":"+VLOOKUP(+$A18,'Data Input'!$A$3:$AX$41,5,FALSE)","v":-8},{"$f":"+VLOOKUP(+$A18,'Data Input'!$A$3:$AX$41,6,FALSE)","v":0},{"$f":"+VLOOKUP(+$A18,'Data Input'!$A$3:$AX$41,7,FALSE)","v":"B"},{"$f":"+VLOOKUP($A18,'Data Input'!$A$3:$AX$41,33,FALSE)","v":0},{"$f":"+VLOOKUP($A18,'Data Input'!$A$3:$AX$41,34,FALSE)","v":0},{"$f":"+VLOOKUP($A18,'Data Input'!$A$3:$AX$41,35,FALSE)","v":0},null,{"$f":"+VLOOKUP($A18,'Data Input'!$A$3:$AX$41,37,FALSE)","v":0},null,16]
[{"$f":"Classes!A19","v":216},{"$f":"+VLOOKUP(+$A19,'Data Input'!$A$3:$AX$41,2,FALSE)","v":"Tamara"},{"$f":"+VLOOKUP(+$A19,'Data Input'!$A$3:$AX$41,3,FALSE)","v":"Nick Heath"},{"$f":"+VLOOKUP(+$A19,'Data Input'!$A$3:$AX$41,4,FALSE)","v":"24 8"},{"$f":"+VLOOKUP(+$A19,'Data Input'!$A$3:$AX$41,5,FALSE)","v":-16},{"$f":"+VLOOKUP(+$A19,'Data Input'!$A$3:$AX$41,6,FALSE)","v":0},{"$f":"+VLOOKUP(+$A19,'Data Input'!$A$3:$AX$41,7,FALSE)","v":"A"},{"$f":"+VLOOKUP($A19,'Data Input'!$A$3:$AX$41,33,FALSE)","v":0},{"$f":"+VLOOKUP($A19,'Data Input'!$A$3:$AX$41,34,FALSE)","v":0},{"$f":"+VLOOKUP($A19,'Data Input'!$A$3:$AX$41,35,FALSE)","v":0},null,{"$f":"+VLOOKUP($A19,'Data Input'!$A$3:$AX$41,37,FALSE)","v":0},null,17]
[{"$f":"Classes!A20","v":217},{"$f":"+VLOOKUP(+$A20,'Data Input'!$A$3:$AX$41,2,FALSE)","v":"Melinda"},{"$f":"+VLOOKUP(+$A20,'Data Input'!$A$3:$AX$41,3,FALSE)","v":"Paul Howes"},{"$f":"+VLOOKUP(+$A20,'Data Input'!$A$3:$AX$41,4,FALSE)","v":"27 11"},{"$f":"+VLOOKUP(+$A20,'Data Input'!$A$3:$AX$41,5,FALSE)","v":1},{"$f":"+VLOOKUP(+$A20,'Data Input'!$A$3:$AX$41,6,FALSE)","v":0},{"$f":"+VLOOKUP(+$A20,'Data Input'!$A$3:$AX$41,7,FALSE)","v":"A"},{"$f":"+VLOOKUP($A20,'Data Input'!$A$3:$AX$41,33,FALSE)","v":0},{"$f":"+VLOOKUP($A20,'Data Input'!$A$3:$AX$41,34,FALSE)","v":0},{"$f":"+VLOOKUP($A20,'Data Input'!$A$3:$AX$41,35,FALSE)","v":0},null,{"$f":"+VLOOKUP($A20,'Data Input'!$A$3:$AX$41,37,FALSE)","v":0},null,18]
[{"$f":"Classes!A21","v":218},{"$f":"+VLOOKUP(+$A21,'Data Input'!$A$3:$AX$41,2,FALSE)","v":"Mystery"},{"$f":"+VLOOKUP(+$A21,'Data Input'!$A$3:$AX$41,3,FALSE)","v":"Matt Ford"},{"$f":"+VLOOKUP(+$A21,'Data Input'!$A$3:$AX$41,4,FALSE)","v":26},{"$f":"+VLOOKUP(+$A21,'Data Input'!$A$3:$AX$41,5,FALSE)","v":-8},{"$f":"+VLOOKUP(+$A21,'Data Input'!$A$3:$AX$41,6,FALSE)","v":0},{"$f":"+VLOOKUP(+$A21,'Data Input'!$A$3:$AX$41,7,FALSE)","v":"B"},{"$f":"+VLOOKUP($A21,'Data Input'!$A$3:$AX$41,33,FALSE)","v":0},{"$f":"+VLOOKUP($A21,'Data Input'!$A$3:$AX$41,34,FALSE)","v":0},{"$f":"+VLOOKUP($A21,'Data Input'!$A$3:$AX$41,35,FALSE)","v":0},null,{"$f":"+VLOOKUP($A21,'Data Input'!$A$3:$AX$41,37,FALSE)","v":0},null,19]
[{"$f":"Classes!A22","v":219},{"$f":"+VLOOKUP(+$A22,'Data Input'!$A$3:$AX$41,2,FALSE)","v":"Farthing"},{"$f":"+VLOOKUP(+$A22,'Data Input'!$A$3:$AX$41,3,FALSE)","v":"Melanie Farrar"},{"$f":"+VLOOKUP(+$A22,'Data Input'!$A$3:$AX$41,4,FALSE)","v":36},{"$f":"+VLOOKUP(+$A22,'Data Input'!$A$3:$AX$41,5,FALSE)","v":3},{"$f":"+VLOOKUP(+$A22,'Data Input'!$A$3:$AX$41,6,FALSE)","v":0},{"$f":"+VLOOKUP(+$A22,'Data Input'!$A$3:$AX$41,7,FALSE)","v":"A"},{"$f":"+VLOOKUP($A22,'Data Input'!$A$3:$AX$41,33,FALSE)","v":0},{"$f":"+VLOOKUP($A22,'Data Input'!$A$3:$AX$41,34,FALSE)","v":0},{"$f":"+VLOOKUP($A22,'Data Input'!$A$3:$AX$41,35,FALSE)","v":0},null,{"$f":"+VLOOKUP($A22,'Data Input'!$A$3:$AX$41,37,FALSE)","v":0},null,20]
[{"$f":"Classes!A23","v":224},{"$f":"+VLOOKUP(+$A23,'Data Input'!$A$3:$AX$41,2,FALSE)","v":"Anna"},{"$f":"+VLOOKUP(+$A23,'Data Input'!$A$3:$AX$41,3,FALSE)","v":"R&D Branscombe"},{"$f":"+VLOOKUP(+$A23,'Data Input'!$A$3:$AX$41,4,FALSE)","v":25},{"$f":"+VLOOKUP(+$A23,'Data Input'!$A$3:$AX$41,5,FALSE)","v":-10},{"$f":"+VLOOKUP(+$A23,'Data Input'!$A$3:$AX$41,6,FALSE)","v":0},{"$f":"+VLOOKUP(+$A23,'Data Input'!$A$3:$AX$41,7,FALSE)","v":"B"},{"$f":"+VLOOKUP($A23,'Data Input'!$A$3:$AX$41,33,FALSE)","v":0},{"$f":"+VLOOKUP($A23,'Data Input'!$A$3:$AX$41,34,FALSE)","v":0},{"$f":"+VLOOKUP($A23,'Data Input'!$A$3:$AX$41,35,FALSE)","v":0},null,{"$f":"+VLOOKUP($A23,'Data Input'!$A$3:$AX$41,37,FALSE)","v":0},null,21]
[{"$f":"Classes!A24","v":250},{"$f":"+VLOOKUP(+$A24,'Data Input'!$A$3:$AX$41,2,FALSE)","v":"Storm"},{"$f":"+VLOOKUP(+$A24,'Data Input'!$A$3:$AX$41,3,FALSE)","v":"Matthew Thwaites"},{"$f":"+VLOOKUP(+$A24,'Data Input'!$A$3:$AX$41,4,FALSE)","v":35},{"$f":"+VLOOKUP(+$A24,'Data Input'!$A$3:$AX$41,5,FALSE)","v":16},{"$f":"+VLOOKUP(+$A24,'Data Input'!$A$3:$AX$41,6,FALSE)","v":0},{"$f":"+VLOOKUP(+$A24,'Data Input'!$A$3:$AX$41,7,FALSE)","v":"A"},{"$f":"+VLOOKUP($A24,'Data Input'!$A$3:$AX$41,33,FALSE)","v":0},{"$f":"+VLOOKUP($A24,'Data Input'!$A$3:$AX$41,34,FALSE)","v":0},{"$f":"+VLOOKUP($A24,'Data Input'!$A$3:$AX$41,35,FALSE)","v":0},null,{"$f":"+VLOOKUP($A24,'Data Input'!$A$3:$AX$41,37,FALSE)","v":0},null,22]
[{"$f":"+COUNT(A3:A24)","v":22}]

{"sheet":"Classes B","index":6,"n_rows":23,"n_cols":14,"rows_kept":23,"cut":false,"hidden":false,"merged":[]}
["Jeckells",null,null,null,null,null,null,null,"Corrected"]
["No","Yacht","Skipper","Length","H/C","P","Class","H","M","S",null,"Pos"," "]
[{"$f":"Classes!A3","v":7},{"$f":"+VLOOKUP(+$A3,'Data Input'!$A$3:$AX$41,2,FALSE)","v":"Forester"},{"$f":"+VLOOKUP(+$A3,'Data Input'!$A$3:$AX$41,3,FALSE)","v":"Will Bentall"},{"$f":"+VLOOKUP(+$A3,'Data Input'!$A$3:$AX$41,4,FALSE)","v":"32 6"},{"$f":"+VLOOKUP(+$A3,'Data Input'!$A$3:$AX$41,5,FALSE)","v":-8},{"$f":"+VLOOKUP(+$A3,'Data Input'!$A$3:$AX$41,6,FALSE)","v":0},{"$f":"+VLOOKUP(+$A3,'Data Input'!$A$3:$AX$41,7,FALSE)","v":"A"},{"$f":"+VLOOKUP($A3,'Data Input'!$A$3:$AX$41,33,FALSE)","v":0},{"$f":"+VLOOKUP($A3,'Data Input'!$A$3:$AX$41,34,FALSE)","v":0},{"$f":"+VLOOKUP($A3,'Data Input'!$A$3:$AX$41,35,FALSE)","v":0},null,{"$f":"+VLOOKUP($A3,'Data Input'!$A$3:$AX$41,37,FALSE)","v":0},null,"FIRST"]
[{"$f":"Classes!A4","v":10},{"$f":"+VLOOKUP(+$A4,'Data Input'!$A$3:$AX$41,2,FALSE)","v":"Flight"},{"$f":"+VLOOKUP(+$A4,'Data Input'!$A$3:$AX$41,3,FALSE)","v":"Joe Farrow"},{"$f":"+VLOOKUP(+$A4,'Data Input'!$A$3:$AX$41,4,FALSE)","v":"29 11"},{"$f":"+VLOOKUP(+$A4,'Data Input'!$A$3:$AX$41,5,FALSE)","v":-9},{"$f":"+VLOOKUP(+$A4,'Data Input'!$A$3:$AX$41,6,FALSE)","v":0},{"$f":"+VLOOKUP(+$A4,'Data Input'!$A$3:$AX$41,7,FALSE)","v":"A"},{"$f":"+VLOOKUP($A4,'Data Input'!$A$3:$AX$41,33,FALSE)","v":0},{"$f":"+VLOOKUP($A4,'Data Input'!$A$3:$AX$41,34,FALSE)","v":0},{"$f":"+VLOOKUP($A4,'Data Input'!$A$3:$AX$41,35,FALSE)","v":0},null,{"$f":"+VLOOKUP($A4,'Data Input'!$A$3:$AX$41,37,FALSE)","v":0},null,"SECOND"]
[{"$f":"Classes!A5","v":13},{"$f":"+VLOOKUP(+$A5,'Data Input'!$A$3:$AX$41,2,FALSE)","v":"Ladybird"},{"$f":"+VLOOKUP(+$A5,'Data Input'!$A$3:$AX$41,3,FALSE)","v":"Ben Knight"},{"$f":"+VLOOKUP(+$A5,'Data Input'!$A$3:$AX$41,4,FALSE)","v":34},{"$f":"+VLOOKUP(+$A5,'Data Input'!$A$3:$AX$41,5,FALSE)","v":1},{"$f":"+VLOOKUP(+$A5,'Data Input'!$A$3:$AX$41,6,FALSE)","v":0},{"$f":"+VLOOKUP(+$A5,'Data Input'!$A$3:$AX$41,7,FALSE)","v":"A"},{"$f":"+VLOOKUP($A5,'Data Input'!$A$3:$AX$41,33,FALSE)","v":0},{"$f":"+VLOOKUP($A5,'Data Input'!$A$3:$AX$41,34,FALSE)","v":0},{"$f":"+VLOOKUP($A5,'Data Input'!$A$3:$AX$41,35,FALSE)","v":0},null,{"$f":"+VLOOKUP($A5,'Data Input'!$A$3:$AX$41,37,FALSE)","v":0},null,"THIRD"]
[{"$f":"Classes!A6","v":15},{"$f":"+VLOOKUP(+$A6,'Data Input'!$A$3:$AX$41,2,FALSE)","v":"Pirate"},{"$f":"+VLOOKUP(+$A6,'Data Input'!$A$3:$AX$41,3,FALSE)","v":"Kevin Thomas"},{"$f":"+VLOOKUP(+$A6,'Data Input'!$A$3:$AX$41,4,FALSE)","v":29},{"$f":"+VLOOKUP(+$A6,'Data Input'!$A$3:$AX$41,5,FALSE)","v":-7},{"$f":"+VLOOKUP(+$A6,'Data Input'!$A$3:$AX$41,6,FALSE)","v":0},{"$f":"+VLOOKUP(+$A6,'Data Input'!$A$3:$AX$41,7,FALSE)","v":"A"},{"$f":"+VLOOKUP($A6,'Data Input'!$A$3:$AX$41,33,FALSE)","v":0},{"$f":"+VLOOKUP($A6,'Data Input'!$A$3:$AX$41,34,FALSE)","v":0},{"$f":"+VLOOKUP($A6,'Data Input'!$A$3:$AX$41,35,FALSE)","v":0},null,{"$f":"+VLOOKUP($A6,'Data Input'!$A$3:$AX$41,37,FALSE)","v":0},null,4]
[{"$f":"Classes!A7","v":22},{"$f":"+VLOOKUP(+$A7,'Data Input'!$A$3:$AX$41,2,FALSE)","v":"Moonraker"},{"$f":"+VLOOKUP(+$A7,'Data Input'!$A$3:$AX$41,3,FALSE)","v":"Peter Jeckells"},{"$f":"+VLOOKUP(+$A7,'Data Input'!$A$3:$AX$41,4,FALSE)","v":"29 6"},{"$f":"+VLOOKUP(+$A7,'Data Input'!$A$3:$AX$41,5,FALSE)","v":2},{"$f":"+VLOOKUP(+$A7,'Data Input'!$A$3:$AX$41,6,FALSE)","v":0},{"$f":"+VLOOKUP(+$A7,'Data Input'!$A$3:$AX$41,7,FALSE)","v":"A"},{"$f":"+VLOOKUP($A7,'Data Input'!$A$3:$AX$41,33,FALSE)","v":0},{"$f":"+VLOOKUP($A7,'Data Input'!$A$3:$AX$41,34,FALSE)","v":0},{"$f":"+VLOOKUP($A7,'Data Input'!$A$3:$AX$41,35,FALSE)","v":0},null,{"$f":"+VLOOKUP($A7,'Data Input'!$A$3:$AX$41,37,FALSE)","v":0},null,{"$f":"N6+1","v":5}]
[{"$f":"Classes!A8","v":25},{"$f":"+VLOOKUP(+$A8,'Data Input'!$A$3:$AX$41,2,FALSE)","v":"Melody"},{"$f":"+VLOOKUP(+$A8,'Data Input'!$A$3:$AX$41,3,FALSE)","v":"Mark Wells"},{"$f":"+VLOOKUP(+$A8,'Data Input'!$A$3:$AX$41,4,FALSE)","v":26},{"$f":"+VLOOKUP(+$A8,'Data Input'!$A$3:$AX$41,5,FALSE)","v":-11},{"$f":"+VLOOKUP(+$A8,'Data Input'!$A$3:$AX$41,6,FALSE)","v":0},{"$f":"+VLOOKUP(+$A8,'Data Input'!$A$3:$AX$41,7,FALSE)","v":"B"},{"$f":"+VLOOKUP($A8,'Data Input'!$A$3:$AX$41,33,FALSE)","v":0},{"$f":"+VLOOKUP($A8,'Data Input'!$A$3:$AX$41,34,FALSE)","v":0},{"$f":"+VLOOKUP($A8,'Data Input'!$A$3:$AX$41,35,FALSE)","v":0},null,{"$f":"+VLOOKUP($A8,'Data Input'!$A$3:$AX$41,37,FALSE)","v":0},null,{"$f":"N7+1","v":6}]
[{"$f":"Classes!A9","v":37},{"$f":"+VLOOKUP(+$A9,'Data Input'!$A$3:$AX$41,2,FALSE)","v":"Harrier"},{"$f":"+VLOOKUP(+$A9,'Data Input'!$A$3:$AX$41,3,FALSE)","v":"Jack Copping"},{"$f":"+VLOOKUP(+$A9,'Data Input'!$A$3:$AX$41,4,FALSE)","v":27},{"$f":"+VLOOKUP(+$A9,'Data Input'!$A$3:$AX$41,5,FALSE)","v":-20},{"$f":"+VLOOKUP(+$A9,'Data Input'!$A$3:$AX$41,6,FALSE)","v":0},{"$f":"+VLOOKUP(+$A9,'Data Input'!$A$3:$AX$41,7,FALSE)","v":"B"},{"$f":"+VLOOKUP($A9,'Data Input'!$A$3:$AX$41,33,FALSE)","v":0},{"$f":"+VLOOKUP($A9,'Data Input'!$A$3:$AX$41,34,FALSE)","v":0},{"$f":"+VLOOKUP($A9,'Data Input'!$A$3:$AX$41,35,FALSE)","v":0},null,{"$f":"+VLOOKUP($A9,'Data Input'!$A$3:$AX$41,37,FALSE)","v":0},null,7]
[{"$f":"Classes!A10","v":48},{"$f":"+VLOOKUP(+$A10,'Data Input'!$A$3:$AX$41,2,FALSE)","v":"Sparklet"},{"$f":"+VLOOKUP(+$A10,'Data Input'!$A$3:$AX$41,3,FALSE)","v":"Mike Barnes"},{"$f":"+VLOOKUP(+$A10,'Data Input'!$A$3:$AX$41,4,FALSE)","v":41},{"$f":"+VLOOKUP(+$A10,'Data Input'!$A$3:$AX$41,5,FALSE)","v":9},{"$f":"+VLOOKUP(+$A10,'Data Input'!$A$3:$AX$41,6,FALSE)","v":0},{"$f":"+VLOOKUP(+$A10,'Data Input'!$A$3:$AX$41,7,FALSE)","v":"A"},{"$f":"+VLOOKUP($A10,'Data Input'!$A$3:$AX$41,33,FALSE)","v":0},{"$f":"+VLOOKUP($A10,'Data Input'!$A$3:$AX$41,34,FALSE)","v":0},{"$f":"+VLOOKUP($A10,'Data Input'!$A$3:$AX$41,35,FALSE)","v":0},null,{"$f":"+VLOOKUP($A10,'Data Input'!$A$3:$AX$41,37,FALSE)","v":0},null,8]
[{"$f":"Classes!A11","v":79},{"$f":"+VLOOKUP(+$A11,'Data Input'!$A$3:$AX$41,2,FALSE)","v":"Daisy"},{"$f":"+VLOOKUP(+$A11,'Data Input'!$A$3:$AX$41,3,FALSE)","v":"Tim Ford"},{"$f":"+VLOOKUP(+$A11,'Data Input'!$A$3:$AX$41,4,FALSE)","v":22},{"$f":"+VLOOKUP(+$A11,'Data Input'!$A$3:$AX$41,5,FALSE)","v":-26},{"$f":"+VLOOKUP(+$A11,'Data Input'!$A$3:$AX$41,6,FALSE)","v":0},{"$f":"+VLOOKUP(+$A11,'Data Input'!$A$3:$AX$41,7,FALSE)","v":"C"},{"$f":"+VLOOKUP($A11,'Data Input'!$A$3:$AX$41,33,FALSE)","v":0},{"$f":"+VLOOKUP($A11,'Data Input'!$A$3:$AX$41,34,FALSE)","v":0},{"$f":"+VLOOKUP($A11,'Data Input'!$A$3:$AX$41,35,FALSE)","v":0},null,{"$f":"+VLOOKUP($A11,'Data Input'!$A$3:$AX$41,37,FALSE)","v":0},null,9]
[{"$f":"Classes!A12","v":87},{"$f":"+VLOOKUP(+$A12,'Data Input'!$A$3:$AX$41,2,FALSE)","v":"Modwena"},{"$f":"+VLOOKUP(+$A12,'Data Input'!$A$3:$AX$41,3,FALSE)","v":"Mark Cassidy"},{"$f":"+VLOOKUP(+$A12,'Data Input'!$A$3:$AX$41,4,FALSE)","v":"24 11"},{"$f":"+VLOOKUP(+$A12,'Data Input'!$A$3:$AX$41,5,FALSE)","v":-19},{"$f":"+VLOOKUP(+$A12,'Data Input'!$A$3:$AX$41,6,FALSE)","v":0},{"$f":"+VLOOKUP(+$A12,'Data Input'!$A$3:$AX$41,7,FALSE)","v":"A"},{"$f":"+VLOOKUP($A12,'Data Input'!$A$3:$AX$41,33,FALSE)","v":0},{"$f":"+VLOOKUP($A12,'Data Input'!$A$3:$AX$41,34,FALSE)","v":0},{"$f":"+VLOOKUP($A12,'Data Input'!$A$3:$AX$41,35,FALSE)","v":0},null,{"$f":"+VLOOKUP($A12,'Data Input'!$A$3:$AX$41,37,FALSE)","v":0},null,10]
[{"$f":"Classes!A13","v":98},{"$f":"+VLOOKUP(+$A13,'Data Input'!$A$3:$AX$41,2,FALSE)","v":"Force Four"},{"$f":"+VLOOKUP(+$A13,'Data Input'!$A$3:$AX$41,3,FALSE)","v":"JD Winterton"},{"$f":"+VLOOKUP(+$A13,'Data Input'!$A$3:$AX$41,4,FALSE)","v":"31 6"},{"$f":"+VLOOKUP(+$A13,'Data Input'!$A$3:$AX$41,5,FALSE)","v":-21},{"$f":"+VLOOKUP(+$A13,'Data Input'!$A$3:$AX$41,6,FALSE)","v":"P"},{"$f":"+VLOOKUP(+$A13,'Data Input'!$A$3:$AX$41,7,FALSE)","v":"A"},{"$f":"+VLOOKUP($A13,'Data Input'!$A$3:$AX$41,33,FALSE)","v":0},{"$f":"+VLOOKUP($A13,'Data Input'!$A$3:$AX$41,34,FALSE)","v":0},{"$f":"+VLOOKUP($A13,'Data Input'!$A$3:$AX$41,35,FALSE)","v":0},null,{"$f":"+VLOOKUP($A13,'Data Input'!$A$3:$AX$41,37,FALSE)","v":"P"},null,11]
[{"$f":"Classes!A14","v":141},{"$f":"+VLOOKUP(+$A14,'Data Input'!$A$3:$AX$41,2,FALSE)","v":"Nirvana"},{"$f":"+VLOOKUP(+$A14,'Data Input'!$A$3:$AX$41,3,FALSE)","v":"Dr Michael Claridge"},{"$f":"+VLOOKUP(+$A14,'Data Input'!$A$3:$AX$41,4,FALSE)","v":19},{"$f":"+VLOOKUP(+$A14,'Data Input'!$A$3:$AX$41,5,FALSE)","v":-23},{"$f":"+VLOOKUP(+$A14,'Data Input'!$A$3:$AX$41,6,FALSE)","v":"P"},{"$f":"+VLOOKUP(+$A14,'Data Input'!$A$3:$AX$41,7,FALSE)","v":"C"},{"$f":"+VLOOKUP($A14,'Data Input'!$A$3:$AX$41,33,FALSE)","v":0},{"$f":"+VLOOKUP($A14,'Data Input'!$A$3:$AX$41,34,FALSE)","v":0},{"$f":"+VLOOKUP($A14,'Data Input'!$A$3:$AX$41,35,FALSE)","v":0},null,{"$f":"+VLOOKUP($A14,'Data Input'!$A$3:$AX$41,37,FALSE)","v":"P"},null,12]
[{"$f":"Classes!A15","v":152},{"$f":"+VLOOKUP(+$A15,'Data Input'!$A$3:$AX$41,2,FALSE)","v":"Sabrina 2"},{"$f":"+VLOOKUP(+$A15,'Data Input'!$A$3:$AX$41,3,FALSE)","v":"John Holmes"},{"$f":"+VLOOKUP(+$A15,'Data Input'!$A$3:$AX$41,4,FALSE)","v":29},{"$f":"+VLOOKUP(+$A15,'Data Input'!$A$3:$AX$41,5,FALSE)","v":-5},{"$f":"+VLOOKUP(+$A15,'Data Input'!$A$3:$AX$41,6,FALSE)","v":0},{"$f":"+VLOOKUP(+$A15,'Data Input'!$A$3:$AX$41,7,FALSE)","v":"A"},{"$f":"+VLOOKUP($A15,'Data Input'!$A$3:$AX$41,33,FALSE)","v":0},{"$f":"+VLOOKUP($A15,'Data Input'!$A$3:$AX$41,34,FALSE)","v":0},{"$f":"+VLOOKUP($A15,'Data Input'!$A$3:$AX$41,35,FALSE)","v":0},null,{"$f":"+VLOOKUP($A15,'Data Input'!$A$3:$AX$41,37,FALSE)","v":0},null,{"$f":"N14+1","v":13}]
[{"$f":"Classes!A16","v":155},{"$f":"+VLOOKUP(+$A16,'Data Input'!$A$3:$AX$41,2,FALSE)","v":"Stratus"},{"$f":"+VLOOKUP(+$A16,'Data Input'!$A$3:$AX$41,3,FALSE)","v":"Rhiannon Alger"},{"$f":"+VLOOKUP(+$A16,'Data Input'!$A$3:$AX$41,4,FALSE)","v":"22 10"},{"$f":"+VLOOKUP(+$A16,'Data Input'!$A$3:$AX$41,5,FALSE)","v":-16},{"$f":"+VLOOKUP(+$A16,'Data Input'!$A$3:$AX$41,6,FALSE)","v":0},{"$f":"+VLOOKUP(+$A16,'Data Input'!$A$3:$AX$41,7,FALSE)","v":"A"},{"$f":"+VLOOKUP($A16,'Data Input'!$A$3:$AX$41,33,FALSE)","v":0},{"$f":"+VLOOKUP($A16,'Data Input'!$A$3:$AX$41,34,FALSE)","v":0},{"$f":"+VLOOKUP($A16,'Data Input'!$A$3:$AX$41,35,FALSE)","v":0},null,{"$f":"+VLOOKUP($A16,'Data Input'!$A$3:$AX$41,37,FALSE)","v":0},null,14]
[{"$f":"Classes!A17","v":179},{"$f":"+VLOOKUP(+$A17,'Data Input'!$A$3:$AX$41,2,FALSE)","v":"Waxwing"},{"$f":"+VLOOKUP(+$A17,'Data Input'!$A$3:$AX$41,3,FALSE)","v":"Robin Clayton"},{"$f":"+VLOOKUP(+$A17,'Data Input'!$A$3:$AX$41,4,FALSE)","v":27},{"$f":"+VLOOKUP(+$A17,'Data Input'!$A$3:$AX$41,5,FALSE)","v":-8},{"$f":"+VLOOKUP(+$A17,'Data Input'!$A$3:$AX$41,6,FALSE)","v":0},{"$f":"+VLOOKUP(+$A17,'Data Input'!$A$3:$AX$41,7,FALSE)","v":"B"},{"$f":"+VLOOKUP($A17,'Data Input'!$A$3:$AX$41,33,FALSE)","v":0},{"$f":"+VLOOKUP($A17,'Data Input'!$A$3:$AX$41,34,FALSE)","v":0},{"$f":"+VLOOKUP($A17,'Data Input'!$A$3:$AX$41,35,FALSE)","v":0},null,{"$f":"+VLOOKUP($A17,'Data Input'!$A$3:$AX$41,37,FALSE)","v":0},null,15]
[{"$f":"Classes!A18","v":199},{"$f":"+VLOOKUP(+$A18,'Data Input'!$A$3:$AX$41,2,FALSE)","v":"Morning Calm"},{"$f":"+VLOOKUP(+$A18,'Data Input'!$A$3:$AX$41,3,FALSE)","v":"Bill Clarke"},{"$f":"+VLOOKUP(+$A18,'Data Input'!$A$3:$AX$41,4,FALSE)","v":26},{"$f":"+VLOOKUP(+$A18,'Data Input'!$A$3:$AX$41,5,FALSE)","v":-8},{"$f":"+VLOOKUP(+$A18,'Data Input'!$A$3:$AX$41,6,FALSE)","v":0},{"$f":"+VLOOKUP(+$A18,'Data Input'!$A$3:$AX$41,7,FALSE)","v":"B"},{"$f":"+VLOOKUP($A18,'Data Input'!$A$3:$AX$41,33,FALSE)","v":0},{"$f":"+VLOOKUP($A18,'Data Input'!$A$3:$AX$41,34,FALSE)","v":0},{"$f":"+VLOOKUP($A18,'Data Input'!$A$3:$AX$41,35,FALSE)","v":0},null,{"$f":"+VLOOKUP($A18,'Data Input'!$A$3:$AX$41,37,FALSE)","v":0},null,16]
[{"$f":"Classes!A19","v":216},{"$f":"+VLOOKUP(+$A19,'Data Input'!$A$3:$AX$41,2,FALSE)","v":"Tamara"},{"$f":"+VLOOKUP(+$A19,'Data Input'!$A$3:$AX$41,3,FALSE)","v":"Nick Heath"},{"$f":"+VLOOKUP(+$A19,'Data Input'!$A$3:$AX$41,4,FALSE)","v":"24 8"},{"$f":"+VLOOKUP(+$A19,'Data Input'!$A$3:$AX$41,5,FALSE)","v":-16},{"$f":"+VLOOKUP(+$A19,'Data Input'!$A$3:$AX$41,6,FALSE)","v":0},{"$f":"+VLOOKUP(+$A19,'Data Input'!$A$3:$AX$41,7,FALSE)","v":"A"},{"$f":"+VLOOKUP($A19,'Data Input'!$A$3:$AX$41,33,FALSE)","v":0},{"$f":"+VLOOKUP($A19,'Data Input'!$A$3:$AX$41,34,FALSE)","v":0},{"$f":"+VLOOKUP($A19,'Data Input'!$A$3:$AX$41,35,FALSE)","v":0},null,{"$f":"+VLOOKUP($A19,'Data Input'!$A$3:$AX$41,37,FALSE)","v":0},null,17]
[{"$f":"Classes!A20","v":217},{"$f":"+VLOOKUP(+$A20,'Data Input'!$A$3:$AX$41,2,FALSE)","v":"Melinda"},{"$f":"+VLOOKUP(+$A20,'Data Input'!$A$3:$AX$41,3,FALSE)","v":"Paul Howes"},{"$f":"+VLOOKUP(+$A20,'Data Input'!$A$3:$AX$41,4,FALSE)","v":"27 11"},{"$f":"+VLOOKUP(+$A20,'Data Input'!$A$3:$AX$41,5,FALSE)","v":1},{"$f":"+VLOOKUP(+$A20,'Data Input'!$A$3:$AX$41,6,FALSE)","v":0},{"$f":"+VLOOKUP(+$A20,'Data Input'!$A$3:$AX$41,7,FALSE)","v":"A"},{"$f":"+VLOOKUP($A20,'Data Input'!$A$3:$AX$41,33,FALSE)","v":0},{"$f":"+VLOOKUP($A20,'Data Input'!$A$3:$AX$41,34,FALSE)","v":0},{"$f":"+VLOOKUP($A20,'Data Input'!$A$3:$AX$41,35,FALSE)","v":0},null,{"$f":"+VLOOKUP($A20,'Data Input'!$A$3:$AX$41,37,FALSE)","v":0},null,18]
[{"$f":"Classes!A21","v":218},{"$f":"+VLOOKUP(+$A21,'Data Input'!$A$3:$AX$41,2,FALSE)","v":"Mystery"},{"$f":"+VLOOKUP(+$A21,'Data Input'!$A$3:$AX$41,3,FALSE)","v":"Matt Ford"},{"$f":"+VLOOKUP(+$A21,'Data Input'!$A$3:$AX$41,4,FALSE)","v":26},{"$f":"+VLOOKUP(+$A21,'Data Input'!$A$3:$AX$41,5,FALSE)","v":-8},{"$f":"+VLOOKUP(+$A21,'Data Input'!$A$3:$AX$41,6,FALSE)","v":0},{"$f":"+VLOOKUP(+$A21,'Data Input'!$A$3:$AX$41,7,FALSE)","v":"B"},{"$f":"+VLOOKUP($A21,'Data Input'!$A$3:$AX$41,33,FALSE)","v":0},{"$f":"+VLOOKUP($A21,'Data Input'!$A$3:$AX$41,34,FALSE)","v":0},{"$f":"+VLOOKUP($A21,'Data Input'!$A$3:$AX$41,35,FALSE)","v":0},null,{"$f":"+VLOOKUP($A21,'Data Input'!$A$3:$AX$41,37,FALSE)","v":0},null,19]
[{"$f":"Classes!A22","v":219},{"$f":"+VLOOKUP(+$A22,'Data Input'!$A$3:$AX$41,2,FALSE)","v":"Farthing"},{"$f":"+VLOOKUP(+$A22,'Data Input'!$A$3:$AX$41,3,FALSE)","v":"Melanie Farrar"},{"$f":"+VLOOKUP(+$A22,'Data Input'!$A$3:$AX$41,4,FALSE)","v":36},{"$f":"+VLOOKUP(+$A22,'Data Input'!$A$3:$AX$41,5,FALSE)","v":3},{"$f":"+VLOOKUP(+$A22,'Data Input'!$A$3:$AX$41,6,FALSE)","v":0},{"$f":"+VLOOKUP(+$A22,'Data Input'!$A$3:$AX$41,7,FALSE)","v":"A"},{"$f":"+VLOOKUP($A22,'Data Input'!$A$3:$AX$41,33,FALSE)","v":0},{"$f":"+VLOOKUP($A22,'Data Input'!$A$3:$AX$41,34,FALSE)","v":0},{"$f":"+VLOOKUP($A22,'Data Input'!$A$3:$AX$41,35,FALSE)","v":0},null,{"$f":"+VLOOKUP($A22,'Data Input'!$A$3:$AX$41,37,FALSE)","v":0},null,20]
[{"$f":"+COUNT(A3:A22)","v":20}]

{"sheet":"Classes C","index":7,"n_rows":15,"n_cols":14,"rows_kept":15,"cut":false,"hidden":false,"merged":[]}
["Wilberforce Smith",null,null,null,null,null,null,null,"Corrected"]
["No","Yacht","Skipper","Length","H/C","P","Class","H","M","S",null,"Pos"," "]
[{"$f":"'Data Input'!A3","v":7},{"$f":"+VLOOKUP(+$A3,'Data Input'!$A$3:$AX$41,2,FALSE)","v":"Forester"},{"$f":"+VLOOKUP(+$A3,'Data Input'!$A$3:$AX$41,3,FALSE)","v":"Will Bentall"},{"$f":"+VLOOKUP(+$A3,'Data Input'!$A$3:$AX$41,4,FALSE)","v":"32 6"},{"$f":"+VLOOKUP(+$A3,'Data Input'!$A$3:$AX$41,5,FALSE)","v":-8},{"$f":"+VLOOKUP(+$A3,'Data Input'!$A$3:$AX$41,6,FALSE)","v":0},{"$f":"+VLOOKUP(+$A3,'Data Input'!$A$3:$AX$41,7,FALSE)","v":"A"},{"$f":"+VLOOKUP($A3,'Data Input'!$A$3:$AX$41,33,FALSE)","v":0},{"$f":"+VLOOKUP($A3,'Data Input'!$A$3:$AX$41,34,FALSE)","v":0},{"$f":"+VLOOKUP($A3,'Data Input'!$A$3:$AX$41,35,FALSE)","v":0},null,{"$f":"+VLOOKUP($A3,'Data Input'!$A$3:$AX$41,37,FALSE)","v":0},null,"FIRST"]
[{"$f":"'Data Input'!A4","v":10},{"$f":"+VLOOKUP(+$A4,'Data Input'!$A$3:$AX$41,2,FALSE)","v":"Flight"},{"$f":"+VLOOKUP(+$A4,'Data Input'!$A$3:$AX$41,3,FALSE)","v":"Joe Farrow"},{"$f":"+VLOOKUP(+$A4,'Data Input'!$A$3:$AX$41,4,FALSE)","v":"29 11"},{"$f":"+VLOOKUP(+$A4,'Data Input'!$A$3:$AX$41,5,FALSE)","v":-9},{"$f":"+VLOOKUP(+$A4,'Data Input'!$A$3:$AX$41,6,FALSE)","v":0},{"$f":"+VLOOKUP(+$A4,'Data Input'!$A$3:$AX$41,7,FALSE)","v":"A"},{"$f":"+VLOOKUP($A4,'Data Input'!$A$3:$AX$41,33,FALSE)","v":0},{"$f":"+VLOOKUP($A4,'Data Input'!$A$3:$AX$41,34,FALSE)","v":0},{"$f":"+VLOOKUP($A4,'Data Input'!$A$3:$AX$41,35,FALSE)","v":0},null,{"$f":"+VLOOKUP($A4,'Data Input'!$A$3:$AX$41,37,FALSE)","v":0},null,"SECOND"]
[{"$f":"'Data Input'!A5","v":13},{"$f":"+VLOOKUP(+$A5,'Data Input'!$A$3:$AX$41,2,FALSE)","v":"Ladybird"},{"$f":"+VLOOKUP(+$A5,'Data Input'!$A$3:$AX$41,3,FALSE)","v":"Ben Knight"},{"$f":"+VLOOKUP(+$A5,'Data Input'!$A$3:$AX$41,4,FALSE)","v":34},{"$f":"+VLOOKUP(+$A5,'Data Input'!$A$3:$AX$41,5,FALSE)","v":1},{"$f":"+VLOOKUP(+$A5,'Data Input'!$A$3:$AX$41,6,FALSE)","v":0},{"$f":"+VLOOKUP(+$A5,'Data Input'!$A$3:$AX$41,7,FALSE)","v":"A"},{"$f":"+VLOOKUP($A5,'Data Input'!$A$3:$AX$41,33,FALSE)","v":0},{"$f":"+VLOOKUP($A5,'Data Input'!$A$3:$AX$41,34,FALSE)","v":0},{"$f":"+VLOOKUP($A5,'Data Input'!$A$3:$AX$41,35,FALSE)","v":0},null,{"$f":"+VLOOKUP($A5,'Data Input'!$A$3:$AX$41,37,FALSE)","v":0},null,"THIRD"]
[{"$f":"'Data Input'!A6","v":15},{"$f":"+VLOOKUP(+$A6,'Data Input'!$A$3:$AX$41,2,FALSE)","v":"Pirate"},{"$f":"+VLOOKUP(+$A6,'Data Input'!$A$3:$AX$41,3,FALSE)","v":"Kevin Thomas"},{"$f":"+VLOOKUP(+$A6,'Data Input'!$A$3:$AX$41,4,FALSE)","v":29},{"$f":"+VLOOKUP(+$A6,'Data Input'!$A$3:$AX$41,5,FALSE)","v":-7},{"$f":"+VLOOKUP(+$A6,'Data Input'!$A$3:$AX$41,6,FALSE)","v":0},{"$f":"+VLOOKUP(+$A6,'Data Input'!$A$3:$AX$41,7,FALSE)","v":"A"},{"$f":"+VLOOKUP($A6,'Data Input'!$A$3:$AX$41,33,FALSE)","v":0},{"$f":"+VLOOKUP($A6,'Data Input'!$A$3:$AX$41,34,FALSE)","v":0},{"$f":"+VLOOKUP($A6,'Data Input'!$A$3:$AX$41,35,FALSE)","v":0},null,{"$f":"+VLOOKUP($A6,'Data Input'!$A$3:$AX$41,37,FALSE)","v":0},null,4]
[{"$f":"'Data Input'!A7","v":22},{"$f":"+VLOOKUP(+$A7,'Data Input'!$A$3:$AX$41,2,FALSE)","v":"Moonraker"},{"$f":"+VLOOKUP(+$A7,'Data Input'!$A$3:$AX$41,3,FALSE)","v":"Peter Jeckells"},{"$f":"+VLOOKUP(+$A7,'Data Input'!$A$3:$AX$41,4,FALSE)","v":"29 6"},{"$f":"+VLOOKUP(+$A7,'Data Input'!$A$3:$AX$41,5,FALSE)","v":2},{"$f":"+VLOOKUP(+$A7,'Data Input'!$A$3:$AX$41,6,FALSE)","v":0},{"$f":"+VLOOKUP(+$A7,'Data Input'!$A$3:$AX$41,7,FALSE)","v":"A"},{"$f":"+VLOOKUP($A7,'Data Input'!$A$3:$AX$41,33,FALSE)","v":0},{"$f":"+VLOOKUP($A7,'Data Input'!$A$3:$AX$41,34,FALSE)","v":0},{"$f":"+VLOOKUP($A7,'Data Input'!$A$3:$AX$41,35,FALSE)","v":0},null,{"$f":"+VLOOKUP($A7,'Data Input'!$A$3:$AX$41,37,FALSE)","v":0},null,{"$f":"N6+1","v":5}]
[{"$f":"'Data Input'!A8","v":25},{"$f":"+VLOOKUP(+$A8,'Data Input'!$A$3:$AX$41,2,FALSE)","v":"Melody"},{"$f":"+VLOOKUP(+$A8,'Data Input'!$A$3:$AX$41,3,FALSE)","v":"Mark Wells"},{"$f":"+VLOOKUP(+$A8,'Data Input'!$A$3:$AX$41,4,FALSE)","v":26},{"$f":"+VLOOKUP(+$A8,'Data Input'!$A$3:$AX$41,5,FALSE)","v":-11},{"$f":"+VLOOKUP(+$A8,'Data Input'!$A$3:$AX$41,6,FALSE)","v":0},{"$f":"+VLOOKUP(+$A8,'Data Input'!$A$3:$AX$41,7,FALSE)","v":"B"},{"$f":"+VLOOKUP($A8,'Data Input'!$A$3:$AX$41,33,FALSE)","v":0},{"$f":"+VLOOKUP($A8,'Data Input'!$A$3:$AX$41,34,FALSE)","v":0},{"$f":"+VLOOKUP($A8,'Data Input'!$A$3:$AX$41,35,FALSE)","v":0},null,{"$f":"+VLOOKUP($A8,'Data Input'!$A$3:$AX$41,37,FALSE)","v":0},null,{"$f":"N7+1","v":6}]
[{"$f":"'Data Input'!A9","v":37},{"$f":"+VLOOKUP(+$A9,'Data Input'!$A$3:$AX$41,2,FALSE)","v":"Harrier"},{"$f":"+VLOOKUP(+$A9,'Data Input'!$A$3:$AX$41,3,FALSE)","v":"Jack Copping"},{"$f":"+VLOOKUP(+$A9,'Data Input'!$A$3:$AX$41,4,FALSE)","v":27},{"$f":"+VLOOKUP(+$A9,'Data Input'!$A$3:$AX$41,5,FALSE)","v":-20},{"$f":"+VLOOKUP(+$A9,'Data Input'!$A$3:$AX$41,6,FALSE)","v":0},{"$f":"+VLOOKUP(+$A9,'Data Input'!$A$3:$AX$41,7,FALSE)","v":"B"},{"$f":"+VLOOKUP($A9,'Data Input'!$A$3:$AX$41,33,FALSE)","v":0},{"$f":"+VLOOKUP($A9,'Data Input'!$A$3:$AX$41,34,FALSE)","v":0},{"$f":"+VLOOKUP($A9,'Data Input'!$A$3:$AX$41,35,FALSE)","v":0},null,{"$f":"+VLOOKUP($A9,'Data Input'!$A$3:$AX$41,37,FALSE)","v":0},null,7]
[{"$f":"'Data Input'!A10","v":48},{"$f":"+VLOOKUP(+$A10,'Data Input'!$A$3:$AX$41,2,FALSE)","v":"Sparklet"},{"$f":"+VLOOKUP(+$A10,'Data Input'!$A$3:$AX$41,3,FALSE)","v":"Mike Barnes"},{"$f":"+VLOOKUP(+$A10,'Data Input'!$A$3:$AX$41,4,FALSE)","v":41},{"$f":"+VLOOKUP(+$A10,'Data Input'!$A$3:$AX$41,5,FALSE)","v":9},{"$f":"+VLOOKUP(+$A10,'Data Input'!$A$3:$AX$41,6,FALSE)","v":0},{"$f":"+VLOOKUP(+$A10,'Data Input'!$A$3:$AX$41,7,FALSE)","v":"A"},{"$f":"+VLOOKUP($A10,'Data Input'!$A$3:$AX$41,33,FALSE)","v":0},{"$f":"+VLOOKUP($A10,'Data Input'!$A$3:$AX$41,34,FALSE)","v":0},{"$f":"+VLOOKUP($A10,'Data Input'!$A$3:$AX$41,35,FALSE)","v":0},null,{"$f":"+VLOOKUP($A10,'Data Input'!$A$3:$AX$41,37,FALSE)","v":0},null,8]
[{"$f":"'Data Input'!A11","v":79},{"$f":"+VLOOKUP(+$A11,'Data Input'!$A$3:$AX$41,2,FALSE)","v":"Daisy"},{"$f":"+VLOOKUP(+$A11,'Data Input'!$A$3:$AX$41,3,FALSE)","v":"Tim Ford"},{"$f":"+VLOOKUP(+$A11,'Data Input'!$A$3:$AX$41,4,FALSE)","v":22},{"$f":"+VLOOKUP(+$A11,'Data Input'!$A$3:$AX$41,5,FALSE)","v":-26},{"$f":"+VLOOKUP(+$A11,'Data Input'!$A$3:$AX$41,6,FALSE)","v":0},{"$f":"+VLOOKUP(+$A11,'Data Input'!$A$3:$AX$41,7,FALSE)","v":"C"},{"$f":"+VLOOKUP($A11,'Data Input'!$A$3:$AX$41,33,FALSE)","v":0},{"$f":"+VLOOKUP($A11,'Data Input'!$A$3:$AX$41,34,FALSE)","v":0},{"$f":"+VLOOKUP($A11,'Data Input'!$A$3:$AX$41,35,FALSE)","v":0},null,{"$f":"+VLOOKUP($A11,'Data Input'!$A$3:$AX$41,37,FALSE)","v":0},null,9]
[{"$f":"'Data Input'!A12","v":87},{"$f":"+VLOOKUP(+$A12,'Data Input'!$A$3:$AX$41,2,FALSE)","v":"Modwena"},{"$f":"+VLOOKUP(+$A12,'Data Input'!$A$3:$AX$41,3,FALSE)","v":"Mark Cassidy"},{"$f":"+VLOOKUP(+$A12,'Data Input'!$A$3:$AX$41,4,FALSE)","v":"24 11"},{"$f":"+VLOOKUP(+$A12,'Data Input'!$A$3:$AX$41,5,FALSE)","v":-19},{"$f":"+VLOOKUP(+$A12,'Data Input'!$A$3:$AX$41,6,FALSE)","v":0},{"$f":"+VLOOKUP(+$A12,'Data Input'!$A$3:$AX$41,7,FALSE)","v":"A"},{"$f":"+VLOOKUP($A12,'Data Input'!$A$3:$AX$41,33,FALSE)","v":0},{"$f":"+VLOOKUP($A12,'Data Input'!$A$3:$AX$41,34,FALSE)","v":0},{"$f":"+VLOOKUP($A12,'Data Input'!$A$3:$AX$41,35,FALSE)","v":0},null,{"$f":"+VLOOKUP($A12,'Data Input'!$A$3:$AX$41,37,FALSE)","v":0},null,10]
[{"$f":"'Data Input'!A13","v":98},{"$f":"+VLOOKUP(+$A13,'Data Input'!$A$3:$AX$41,2,FALSE)","v":"Force Four"},{"$f":"+VLOOKUP(+$A13,'Data Input'!$A$3:$AX$41,3,FALSE)","v":"JD Winterton"},{"$f":"+VLOOKUP(+$A13,'Data Input'!$A$3:$AX$41,4,FALSE)","v":"31 6"},{"$f":"+VLOOKUP(+$A13,'Data Input'!$A$3:$AX$41,5,FALSE)","v":-21},{"$f":"+VLOOKUP(+$A13,'Data Input'!$A$3:$AX$41,6,FALSE)","v":"P"},{"$f":"+VLOOKUP(+$A13,'Data Input'!$A$3:$AX$41,7,FALSE)","v":"A"},{"$f":"+VLOOKUP($A13,'Data Input'!$A$3:$AX$41,33,FALSE)","v":0},{"$f":"+VLOOKUP($A13,'Data Input'!$A$3:$AX$41,34,FALSE)","v":0},{"$f":"+VLOOKUP($A13,'Data Input'!$A$3:$AX$41,35,FALSE)","v":0},null,{"$f":"+VLOOKUP($A13,'Data Input'!$A$3:$AX$41,37,FALSE)","v":"P"},null,11]
[{"$f":"'Data Input'!A14","v":141},{"$f":"+VLOOKUP(+$A14,'Data Input'!$A$3:$AX$41,2,FALSE)","v":"Nirvana"},{"$f":"+VLOOKUP(+$A14,'Data Input'!$A$3:$AX$41,3,FALSE)","v":"Dr Michael Claridge"},{"$f":"+VLOOKUP(+$A14,'Data Input'!$A$3:$AX$41,4,FALSE)","v":19},{"$f":"+VLOOKUP(+$A14,'Data Input'!$A$3:$AX$41,5,FALSE)","v":-23},{"$f":"+VLOOKUP(+$A14,'Data Input'!$A$3:$AX$41,6,FALSE)","v":"P"},{"$f":"+VLOOKUP(+$A14,'Data Input'!$A$3:$AX$41,7,FALSE)","v":"C"},{"$f":"+VLOOKUP($A14,'Data Input'!$A$3:$AX$41,33,FALSE)","v":0},{"$f":"+VLOOKUP($A14,'Data Input'!$A$3:$AX$41,34,FALSE)","v":0},{"$f":"+VLOOKUP($A14,'Data Input'!$A$3:$AX$41,35,FALSE)","v":0},null,{"$f":"+VLOOKUP($A14,'Data Input'!$A$3:$AX$41,37,FALSE)","v":"P"},null,12]
[{"$f":"+COUNT(A3:A14)","v":12}]