{"text_format":"1","workbook":"xlsx","n_sheets":8,"sheets":["Sam's Entry sheet","Data Input","YNR","Moonraker","Classes","Classes A","Classes B","Classes C"],"not_rendered":{"charts":0,"images":0,"macros":0,"external_links":0,"defined_names":16,"comments":0,"pivot_tables":0},"unopened":[],"bounds":{"document_bytes":16777216,"sheet_cells":100000,"rows_first":2000,"rows_last":500,"rows_between":2000,"halvings":0,"cell_chars":16384,"cell_head_chars":4096},"cells_cut":0,"cells_raw":0,"read":"whole","date_system":"1900"}

{"sheet":"Sam's Entry sheet","index":0,"n_rows":42,"n_cols":7,"rows_kept":42,"cut":false,"hidden":false,"merged":[]}
["No","Yacht","Skipper","Length","H/C","P"]
[null,null,null,null,null,null,"Do not enter data on row 2 of this sheet."]
[7,"Forester","Will Bentall","32 6",-8]
[10,"Flight","Joe Farrow","29 11",-9]
[13,"Ladybird","Ben Knight",34,1]
[15,"Pirate","Kevin Thomas",29,-7]
{"$rows_left_out":37}
{"sheet":"Data Input","index":1,"n_rows":44,"n_cols":50,"rows_kept":44,"cut":false,"hidden":false,"merged":[]}
["No","Yacht","Skipper","Length","H/C","P","Class",null,"Start",null,null,"Out 1",null,null,"In 1",null,null,"Out 2",null,null,"In 2",null,null,"Finish",null,null,null,"Elapsed",null,null,"Pos",null,null,"Corrected",null,null,"Pos",null,"Bridge1","Bridge 2","Bridge T","T","T-B elapsed","Corr"]
[null,null,null,null,null,null,null,"H","M","S","H","M","S","H","M","S","H","M","S","H","M","S","H","M","S",null,"H","M","S",null,null," ","H","M","S",null,null," ","Seconds","Seconds","Seconds","Seconds","Seconds","Seconds"]
[{"$f":"'Sam''s Entry sheet'!A3","v":7},{"$f":"'Sam''s Entry sheet'!B3","v":"Forester"},{"$f":"'Sam''s Entry sheet'!C3","v":"Will Bentall"},{"$f":"'Sam''s Entry sheet'!D3","v":"32 6"},{"$f":"'Sam''s Entry sheet'!E3","v":-8},{"$f":"'Sam''s Entry sheet'!F3","v":0},{"$f":"IF(D3=0,\"\",IF(D3<25,\"C\",IF(D3<28.01,\"B\",\"A\")))","v":"A"},null,null,null,null,null,null,null,null,null,null,null,null,null,null,null,null,null,null,null,{"$f":"INT(AQ3/3600)","v":0},{"$f":"INT((AQ3-AA3*3600)/60)","v":0},{"$f":"AQ3-(AA3*3600+AB3*60)","v":0},null,{"$f":"+AT3","v":0},null,{"$f":"INT(AR3/3600)","v":0},{"$f":"INT((AR3-AG3*3600)/60)","v":0},{"$f":"AR3-(AG3*3600+AH3*60)","v":0},null,{"$f":"+AW3","v":0},null,{"$f":"(P3+O3*60+N3*3600)-(M3+L3*60+K3*3600)","v":0},{"$f":"(V3+U3*60+T3*3600)-(S3+R3*60+Q3*3600)","v":0},{"$f":"AM3+AN3","v":0},{"$f":"(Y3+X3*60+W3*3600)-(J3+I3*60+H3*3600)","v":0},{"$f":"ABS(AP3-AO3)","v":0},{"$f":"AQ3*(0.01*(100+E3))","v":0},{"$f":"+IF(F3=\"\",AQ3,500000)","v":500000},{"$f":"IF(F3=\"\",+RANK(AS3,$AS$3:$AS$41,1),+F3)","v":0},{"$f":"+IF(AT3<4,\"Trophy\",\"\")","v":"Trophy"},{"$f":"+IF(F3=\"\",AR3,500000)","v":500000},{"$f":"IF(F3=\"\",+RANK(AV3,$AV$3:$AV$41,1),+F3)","v":0},{"$f":"+IF(AW3<4,\"Trophy\",\"\")","v":"Trophy"}]
[{"$f":"'Sam''s Entry sheet'!A4","v":10},{"$f":"'Sam''s Entry sheet'!B4","v":"Flight"},{"$f":"'Sam''s Entry sheet'!C4","v":"Joe Farrow"},{"$f":"'Sam''s Entry sheet'!D4","v":"29 11"},{"$f":"'Sam''s Entry sheet'!E4","v":-9},{"$f":"'Sam''s Entry sheet'!F4","v":0},"A",null,null,null,null,null,null,null,null,null,null,null,null,null,null,null,null,null,null,null,0,0,0,null,0,null,0,0,0,null,0,null,0,0,0,0,0,0,500000,0,"Trophy",500000,0,"Trophy"]
[{"$f":"'Sam''s Entry sheet'!A5","v":13},{"$f":"'Sam''s Entry sheet'!B5","v":"Ladybird"},{"$f":"'Sam''s Entry sheet'!C5","v":"Ben Knight"},{"$f":"'Sam''s Entry sheet'!D5","v":34},{"$f":"'Sam''s Entry sheet'!E5","v":1},{"$f":"'Sam''s Entry sheet'!F5","v":0},"A",null,null,null,null,null,null,null,null,null,null,null,null,null,null,null,null,null,null,null,0,0,0,null,0,null,0,0,0,null,0,null,0,0,0,0,0,0,500000,0,"Trophy",500000,0,"Trophy"]
[{"$f":"'Sam''s Entry sheet'!A6","v":15},{"$f":"'Sam''s Entry sheet'!B6","v":"Pirate"},{"$f":"'Sam''s Entry sheet'!C6","v":"Kevin Thomas"},{"$f":"'Sam''s Entry sheet'!D6","v":29},{"$f":"'Sam''s Entry sheet'!E6","v":-7},{"$f":"'Sam''s Entry sheet'!F6","v":0},{"$f":"IF(D6=0,\"\",IF(D6<25,\"C\",IF(D6<28.01,\"B\",\"A\")))","v":"A"},null,null,null,null,null,null,null,null,null,null,null,null,null,null,null,null,null,null,null,0,0,0,null,0,null,0,0,0,null,0,null,0,0,0,0,0,0,500000,0,"Trophy",500000,0,"Trophy"]
{"$rows_left_out":39}
{"sheet":"YNR","index":2,"n_rows":42,"n_cols":14,"rows_kept":42,"cut":false,"hidden":false,"merged":[]}
[null,null,null,null,null,null,null,null,"Corrected"]
["No","Yacht","Skipper","Length","H/C","P","Class","H","M","S",null,"Pos"]
[{"$f":"'Data Input'!A3","v":7},{"$f":"+VLOOKUP(+$A3,'Data Input'!$A$3:$AX$41,2,FALSE)","v":"Forester"},{"$f":"+VLOOKUP(+$A3,'Data Input'!$A$3:$AX$41,3,FALSE)","v":"Will Bentall"},{"$f":"+VLOOKUP(+$A3,'Data Input'!$A$3:$AX$41,4,FALSE)","v":"32 6"},{"$f":"+VLOOKUP(+$A3,'Data Input'!$A$3:$AX$41,5,FALSE)","v":-8},{"$f":"+VLOOKUP(+$A3,'Data Input'!$A$3:$AX$41,6,FALSE)","v":0},{"$f":"+VLOOKUP(+$A3,'Data Input'!$A$3:$AX$41,7,FALSE)","v":"A"},{"$f":"+VLOOKUP($A3,'Data Input'!$A$3:$AX$41,33,FALSE)","v":0},{"$f":"+VLOOKUP($A3,'Data Input'!$A$3:$AX$41,34,FALSE)","v":0},{"$f":"+VLOOKUP($A3,'Data Input'!$A$3:$AX$41,35,FALSE)","v":0},null,{"$f":"+VLOOKUP($A3,'Data Input'!$A$3:$AX$41,37,FALSE)","v":0},null,"FIRST"]
[{"$f":"'Data Input'!A4","v":10},{"$f":"+VLOOKUP(+$A4,'Data Input'!$A$3:$AX$41,2,FALSE)","v":"Flight"},{"$f":"+VLOOKUP(+$A4,'Data Input'!$A$3:$AX$41,3,FALSE)","v":"Joe Farrow"},{"$f":"+VLOOKUP(+$A4,'Data Input'!$A$3:$AX$41,4,FALSE)","v":"29 11"},{"$f":"+VLOOKUP(+$A4,'Data Input'!$A$3:$AX$41,5,FALSE)","v":-9},{"$f":"+VLOOKUP(+$A4,'Data Input'!$A$3:$AX$41,6,FALSE)","v":0},{"$f":"+VLOOKUP(+$A4,'Data Input'!$A$3:$AX$41,7,FALSE)","v":"A"},{"$f":"+VLOOKUP($A4,'Data Input'!$A$3:$AX$41,33,FALSE)","v":0},{"$f":"+VLOOKUP($A4,'Data Input'!$A$3:$AX$41,34,FALSE)","v":0},{"$f":"+VLOOKUP($A4,'Data Input'!$A$3:$AX$41,35,FALSE)","v":0},null,{"$f":"+VLOOKUP($A4,'Data Input'!$A$3:$AX$41,37,FALSE)","v":0},null,"SECOND"]
[{"$f":"'Data Input'!A5","v":13},{"$f":"+VLOOKUP(+$A5,'Data Input'!$A$3:$AX$41,2,FALSE)","v":"Ladybird"},{"$f":"+VLOOKUP(+$A5,'Data Input'!$A$3:$AX$41,3,FALSE)","v":"Ben Knight"},{"$f":"+VLOOKUP(+$A5,'Data Input'!$A$3:$AX$41,4,FALSE)","v":34},{"$f":"+VLOOKUP(+$A5,'Data Input'!$A$3:$AX$41,5,FALSE)","v":1},{"$f":"+VLOOKUP(+$A5,'Data Input'!$A$3:$AX$41,6,FALSE)","v":0},{"$f":"+VLOOKUP(+$A5,'Data Input'!$A$3:$AX$41,7,FALSE)","v":"A"},{"$f":"+VLOOKUP($A5,'Data Input'!$A$3:$AX$41,33,FALSE)","v":0},{"$f":"+VLOOKUP($A5,'Data Input'!$A$3:$AX$41,34,FALSE)","v":0},{"$f":"+VLOOKUP($A5,'Data Input'!$A$3:$AX$41,35,FALSE)","v":0},null,{"$f":"+VLOOKUP($A5,'Data Input'!$A$3:$AX$41,37,FALSE)","v":0},null,"THIRD"]
[{"$f":"'Data Input'!A6","v":15},{"$f":"+VLOOKUP(+$A6,'Data Input'!$A$3:$AX$41,2,FALSE)","v":"Pirate"},{"$f":"+VLOOKUP(+$A6,'Data Input'!$A$3:$AX$41,3,FALSE)","v":"Kevin Thomas"},{"$f":"+VLOOKUP(+$A6,'Data Input'!$A$3:$AX$41,4,FALSE)","v":29},{"$f":"+VLOOKUP(+$A6,'Data Input'!$A$3:$AX$41,5,FALSE)","v":-7},{"$f":"+VLOOKUP(+$A6,'Data Input'!$A$3:$AX$41,6,FALSE)","v":0},{"$f":"+VLOOKUP(+$A6,'Data Input'!$A$3:$AX$41,7,FALSE)","v":"A"},{"$f":"+VLOOKUP($A6,'Data Input'!$A$3:$AX$41,33,FALSE)","v":0},{"$f":"+VLOOKUP($A6,'Data Input'!$A$3:$AX$41,34,FALSE)","v":0},{"$f":"+VLOOKUP($A6,'Data Input'!$A$3:$AX$41,35,FALSE)","v":0},null,{"$f":"+VLOOKUP($A6,'Data Input'!$A$3:$AX$41,37,FALSE)","v":0},null,4]
{"$rows_left_out":37}
{"sheet":"Moonraker","index":3,"n_rows":42,"n_cols":14,"rows_kept":42,"cut":false,"hidden":false,"merged":[]}
[null,null,null,null,null,null,null,null,"Elapsed"]
["No","Yacht","Skipper","Length","H/C","P","Class","H","M","S",null,"Pos"," "]
[{"$f":"'Data Input'!A3","v":7},{"$f":"+VLOOKUP(+$A3,'Data Input'!$A$3:$AX$41,2,FALSE)","v":"Forester"},{"$f":"+VLOOKUP(+$A3,'Data Input'!$A$3:$AX$41,3,FALSE)","v":"Will Bentall"},{"$f":"+VLOOKUP(+$A3,'Data Input'!$A$3:$AX$41,4,FALSE)","v":"32 6"},{"$f":"+VLOOKUP(+$A3,'Data Input'!$A$3:$AX$41,5,FALSE)","v":-8},{"$f":"+VLOOKUP(+$A3,'Data Input'!$A$3:$AX$41,6,FALSE)","v":0},{"$f":"+VLOOKUP(+$A3,'Data Input'!$A$3:$AX$41,7,FALSE)","v":"A"},{"$f":"+VLOOKUP($A3,'Data Input'!$A$3:$AX$41,27,FALSE)","v":0},{"$f":"+VLOOKUP($A3,'Data Input'!$A$3:$AX$41,28,FALSE)","v":0},{"$f":"+VLOOKUP($A3,'Data Input'!$A$3:$AX$41,29,FALSE)","v":0},null,{"$f":"+VLOOKUP($A3,'Data Input'!$A$3:$AX$41,31,FALSE)","v":0},null,"FIRST"]
[{"$f":"'Data Input'!A4","v":10},{"$f":"+VLOOKUP(+$A4,'Data Input'!$A$3:$AX$41,2,FALSE)","v":"Flight"},{"$f":"+VLOOKUP(+$A4,'Data Input'!$A$3:$AX$41,3,FALSE)","v":"Joe Farrow"},{"$f":"+VLOOKUP(+$A4,'Data Input'!$A$3:$AX$41,4,FALSE)","v":"29 11"},{"$f":"+VLOOKUP(+$A4,'Data Input'!$A$3:$AX$41,5,FALSE)","v":-9},{"$f":"+VLOOKUP(+$A4,'Data Input'!$A$3:$AX$41,6,FALSE)","v":0},{"$f":"+VLOOKUP(+$A4,'Data Input'!$A$3:$AX$41,7,FALSE)","v":"A"},{"$f":"+VLOOKUP($A4,'Data Input'!$A$3:$AX$41,27,FALSE)","v":0},{"$f":"+VLOOKUP($A4,'Data Input'!$A$3:$AX$41,28,FALSE)","v":0},{"$f":"+VLOOKUP($A4,'Data Input'!$A$3:$AX$41,29,FALSE)","v":0},null,{"$f":"+VLOOKUP($A4,'Data Input'!$A$3:$AX$41,31,FALSE)","v":0},null,"SECOND"]
[{"$f":"'Data Input'!A5","v":13},{"$f":"+VLOOKUP(+$A5,'Data Input'!$A$3:$AX$41,2,FALSE)","v":"Ladybird"},{"$f":"+VLOOKUP(+$A5,'Data Input'!$A$3:$AX$41,3,FALSE)","v":"Ben Knight"},{"$f":"+VLOOKUP(+$A5,'Data Input'!$A$3:$AX$41,4,FALSE)","v":34},{"$f":"+VLOOKUP(+$A5,'Data Input'!$A$3:$AX$41,5,FALSE)","v":1},{"$f":"+VLOOKUP(+$A5,'Data Input'!$A$3:$AX$41,6,FALSE)","v":0},{"$f":"+VLOOKUP(+$A5,'Data Input'!$A$3:$AX$41,7,FALSE)","v":"A"},{"$f":"+VLOOKUP($A5,'Data Input'!$A$3:$AX$41,27,FALSE)","v":0},{"$f":"+VLOOKUP($A5,'Data Input'!$A$3:$AX$41,28,FALSE)","v":0},{"$f":"+VLOOKUP($A5,'Data Input'!$A$3:$AX$41,29,FALSE)","v":0},null,{"$f":"+VLOOKUP($A5,'Data Input'!$A$3:$AX$41,31,FALSE)","v":0},null,"THIRD"]
[{"$f":"'Data Input'!A6","v":15},{"$f":"+VLOOKUP(+$A6,'Data Input'!$A$3:$AX$41,2,FALSE)","v":"Pirate"},{"$f":"+VLOOKUP(+$A6,'Data Input'!$A$3:$AX$41,3,FALSE)","v":"Kevin Thomas"},{"$f":"+VLOOKUP(+$A6,'Data Input'!$A$3:$AX$41,4,FALSE)","v":29},{"$f":"+VLOOKUP(+$A6,'Data Input'!$A$3:$AX$41,5,FALSE)","v":-7},{"$f":"+VLOOKUP(+$A6,'Data Input'!$A$3:$AX$41,6,FALSE)","v":0},{"$f":"+VLOOKUP(+$A6,'Data Input'!$A$3:$AX$41,7,FALSE)","v":"A"},{"$f":"+VLOOKUP($A6,'Data Input'!$A$3:$AX$41,27,FALSE)","v":0},{"$f":"+VLOOKUP($A6,'Data Input'!$A$3:$AX$41,28,FALSE)","v":0},{"$f":"+VLOOKUP($A6,'Data Input'!$A$3:$AX$41,29,FALSE)","v":0},null,{"$f":"+VLOOKUP($A6,'Data Input'!$A$3:$AX$41,31,FALSE)","v":0},null,4]
{"$rows_left_out":37}
{"sheet":"Classes","index":4,"n_rows":42,"n_cols":15,"rows_kept":42,"cut":false,"hidden":false,"merged":[]}
[null,null,null,null,null,null,null,null,"Corrected",null,null,null,null,null,"Don’t use filters on this page"]
["No","Yacht","Skipper","Length","H/C","P","Class","H","M","S",null,"Pos"," ",null,"Sort will place into clases and then order.  You can then insert rows with Trophy Name before printing"]
[{"$f":"'Data Input'!A3","v":7},{"$f":"+VLOOKUP(+$A3,'Data Input'!$A$3:$AX$41,2,FALSE)","v":"Forester"},{"$f":"+VLOOKUP(+$A3,'Data Input'!$A$3:$AX$41,3,FALSE)","v":"Will Bentall"},{"$f":"+VLOOKUP(+$A3,'Data Input'!$A$3:$AX$41,4,FALSE)","v":"32 6"},{"$f":"+VLOOKUP(+$A3,'Data Input'!$A$3:$AX$41,5,FALSE)","v":-8},{"$f":"+VLOOKUP(+$A3,'Data Input'!$A$3:$AX$41,6,FALSE)","v":0},{"$f":"+VLOOKUP(+$A3,'Data Input'!$A$3:$AX$41,7,FALSE)","v":"A"},{"$f":"+VLOOKUP($A3,'Data Input'!$A$3:$AX$41,33,FALSE)","v":0},{"$f":"+VLOOKUP($A3,'Data Input'!$A$3:$AX$41,34,FALSE)","v":0},{"$f":"+VLOOKUP($A3,'Data Input'!$A$3:$AX$41,35,FALSE)","v":0},null,{"$f":"+VLOOKUP($A3,'Data Input'!$A$3:$AX$41,37,FALSE)","v":0},null,null,"Starlight Lady"]
[{"$f":"'Data Input'!A4","v":10},{"$f":"+VLOOKUP(+$A4,'Data Input'!$A$3:$AX$41,2,FALSE)","v":"Flight"},{"$f":"+VLOOKUP(+$A4,'Data Input'!$A$3:$AX$41,3,FALSE)","v":"Joe Farrow"},{"$f":"+VLOOKUP(+$A4,'Data Input'!$A$3:$AX$41,4,FALSE)","v":"29 11"},{"$f":"+VLOOKUP(+$A4,'Data Input'!$A$3:$AX$41,5,FALSE)","v":-9},{"$f":"+VLOOKUP(+$A4,'Data Input'!$A$3:$AX$41,6,FALSE)","v":0},{"$f":"+VLOOKUP(+$A4,'Data Input'!$A$3:$AX$41,7,FALSE)","v":"A"},{"$f":"+VLOOKUP($A4,'Data Input'!$A$3:$AX$41,33,FALSE)","v":0},{"$f":"+VLOOKUP($A4,'Data Input'!$A$3:$AX$41,34,FALSE)","v":0},{"$f":"+VLOOKUP($A4,'Data Input'!$A$3:$AX$41,35,FALSE)","v":0},null,{"$f":"+VLOOKUP($A4,'Data Input'!$A$3:$AX$41,37,FALSE)","v":0},null,null,"Jeckells"]
[{"$f":"'Data Input'!A5","v":13},{"$f":"+VLOOKUP(+$A5,'Data Input'!$A$3:$AX$41,2,FALSE)","v":"Ladybird"},{"$f":"+VLOOKUP(+$A5,'Data Input'!$A$3:$AX$41,3,FALSE)","v":"Ben Knight"},{"$f":"+VLOOKUP(+$A5,'Data Input'!$A$3:$AX$41,4,FALSE)","v":34},{"$f":"+VLOOKUP(+$A5,'Data Input'!$A$3:$AX$41,5,FALSE)","v":1},{"$f":"+VLOOKUP(+$A5,'Data Input'!$A$3:$AX$41,6,FALSE)","v":0},{"$f":"+VLOOKUP(+$A5,'Data Input'!$A$3:$AX$41,7,FALSE)","v":"A"},{"$f":"+VLOOKUP($A5,'Data Input'!$A$3:$AX$41,33,FALSE)","v":0},{"$f":"+VLOOKUP($A5,'Data Input'!$A$3:$AX$41,34,FALSE)","v":0},{"$f":"+VLOOKUP($A5,'Data Input'!$A$3:$AX$41,35,FALSE)","v":0},null,{"$f":"+VLOOKUP($A5,'Data Input'!$A$3:$AX$41,37,FALSE)","v":0},null,null,"Wilberforce Smith"]
[{"$f":"'Data Input'!A6","v":15},{"$f":"+VLOOKUP(+$A6,'Data Input'!$A$3:$AX$41,2,FALSE)","v":"Pirate"},{"$f":"+VLOOKUP(+$A6,'Data Input'!$A$3:$AX$41,3,FALSE)","v":"Kevin Thomas"},{"$f":"+VLOOKUP(+$A6,'Data Input'!$A$3:$AX$41,4,FALSE)","v":29},{"$f":"+VLOOKUP(+$A6,'Data Input'!$A$3:$AX$41,5,FALSE)","v":-7},{"$f":"+VLOOKUP(+$A6,'Data Input'!$A$3:$AX$41,6,FALSE)","v":0},{"$f":"+VLOOKUP(+$A6,'Data Input'!$A$3:$AX$41,7,FALSE)","v":"A"},{"$f":"+VLOOKUP($A6,'Data Input'!$A$3:$AX$41,33,FALSE)","v":0},{"$f":"+VLOOKUP($A6,'Data Input'!$A$3:$AX$41,34,FALSE)","v":0},{"$f":"+VLOOKUP($A6,'Data Input'!$A$3:$AX$41,35,FALSE)","v":0},null,{"$f":"+VLOOKUP($A6,'Data Input'!$A$3:$AX$41,37,FALSE)","v":0}]
{"$rows_left_out":37}
{"sheet":"Classes A","index":5,"n_rows":25,"n_cols":14,"rows_kept":25,"cut":false,"hidden":false,"merged":[]}
["Starlight Lady",null,null,null,null,null,null,null,"Corrected"]
["No","Yacht","Skipper","Length","H/C","P","Class","H","M","S",null,"Pos"," "]
[{"$f":"Classes!A3","v":7},{"$f":"+VLOOKUP(+$A3,'Data Input'!$A$3:$AX$41,2,FALSE)","v":"Forester"},{"$f":"+VLOOKUP(+$A3,'Data Input'!$A$3:$AX$41,3,FALSE)","v":"Will Bentall"},{"$f":"+VLOOKUP(+$A3,'Data Input'!$A$3:$AX$41,4,FALSE)","v":"32 6"},{"$f":"+VLOOKUP(+$A3,'Data Input'!$A$3:$AX$41,5,FALSE)","v":-8},{"$f":"+VLOOKUP(+$A3,'Data Input'!$A$3:$AX$41,6,FALSE)","v":0},{"$f":"+VLOOKUP(+$A3,'Data Input'!$A$3:$AX$41,7,FALSE)","v":"A"},{"$f":"+VLOOKUP($A3,'Data Input'!$A$3:$AX$41,33,FALSE)","v":0},{"$f":"+VLOOKUP($A3,'Data Input'!$A$3:$AX$41,34,FALSE)","v":0},{"$f":"+VLOOKUP($A3,'Data Input'!$A$3:$AX$41,35,FALSE)","v":0},null,{"$f":"+VLOOKUP($A3,'Data Input'!$A$3:$AX$41,37,FALSE)","v":0},null,"FIRST"]
[{"$f":"Classes!A4","v":10},{"$f":"+VLOOKUP(+$A4,'Data Input'!$A$3:$AX$41,2,FALSE)","v":"Flight"},{"$f":"+VLOOKUP(+$A4,'Data Input'!$A$3:$AX$41,3,FALSE)","v":"Joe Farrow"},{"$f":"+VLOOKUP(+$A4,'Data Input'!$A$3:$AX$41,4,FALSE)","v":"29 11"},{"$f":"+VLOOKUP(+$A4,'Data Input'!$A$3:$AX$41,5,FALSE)","v":-9},{"$f":"+VLOOKUP(+$A4,'Data Input'!$A$3:$AX$41,6,FALSE)","v":0},{"$f":"+VLOOKUP(+$A4,'Data Input'!$A$3:$AX$41,7,FALSE)","v":"A"},{"$f":"+VLOOKUP($A4,'Data Input'!$A$3:$AX$41,33,FALSE)","v":0},{"$f":"+VLOOKUP($A4,'Data Input'!$A$3:$AX$41,34,FALSE)","v":0},{"$f":"+VLOOKUP($A4,'Data Input'!$A$3:$AX$41,35,FALSE)","v":0},null,{"$f":"+VLOOKUP($A4,'Data Input'!$A$3:$AX$41,37,FALSE)","v":0},null,"SECOND"]
[{"$f":"Classes!A5","v":13},{"$f":"+VLOOKUP(+$A5,'Data Input'!$A$3:$AX$41,2,FALSE)","v":"Ladybird"},{"$f":"+VLOOKUP(+$A5,'Data Input'!$A$3:$AX$41,3,FALSE)","v":"Ben Knight"},{"$f":"+VLOOKUP(+$A5,'Data Input'!$A$3:$AX$41,4,FALSE)","v":34},{"$f":"+VLOOKUP(+$A5,'Data Input'!$A$3:$AX$41,5,FALSE)","v":1},{"$f":"+VLOOKUP(+$A5,'Data Input'!$A$3:$AX$41,6,FALSE)","v":0},{"$f":"+VLOOKUP(+$A5,'Data Input'!$A$3:$AX$41,7,FALSE)","v":"A"},{"$f":"+VLOOKUP($A5,'Data Input'!$A$3:$AX$41,33,FALSE)","v":0},{"$f":"+VLOOKUP($A5,'Data Input'!$A$3:$AX$41,34,FALSE)","v":0},{"$f":"+VLOOKUP($A5,'Data Input'!$A$3:$AX$41,35,FALSE)","v":0},null,{"$f":"+VLOOKUP($A5,'Data Input'!$A$3:$AX$41,37,FALSE)","v":0},null,"THIRD"]
[{"$f":"Classes!A6","v":15},{"$f":"+VLOOKUP(+$A6,'Data Input'!$A$3:$AX$41,2,FALSE)","v":"Pirate"},{"$f":"+VLOOKUP(+$A6,'Data Input'!$A$3:$AX$41,3,FALSE)","v":"Kevin Thomas"},{"$f":"+VLOOKUP(+$A6,'Data Input'!$A$3:$AX$41,4,FALSE)","v":29},{"$f":"+VLOOKUP(+$A6,'Data Input'!$A$3:$AX$41,5,FALSE)","v":-7},{"$f":"+VLOOKUP(+$A6,'Data Input'!$A$3:$AX$41,6,FALSE)","v":0},{"$f":"+VLOOKUP(+$A6,'Data Input'!$A$3:$AX$41,7,FALSE)","v":"A"},{"$f":"+VLOOKUP($A6,'Data Input'!$A$3:$AX$41,33,FALSE)","v":0},{"$f":"+VLOOKUP($A6,'Data Input'!$A$3:$AX$41,34,FALSE)","v":0},{"$f":"+VLOOKUP($A6,'Data Input'!$A$3:$AX$41,35,FALSE)","v":0},null,{"$f":"+VLOOKUP($A6,'Data Input'!$A$3:$AX$41,37,FALSE)","v":0},null,4]
{"$rows_left_out":20}
{"sheet":"Classes B","index":6,"n_rows":23,"n_cols":14,"rows_kept":23,"cut":false,"hidden":false,"merged":[]}
["Jeckells",null,null,null,null,null,null,null,"Corrected"]
["No","Yacht","Skipper","Length","H/C","P","Class","H","M","S",null,"Pos"," "]
[{"$f":"Classes!A3","v":7},{"$f":"+VLOOKUP(+$A3,'Data Input'!$A$3:$AX$41,2,FALSE)","v":"Forester"},{"$f":"+VLOOKUP(+$A3,'Data Input'!$A$3:$AX$41,3,FALSE)","v":"Will Bentall"},{"$f":"+VLOOKUP(+$A3,'Data Input'!$A$3:$AX$41,4,FALSE)","v":"32 6"},{"$f":"+VLOOKUP(+$A3,'Data Input'!$A$3:$AX$41,5,FALSE)","v":-8},{"$f":"+VLOOKUP(+$A3,'Data Input'!$A$3:$AX$41,6,FALSE)","v":0},{"$f":"+VLOOKUP(+$A3,'Data Input'!$A$3:$AX$41,7,FALSE)","v":"A"},{"$f":"+VLOOKUP($A3,'Data Input'!$A$3:$AX$41,33,FALSE)","v":0},{"$f":"+VLOOKUP($A3,'Data Input'!$A$3:$AX$41,34,FALSE)","v":0},{"$f":"+VLOOKUP($A3,'Data Input'!$A$3:$AX$41,35,FALSE)","v":0},null,{"$f":"+VLOOKUP($A3,'Data Input'!$A$3:$AX$41,37,FALSE)","v":0},null,"FIRST"]
[{"$f":"Classes!A4","v":10},{"$f":"+VLOOKUP(+$A4,'Data Input'!$A$3:$AX$41,2,FALSE)","v":"Flight"},{"$f":"+VLOOKUP(+$A4,'Data Input'!$A$3:$AX$41,3,FALSE)","v":"Joe Farrow"},{"$f":"+VLOOKUP(+$A4,'Data Input'!$A$3:$AX$41,4,FALSE)","v":"29 11"},{"$f":"+VLOOKUP(+$A4,'Data Input'!$A$3:$AX$41,5,FALSE)","v":-9},{"$f":"+VLOOKUP(+$A4,'Data Input'!$A$3:$AX$41,6,FALSE)","v":0},{"$f":"+VLOOKUP(+$A4,'Data Input'!$A$3:$AX$41,7,FALSE)","v":"A"},{"$f":"+VLOOKUP($A4,'Data Input'!$A$3:$AX$41,33,FALSE)","v":0},{"$f":"+VLOOKUP($A4,'Data Input'!$A$3:$AX$41,34,FALSE)","v":0},{"$f":"+VLOOKUP($A4,'Data Input'!$A$3:$AX$41,35,FALSE)","v":0},null,{"$f":"+VLOOKUP($A4,'Data Input'!$A$3:$AX$41,37,FALSE)","v":0},null,"SECOND"]
[{"$f":"Classes!A5","v":13},{"$f":"+VLOOKUP(+$A5,'Data Input'!$A$3:$AX$41,2,FALSE)","v":"Ladybird"},{"$f":"+VLOOKUP(+$A5,'Data Input'!$A$3:$AX$41,3,FALSE)","v":"Ben Knight"},{"$f":"+VLOOKUP(+$A5,'Data Input'!$A$3:$AX$41,4,FALSE)","v":34},{"$f":"+VLOOKUP(+$A5,'Data Input'!$A$3:$AX$41,5,FALSE)","v":1},{"$f":"+VLOOKUP(+$A5,'Data Input'!$A$3:$AX$41,6,FALSE)","v":0},{"$f":"+VLOOKUP(+$A5,'Data Input'!$A$3:$AX$41,7,FALSE)","v":"A"},{"$f":"+VLOOKUP($A5,'Data Input'!$A$3:$AX$41,33,FALSE)","v":0},{"$f":"+VLOOKUP($A5,'Data Input'!$A$3:$AX$41,34,FALSE)","v":0},{"$f":"+VLOOKUP($A5,'Data Input'!$A$3:$AX$41,35,FALSE)","v":0},null,{"$f":"+VLOOKUP($A5,'Data Input'!$A$3:$AX$41,37,FALSE)","v":0},null,"THIRD"]
[{"$f":"Classes!A6","v":15},{"$f":"+VLOOKUP(+$A6,'Data Input'!$A$3:$AX$41,2,FALSE)","v":"Pirate"},{"$f":"+VLOOKUP(+$A6,'Data Input'!$A$3:$AX$41,3,FALSE)","v":"Kevin Thomas"},{"$f":"+VLOOKUP(+$A6,'Data Input'!$A$3:$AX$41,4,FALSE)","v":29},{"$f":"+VLOOKUP(+$A6,'Data Input'!$A$3:$AX$41,5,FALSE)","v":-7},{"$f":"+VLOOKUP(+$A6,'Data Input'!$A$3:$AX$41,6,FALSE)","v":0},{"$f":"+VLOOKUP(+$A6,'Data Input'!$A$3:$AX$41,7,FALSE)","v":"A"},{"$f":"+VLOOKUP($A6,'Data Input'!$A$3:$AX$41,33,FALSE)","v":0},{"$f":"+VLOOKUP($A6,'Data Input'!$A$3:$AX$41,34,FALSE)","v":0},{"$f":"+VLOOKUP($A6,'Data Input'!$A$3:$AX$41,35,FALSE)","v":0},null,{"$f":"+VLOOKUP($A6,'Data Input'!$A$3:$AX$41,37,FALSE)","v":0},null,4]
{"$rows_left_out":18}
{"sheet":"Classes C","index":7,"n_rows":15,"n_cols":14,"rows_kept":15,"cut":false,"hidden":false,"merged":[]}
["Wilberforce Smith",null,null,null,null,null,null,null,"Corrected"]
["No","Yacht","Skipper","Length","H/C","P","Class","H","M","S",null,"Pos"," "]
[{"$f":"'Data Input'!A3","v":7},{"$f":"+VLOOKUP(+$A3,'Data Input'!$A$3:$AX$41,2,FALSE)","v":"Forester"},{"$f":"+VLOOKUP(+$A3,'Data Input'!$A$3:$AX$41,3,FALSE)","v":"Will Bentall"},{"$f":"+VLOOKUP(+$A3,'Data Input'!$A$3:$AX$41,4,FALSE)","v":"32 6"},{"$f":"+VLOOKUP(+$A3,'Data Input'!$A$3:$AX$41,5,FALSE)","v":-8},{"$f":"+VLOOKUP(+$A3,'Data Input'!$A$3:$AX$41,6,FALSE)","v":0},{"$f":"+VLOOKUP(+$A3,'Data Input'!$A$3:$AX$41,7,FALSE)","v":"A"},{"$f":"+VLOOKUP($A3,'Data Input'!$A$3:$AX$41,33,FALSE)","v":0},{"$f":"+VLOOKUP($A3,'Data Input'!$A$3:$AX$41,34,FALSE)","v":0},{"$f":"+VLOOKUP($A3,'Data Input'!$A$3:$AX$41,35,FALSE)","v":0},null,{"$f":"+VLOOKUP($A3,'Data Input'!$A$3:$AX$41,37,FALSE)","v":0},null,"FIRST"]
[{"$f":"'Data Input'!A4","v":10},{"$f":"+VLOOKUP(+$A4,'Data Input'!$A$3:$AX$41,2,FALSE)","v":"Flight"},{"$f":"+VLOOKUP(+$A4,'Data Input'!$A$3:$AX$41,3,FALSE)","v":"Joe Farrow"},{"$f":"+VLOOKUP(+$A4,'Data Input'!$A$3:$AX$41,4,FALSE)","v":"29 11"},{"$f":"+VLOOKUP(+$A4,'Data Input'!$A$3:$AX$41,5,FALSE)","v":-9},{"$f":"+VLOOKUP(+$A4,'Data Input'!$A$3:$AX$41,6,FALSE)","v":0},{"$f":"+VLOOKUP(+$A4,'Data Input'!$A$3:$AX$41,7,FALSE)","v":"A"},{"$f":"+VLOOKUP($A4,'Data Input'!$A$3:$AX$41,33,FALSE)","v":0},{"$f":"+VLOOKUP($A4,'Data Input'!$A$3:$AX$41,34,FALSE)","v":0},{"$f":"+VLOOKUP($A4,'Data Input'!$A$3:$AX$41,35,FALSE)","v":0},null,{"$f":"+VLOOKUP($A4,'Data Input'!$A$3:$AX$41,37,FALSE)","v":0},null,"SECOND"]
[{"$f":"'Data Input'!A5","v":13},{"$f":"+VLOOKUP(+$A5,'Data Input'!$A$3:$AX$41,2,FALSE)","v":"Ladybird"},{"$f":"+VLOOKUP(+$A5,'Data Input'!$A$3:$AX$41,3,FALSE)","v":"Ben Knight"},{"$f":"+VLOOKUP(+$A5,'Data Input'!$A$3:$AX$41,4,FALSE)","v":34},{"$f":"+VLOOKUP(+$A5,'Data Input'!$A$3:$AX$41,5,FALSE)","v":1},{"$f":"+VLOOKUP(+$A5,'Data Input'!$A$3:$AX$41,6,FALSE)","v":0},{"$f":"+VLOOKUP(+$A5,'Data Input'!$A$3:$AX$41,7,FALSE)","v":"A"},{"$f":"+VLOOKUP($A5,'Data Input'!$A$3:$AX$41,33,FALSE)","v":0},{"$f":"+VLOOKUP($A5,'Data Input'!$A$3:$AX$41,34,FALSE)","v":0},{"$f":"+VLOOKUP($A5,'Data Input'!$A$3:$AX$41,35,FALSE)","v":0},null,{"$f":"+VLOOKUP($A5,'Data Input'!$A$3:$AX$41,37,FALSE)","v":0},null,"THIRD"]
[{"$f":"'Data Input'!A6","v":15},{"$f":"+VLOOKUP(+$A6,'Data Input'!$A$3:$AX$41,2,FALSE)","v":"Pirate"},{"$f":"+VLOOKUP(+$A6,'Data Input'!$A$3:$AX$41,3,FALSE)","v":"Kevin Thomas"},{"$f":"+VLOOKUP(+$A6,'Data Input'!$A$3:$AX$41,4,FALSE)","v":29},{"$f":"+VLOOKUP(+$A6,'Data Input'!$A$3:$AX$41,5,FALSE)","v":-7},{"$f":"+VLOOKUP(+$A6,'Data Input'!$A$3:$AX$41,6,FALSE)","v":0},{"$f":"+VLOOKUP(+$A6,'Data Input'!$A$3:$AX$41,7,FALSE)","v":"A"},{"$f":"+VLOOKUP($A6,'Data Input'!$A$3:$AX$41,33,FALSE)","v":0},{"$f":"+VLOOKUP($A6,'Data Input'!$A$3:$AX$41,34,FALSE)","v":0},{"$f":"+VLOOKUP($A6,'Data Input'!$A$3:$AX$41,35,FALSE)","v":0},null,{"$f":"+VLOOKUP($A6,'Data Input'!$A$3:$AX$41,37,FALSE)","v":0},null,4]
{"$rows_left_out":9}